##TITLE=G5 - FeHbpa $$ Begin of the data block
##JCAMP-DX=5.00 $$ ACD/SpecManager v 10.08
##SPECTROMETER/DATA SYSTEM=Alpha
##DATE=14 May 2015 09:49:14
##DATA TYPE=INFRARED SPECTRUM
##DATA CLASS=XYDATA
##ORIGIN=
##OWNER=
##NPOINTS=1765
##FIRSTX=399.76428223
##LASTX=3997.64306641
##MAXX=3997.64306641
##MINX=399.76428223
##MAXY=1.00319290
##MINY=0.38981816
##XFACTOR=1.0000000000
##YFACTOR=0.000000010000000
##FIRSTY=1.00000000
##DELTAX=2.03961372
##XUNITS=1/CM
##YUNITS=ARBITRARY UNITS
##XYDATA=(X++(Y..Y))
399.8A00000000j85329m35620l77977j12850k81214p80195j048476j127821j454914
418.1I4195604j301968Q8704J355570J675445J287556R96870P66784K59733j45340
436.5I9178958j5491J16950k27523n82558n76997o85471j099646j201797o18445n9224
456.9I4228756j75577n87469q15285j081258j448685j285612k60162P90393Q07416
475.2I0172517J32692m43077q48478j152051j004916k37864O63650J279956J554394
493.6I0116823J368010M72551r02408j904559j753289r02867m95094o30021o35666
511.9H4733480l73006j4895Q78441K294451K985812K505201J733464J228136P45660
530.3I6716744J77043q6361K2900j1831l56245n66912m59337l86435m12810j46705
$$ plain form
399.8 100000000 99814671 99379051 99001074 98888224 98607010 97826815 96778339 95650518 94195604
418.1 94195604 92893636 92982340 94337910 96013355 97300911 98297781 99064565 99324298 99178958
436.5 99178958 99163467 99280417 99052894 98470336 97893339 97207868 96108222 94906425 94287980 94228756
456.9 94228756 94053179 93465710 92650425 91569167 90120482 88834870 88574708 89365101 90172517
475.2 90172517 90305209 89862132 89013654 87861603 86856687 86618823 87282473 88562429 90116823
493.6 90116823 91484833 91957384 91054976 89150417 87397128 86494261 85999167 85369146 84733480
511.9 84733480 84360474 84345579 85224020 87518471 90504283 93009484 94742948 95971084 96716744
530.3 96716744 96893787 96807426 96830326 96818495 96462250 95895338 95436001 95049566 94636756 94490051
550.7I4490051L58671N17220K27195M2671J68997J57827j41722k76035r6190o8736
571.1I5379949l45719m69464l30699l80009p14481q89433q58140j099300j669001k050049
591.5H6573654j945364j619828j215178n06091M24218J019872J067763Q72034M72880
609.8H5143960m98158j701004j995974r46105N25510J470346J875198J794189J311040
628.2H6979002J046079J433557J783908J128810l24273j413411j504820r34094r3621
646.6H8101137R04196J825005K233016J953960J403904J075745P68429L03727L4499
664.9I8603618J17481K12651n1409j44231L3510Q2767j52415k21491L63N9522j75780
687.3I8364586k78044r7078m2260k53862l29530j53590j38252l88867n14031m29630
$$ plain form
550.7 94490051 94848722 95365942 95593137 95635808 95804805 95962632 95820910 95544875 95448685 95379949
571.1 95379949 95034230 94564766 94234067 93854058 93139577 92250144 91392004 90292704 88623703 86573654
591.5 86573654 84628290 83008462 81793284 81287193 81711411 82731283 83799046 84671080 85143960
609.8 85143960 84645802 82944798 80948824 80002719 80528229 81998575 83873773 85667962 86979002
628.2 86979002 88025081 89458638 91242546 92371356 92047083 90633672 89128852 88194758 88101137
646.6 88101137 89005333 90830338 93063354 95017314 96421218 97496963 98265392 98569119 98603618
664.9 98603618 98721099 98933750 98882341 98738110 98771620 98854387 98701972 98480481 98480844 98540366 98364586
687.3 98364586 98086542 97989464 97947204 97693342 97363812 97210222 97071970 96683103 96169072 95739442
707.7I5739442n59825j060026j545585j741230j797301j823443j707554j532221j471942
726.1H2500315j243139l59726J081115K254171K408397J588136K60418j362919l235555
744.5H3891213n077922o424296o783074n830604l788561j434934M72057J695555K406943
762.8E9126377K865732L123200L092044K804369K446097K192939K181261K448517K880967
781.2H3161503L242934L191787K653676J998049J494897J085758P83223P11006P34526
799.5I9057359N63275K43640P7611N8115n1677l60692n48100n66024n70714m85623
819.9I7417170j57505J81317J74212q3756k26826k10148k85995m90576n96070n78368
840.3I5143455o64812q79228r50945p56192m80419k52277n942K20441K07776j52474
$$ plain form
707.7 95739442 95179617 94119591 92574006 90832776 89035475 87212032 85504478 83972257 82500315
726.1 82500315 81257176 80897450 81978565 84232736 86641133 88229269 88489687 87126768 83891213
744.5 83891213 78813291 72388995 65605921 59775317 55986756 54551822 55023879 56719434 59126377
762.8 59126377 61992109 65115309 68207353 71011722 73457819 75650758 77832019 80280536 83161503
781.2 83161503 86404437 89596224 92249900 94247949 95742846 96828604 97611827 98322833 99057359
799.5 99057359 99620634 99864274 99941885 100000000 99948323 99587631 99039531 98473507 97902793 97417170
819.9 97417170 97259665 97440982 97615194 97531438 97304612 97094464 96808469 96317893 95721823 95143455
840.3 95143455 94478643 93599415 92648470 91892278 91411859 91159582 91153640 91374081 91581857 91429383
860.7I1429383p56371j622653k985985m649263n459792m295331j735681N49507J921719
879.1G2395533K859009L518074L499520K739436J759308R68957L11625l01188p56455
897.4H6993819r68235r13018n21773J67578Q66550J267225J335502J214695R63318
915.8I0405661O11734L36099K92289L46357K47752J7769j36811k02566l17174m61776
936.2I1139334n02002m34041l38471j30564L53986R84001J372070J349055J090390
954.5I4883758P72673M24021J11395l2240l6084p5847j70499j66667n4127p331q1653
977I5567399j46514j42580j72496l00169m47118n70107p48914r84443j142489j196140
997.4H9716429j290626j477068j609141j583582j461715j264620q53288k37846J39904
$$ plain form
860.7 91429383 90673012 89050359 86064374 81415111 75955319 71659988 69924307 70473814 72395533
879.1 72395533 75254542 78772616 82272136 85011572 86770880 87739837 88051462 87750274 86993819
897.4 86993819 86025584 85112566 84590793 84758371 85624921 86892146 88227648 89442343 90405661
915.8 90405661 91017395 91353494 91645783 91992140 92239892 92257661 92120850 91918284 91601110 91139334
936.2 91139334 90637332 90203291 89864820 89734256 90088242 91072243 92444313 93793368 94883758
954.5 94883758 95656431 96080452 96191847 96159607 96123523 96047676 95877177 95710510 95656383 95649052 95567399
977 95567399 95420885 95278305 95105809 94805640 94358522 93788415 93039501 92055058 90912569 89716429
997.4 89716429 88425803 86948735 85339594 83756012 82294297 81029677 80176389 79938543 80078447
1015.7H0078447j19776o50519m99266Q70257K629441L032357J551914m07386j411336
1034.1H5074133j265335n21166J94175L31908m16642j616544k063757q76546J336336
1052.4H0176562K924925K884156J631140K78074m09490m00245r5755J63811L08145
1070.8H7461323L59755K76220N7185j91498m01276o12820q40103r85801r82219q97080
1091.2H3243686p92772o27094l98976k33298j78331R775O23846J493853K070958K100807
1111.6H7312454J805252J444435J078474P20799M56554K98149J51574L3105K5308N2333
1132I3378437j8537j64038k91038m59176q38077j399321j801699j734954j288355p61342
1152.4H4621900k05922N15211J300323J832294J964510J760900J314342P71808L34609
$$ plain form
1015.7 80078447 79958671 79308152 78808886 79679143 82308584 85340941 86892855 86485469 85074133
1034.1 85074133 83808798 83287632 83481807 83813715 83397073 81780529 79716772 78840226 80176562
1052.4 80176562 83101487 85985643 87616783 87894857 87485367 87085122 86989367 87153178 87461323
1070.8 87461323 87821078 88097298 88154483 87962985 87561709 86948889 86108786 85122985 84140766 83243686
1091.2 83243686 82450914 81823820 81424844 81191546 81013215 81022990 81646836 83140689 85211647 87312454
1111.6 87312454 89117706 90562141 91640615 92361414 92817968 93116117 93267691 93300796 93326104 93378437
1132 93378437 93359900 93195862 92904824 92445648 91607571 90208250 88406551 86671597 85383242 84621900
1152.4 84621900 84415978 84931189 86231512 88063806 90028316 91789216 93103558 93875366 94209975
1170.7I4209975O3151j54507l74562n15383n66530o62685q68845j087761j209819j175511
1191.1H7657523q64118j90562N93626J000542Q43686M17316M5889k37506m92257o59460
1211.5H8114679o83254o28299n61350m97157n24032p60656j113785j291853j162243
1229.9H0892050q98260p12788o50066o88559q69792j214928j646191k086359k530837
1248.2F9594270k933413l146326l081638k798647k471971k441019l087288m116818
1264.6D5517150m186020k349314L80713K103844K261213J852601J805297K097708K235860
1282.9E1719052J951366J504421J485080K195984L276450M134219M525072M464286
1299.2G5255930M017640L367680K742445K137798J441646Q49676O66022P63357P18677
$$ plain form
1170.7 94209975 94273126 94118619 93744057 93228674 92662144 91999459 91130614 90042853 88833034 87657523
1191.1 87657523 86793405 86602843 87196469 88197011 89040697 89458013 89503902 89266396 88774139 88114679
1211.5 88114679 87431425 86803126 86241776 85744619 85220587 84459931 83346146 82054293 80892050
1229.9 80892050 79993790 79281002 78630936 77942377 77072585 75857657 74211466 72125107 69594270
1248.2 69594270 66660857 63514531 60432893 57634246 55162275 52721256 49633968 45517150
1264.6 45517150 41331130 38981816 39362529 41466373 43727586 45580187 47385484 49483192 51719052
1282.9 51719052 53670418 55174839 56659919 58855903 62132353 66266572 70791644 75255930
1299.2 75255930 79273570 82641250 85383695 87521493 88963139 89812815 90478837 91242194 91960871
1317.6I1960871L75557o0302l36069l48580p6526L53670O78587P27964O05034N00387
1338I4380593M21548K65730R8186L1489l081j12599k54685l21996l53253m29988n11056
1360.4I3210888m77457l26622k59667k91395k85489k80702l43388l36218k17176r9069
1380.8I0293705k7829R3031K76214L00455J09088j20365k50507k57468k89869l67838
1401.2H9758617m34214n25189o45256q37493j056802j197410j328974j666397k054245
1419.6H0012637j833033j590491j540350j394511j344067j316756j368820k011276
1435.9F7613333k784723k745807k648663k521569k209490j690102n75858P97349K165615
1454.3E5400085M565287O669790M878878K733916P40665j868599l869736n923337q521503
$$ plain form
1317.6 91960871 92336428 92276126 91940057 91591477 91514951 91868621 92547208 93275172 93880206 94380593
1338 94380593 94802141 95067871 95166057 95197546 95194465 95081866 94827181 94505185 94151932 93721944 93210888
1360.4 93210888 92733431 92406809 92147142 91855747 91570258 91289556 90946168 90609950 90392774 90293705
1380.8 90293705 90265876 90358907 90635121 90935576 91044664 90924299 90673792 90416324 90126455 89758617
1401.2 89758617 89324403 88799214 88153958 87316465 86259663 85062253 83733279 82066882 80012637
1419.6 80012637 78179604 76589113 75048763 73654252 72310185 70993429 69624609 67613333
1435.9 67613333 64828610 62082803 59434140 56912571 54703081 53012979 52437121 53234470 55400085
1454.3 55400085 59965372 66635162 71514040 74247956 74988621 73120022 69250286 63326949 54805446
1472.6E4805446p110444j956868K169028M566574N244875M744363M752457O124937
1488.9G3340368P153118N780357M318941L547436K258432J048749M62371K94769L68500
1507.3I8573041L63672K80553K69663K28960J52504O2281L4362L4964m1664j05244
1527.7I9853092r8264j23822k36023k42519k24227k98721l05825k65569k84499l75503
1548.1I7398120n48565o92088p87717j003229k200503l542846k762479k701407k731222
1566.4H0428064j647955P01809K836418L606778K927947N09024j336277k581435l856933
1584.8H1587440n212128o287367o002628l335351R75120M216236M068434R81355k346593
1603.2F8644518k950323l77548L416175N752534N531138M319811K930665J293736M54814
$$ plain form
1472.6 54805446 47695002 45738134 47907162 52473736 57718611 62462974 67215431 73340368
1488.9 73340368 80493486 86273843 90592784 94140220 96398652 97447401 97909772 98204541 98573041
1507.3 98573041 98936713 99217266 99486929 99715889 99868393 99930674 99965036 100000000 99958336 99853092
1527.7 99853092 99754828 99631006 99394983 99152464 98928237 98629516 98323691 98058122 97773623 97398120
1548.1 97398120 96849555 96157467 95369750 94366521 92166018 88623172 85860693 83159286 80428064
1566.4 80428064 78780109 79481918 82318336 85925114 88853061 89362085 88025808 85444373 81587440
1584.8 81587440 76375312 70087945 64085317 60749966 61725086 65941322 70009756 70991111 68644518
1603.2 68644518 65694195 65316647 68732822 74485356 80016494 84336305 87266970 88560706 89015520
1621.5H9015520K37780J43594J04499J44958J81651J76281K30825L32737L60662L48735
1641.9I1277242L24112M09603N46503M39996M13644O52563N81962M33976L85064L99625
1662.3I5864290M19742L31879K60561K96617L18628L01379K74152K19226J83594J56522
1682.7I8626590J73074J98751J94067J85728J14775L4070L5137O8915P5859P1060P0989
1705.1I9849015R0176N8496K313l755r233l1352m840M3637M4870Q738l8183l8194j2189
1731.7I9959499k7788j4120K7501L7784J7124j7339k0778J1080P344j3954J55K5165
1756.1I9991673K2680l1096n6326k677q130r0927j26868p7140j3727k8652n9021k6983
1780.6I9492806M101l3724n3448j5354o312k8312m584M2927N0557J0210q607L0500
$$ plain form
1621.5 89015520 89253300 89396894 89501393 89646351 89828002 90004283 90235108 90567845 90928507 91277242
1641.9 91277242 91601354 92010957 92557460 92997456 93411100 94063663 94645625 95079601 95464665 95864290
1662.3 95864290 96284032 96615911 96876472 97173089 97491717 97793096 98067248 98286474 98470068 98626590
1682.7 98626590 98799664 98998415 99192482 99378210 99492985 99527055 99562192 99631107 99706966 99778026 99849015
1705.1 99849015 99939191 99997687 100000000 99996245 99987012 99955660 99950820 99994457 100039327 100048065 100009882 99971688 99959499
1731.7 99959499 99931711 99917591 99945092 99982876 100000000 99982661 99961883 99972963 99980307 99966353 99966508 99991673
1756.1 99991673 100014353 99983257 99926931 99924254 99916124 99825197 99698329 99621189 99607462 99578810 99519789 99492806
1780.6 99492806 99496907 99463183 99409735 99394381 99388069 99359757 99355173 99398100 99448657 99458867 99450260 99480760
1805.1I9480760N6458J6152k2071J9705O4260L1799j4621j138K3853M18l9930k9397
1829.6I9586248K6817J4805n5831n9921j2791l8046j14381q3935K163n924o4469p3540
1854I9121195l1549k4247o1291o3640k1839k6483q6558p4261L314Q863n0604p2306
1878.5I8620594l0476j0103m9258p4404m4417q667k7794n4657j8150J8603j2988m9508
1903I8258775k5719N531j6349m2719j5175J2797j9091n4980k7895J7941J6868k0545
1927.5I8089439j6839K7436K4647j9097j6296K3555K2054p397P844N1499M6378j1241
1951.9I8221982l2437P707K2047k0784l7819l314O455l0649m2152j830J8412k0289
1976.4I8087329m7744j4102J3310k4498o2865l3259L540j7607l9476p397K5421l695
$$ plain form
1805.1 99480760 99537218 99553370 99531299 99551004 99615264 99647063 99632442 99631304 99655157 99655575 99615645 99586248
1829.6 99586248 99613065 99627870 99572039 99512118 99499327 99461281 99346900 99262965 99265128 99259204 99194735 99121195
1854 99121195 99089646 99065399 99004108 98940468 98918629 98892146 98805588 98731327 98734641 98743504 98692900 98620594
1878.5 98620594 98590118 98580015 98530757 98456353 98411936 98403269 98375475 98320818 98302668 98321271 98308283 98258775
1903 98258775 98233056 98238587 98222238 98179519 98164344 98177141 98158050 98103070 98075175 98093116 98109984 98089439
1927.5 98089439 98072600 98100036 98124683 98105586 98089290 98112845 98134899 98127502 98135346 98186845 98233223 98221982
1951.9 98221982 98189545 98197252 98219299 98198515 98160696 98157382 98163837 98133188 98091036 98089206 98107618 98087329
1976.4 98087329 98039585 98025483 98038793 98014295 97951430 97918171 97921711 97904104 97864628 97857231 97882652 97878957
2000.9I7878957m4894k0260K4199M906l7289k0802J4603j2636o9386p1162m9364n1296
2025.4I7545576k1797L8665O1590K4390l5513l8194J0884J3995l5370m3153K396J0508
2049.8I7533977l7193n0104k634J3399k9046m2027L767K2954k1333m2063L964L2276
2074.3I7385937l767k4509J7380M2379J07k9778O467L7450K807l3665n132K8015k253
2100.8I7421438l9131j3971K2071J163l1317p260K9344M786m0930k7758J2171j663
2125.3I7328943m1097k8885Q941k653m2873l5662M071k366m0108l0911J1742J2720
2149.8I7141862k2131j8096K4354L3838Q309R834M1300M0877L153j484L6556M5049
2174.3I7343421R948p343J4239K4057n621k6494l273J4705j1480l4678j7011N36j9717
$$ plain form
2000.9 97878957 97834063 97813803 97838002 97842908 97805619 97784817 97799420 97786784 97717398 97646236 97596872 97545576
2025.4 97545576 97523779 97562444 97624034 97648424 97612911 97574717 97585601 97599596 97564226 97521073 97523469 97533977
2049.8 97533977 97496784 97446680 97444046 97457445 97428399 97386372 97390139 97413093 97391760 97349697 97353661 97385937
2074.3 97385937 97382170 97357661 97375041 97417420 97417527 97387749 97394216 97431666 97434473 97400808 97395676 97423691 97421438
2100.8 97421438 97382307 97368336 97390407 97391570 97360253 97352993 97382337 97387123 97346193 97318435 97330606 97328943
2125.3 97328943 97287846 97258961 97267902 97265249 97222376 97186714 97190785 97188419 97148311 97117400 97129142 97141862
2149.8 97141862 97119731 97101635 97125989 97159827 97168136 97177970 97219270 97260147 97263300 97261816 97298372 97343421
2174.3 97343421 97353369 97346026 97360265 97384322 97378701 97352207 97348934 97363639 97352159 97317481 97300470 97301006 97281289
2200.8I7281289m1938k7919q070k0462l7152j6081J7810J6677n209j192K2333J8943
2225.2I7199029q589r990J2225P093k2346k5302q47J789k4104l2467j2082o706l0916
2251.8I7046787l8970j0854Q637m393j0973J3274L3247J9050K295J7392L4320J8561
2276.2I7128373j311Q792K2888L040k6888k6202j4430k9320n4771n2058l2240l7671
2300.7I6888202o0439n5033k6363j7768l0708k6876k563j430l4458m7743j2684J1426
2325.2I6583563j2624l6216j7071Q101m346k2053j5426j1903j7190J2577N9229M8160
2349.7I6574801k8765j02365p6324j0729j0442j8537J8632M4537K7960J3507L7676
2372.1I6469951O4665N1045K8157M1396N9342L4821l332j716K2870J8609n240l975
$$ plain form
2200.8 97281289 97239351 97211432 97203362 97182900 97145748 97129667 97147477 97164154 97158945 97157753 97180086 97199029
2225.2 97199029 97190440 97180450 97192675 97199768 97177422 97152120 97151273 97153062 97128958 97096491 97084409 97077703 97046787
2251.8 97046787 97007817 96996963 97005600 97001207 96990234 97003508 97036755 97055805 97058100 97075492 97109812 97128373
2276.2 97128373 97127062 97135854 97158742 97161782 97134894 97108692 97094262 97064942 97010171 96958113 96925873 96888202
2300.7 96888202 96827763 96772730 96746367 96728599 96697891 96671015 96668452 96667022 96632564 96584821 96572137 96583563
2325.2 96583563 96570939 96534723 96517652 96525753 96521407 96499354 96483928 96472025 96454835 96467412 96526641 96574801
2349.7 96574801 96546036 96443671 96367347 96356618 96346176 96327639 96346271 96390808 96418768 96432275 96469951
2372.1 96469951 96534616 96585661 96613818 96655214 96714556 96749377 96746045 96744329 96767199 96785808 96780568 96776593
2396.6I6776593J3542N829k0480k1493R71k86k7954l4255j1969p194l2365m1044j5146
2423.1I6584749O02j5092k1982j472J967l0178m6718k3460n025j7929k4951k181R691
2449.6I6408021j4257l4183k1053r697l1311n1772l5912j0842j4782k3580J568K7913
2474.1I6190113J4168j0377q655J532j3489l8451l7300k2251k7006m2540l7402j8531
2498.5I5949811j7798l2556k9403o932N12j3506j8650o295n388k3502k9969j7172j4478
2525.1I5734674l2032m3803l3939k7108m2951n4992m2128l2640m6843n4598l6770k1100
2549.5I5265770k5004k8604j2851P790O122n979J79J3387M429j9205k3228q827j1069
2576I5162910k8425k3914l81M983o616j79K1845K4509P880L696J8269K0045J823l755
$$ plain form
2396.6 96776593 96790135 96795964 96775484 96753991 96754962 96754676 96726722 96692467 96680498 96673304 96640939 96599895 96584749
2423.1 96584749 96585351 96570259 96548277 96546805 96548772 96518594 96471876 96448416 96443391 96425462 96400511 96398330 96408021
2449.6 96408021 96393764 96359581 96338528 96328831 96297520 96245748 96209836 96198994 96184212 96160632 96162200 96190113
2474.1 96190113 96204281 96193904 96185249 96186781 96173292 96134841 96097541 96075290 96048284 96005744 95968342 95949811
2498.5 95949811 95932013 95899457 95870054 95863122 95863634 95850128 95831478 95825183 95819795 95796293 95766324 95749152 95734674
2525.1 95734674 95702642 95658839 95624900 95597792 95554841 95499849 95457721 95425081 95378238 95323640 95286870 95265770
2549.5 95265770 95240766 95212162 95199311 95207101 95213223 95207244 95207423 95220810 95225239 95206034 95182806 95173979 95162910
2576 95162910 95134485 95110571 95110190 95115173 95108557 95108378 95130223 95154732 95162612 95166308 95184577 95204622 95206445 95202690
2604.6I5202690Q124R215o508j3906o56O098j0026j7404M82J2970j621k0498j6093
2631.1I5152867r197k6441m2188l3462k3639l3367m5395l9267k9707l8392n4276n0848
2655.6I4726688l3701l3706m6748m1354k3216k7197m5491m0692k1416k3919m3815n1028
2680.1I4294405m5908n3584p4047p9095o5106o1673p7856q6039p7373p9030r6232r7727
2704.5I3400735p4530o0189p0011p4011n4193m0978n2029n4991l5930k5249m5329o8343
2729I2744952o1500m9489n9617p2294o5136n1874n1600n1087l7658l0309m5407o2162
2753.5I2106819n1778l1335l5220m9621m4280l4952m8715o4874n4461m3225o9898j11491
2778I1466969j21271j12069j23143j39833j33145j28752j44547j49631j28323j08945
$$ plain form
2604.6 95202690 95210814 95220029 95213521 95199615 95198959 95205057 95195031 95177627 95178109 95191079 95189458 95168960 95152867
2631.1 95152867 95143670 95117229 95075041 95041579 95017940 94984573 94939178 94899911 94870204 94831812 94777536 94726688
2655.6 94726688 94692987 94659281 94612533 94571179 94547963 94520766 94475275 94434583 94413167 94389248 94345433 94294405
2680.1 94294405 94248497 94194913 94120866 94041771 93976665 93914992 93837136 93751097 93673724 93594694 93498462 93400735
2704.5 93400735 93326205 93266016 93196005 93121994 93067801 93026823 92974794 92919803 92883873 92858624 92813295 92744952
2729 92744952 92683452 92633963 92574346 92502052 92436916 92385042 92333442 92282355 92244697 92214388 92168981 92106819
2753.5 92106819 92055041 92023706 91988486 91938865 91894585 91859633 91810918 91746044 91691583 91648358 91578460 91466969
2778 91466969 91345698 91233629 91110486 90970653 90837508 90708756 90564209 90414578 90286255 90177310
2798.4I0177310j17088j31959j29950j17671j11669j27387j44703j32304j10209j02282
2818.8H8952088r4556p9334p2998q6528j06859j19061j27548j40088j55855j83731
2839.1H7785530k31272k82752l21204l41719l50523l44855l08525k43622j71882j12838
2859.5H5076338o7055k7090k128p975l5632o5452j02848j57988k17163k55490k67875
2882H3869642k76285k83176k68197k36720k07382j85353j67394j48076j28597j17373
2902.4H1851089j05590p7569m3565j6999J1772N0759Q8888J19090J50711J91569K35766
2924.8H2455921K77740L21382L71319M29774M89384N37133N65517N66584N28866M60803
2945.2H7004423L95435L42983K88153K35051J92565J54918J11014N4699N483k6989
$$ plain form
2798.4 90177310 90060222 89928263 89798313 89680642 89568973 89441586 89296883 89164579 89054370 88952088
2818.8 88952088 88857532 88778198 88705200 88618672 88511813 88392752 88265204 88125116 87969261 87785530
2839.1 87785530 87554258 87271506 86950302 86608583 86258060 85913205 85604680 85361058 85189176 85076338
2859.5 85076338 85009283 84982193 84980065 84972090 84936458 84871006 84768158 84610170 84393007 84137517 83869642
2882 83869642 83593357 83310181 83041984 82805264 82597882 82412529 82245135 82097059 81968462 81851089
2902.4 81851089 81745499 81667930 81624365 81607366 81619138 81669897 81758785 81877875 82028586 82220155 82455921
2924.8 82455921 82733661 83055043 83426362 83856136 84345520 84882653 85448170 86014754 86543620 87004423
2945.2 87004423 87399858 87742841 88030994 88266045 88458610 88613528 88724542 88779241 88784724 88757735
2965.6H8757735o5976j12045j36065j39648j57887k00516k49779l01939l63833m08906
2986H6621141m02379l52794l17770l34483l61455l86560m25046m37790m00132l20799
3006.4H2881933k23565j58542j63370k24561l07256l91114m51147m48591l86548k88766
3026.8G9838473j51802j7434M4400L552q6528j36375j78492k78306l91883m52769m53252
3049.2G7739584m43345m36932l92973l14403k09725o4563J02341K44653L04550K83718
3069.6G6812905K53004K38812K28184K05535J62429J37317J40422J35625J33920J32179
3090G8580332R3329M7248L6180M2540K7371k539J3935Q4013J34867J35094J48821J95187
3114.5G9536378K00546J53518J00654P1544P8886J01239J12671J08808J00970J04308
$$ plain form
2965.6 88757735 88691759 88579714 88443649 88304001 88146114 87945598 87695819 87393880 87030047 86621141
2986 86621141 86218762 85865968 85548198 85213715 84852260 84465700 84040654 83602864 83202732 82881933
3006.4 82881933 82658368 82499826 82336456 82111895 81804639 81413525 80962378 80513787 80127239 79838473
3026.8 79838473 79686671 79669237 79713637 79717189 79630661 79494286 79315794 79037488 78645605 78192836 77739584
3049.2 77739584 77296239 76859307 76466334 76151931 75942206 75877643 75979984 76224637 76529187 76812905
3069.6 76812905 77065909 77304721 77532905 77738440 77900869 78038186 78178608 78314233 78448153 78580332
3090 78580332 78673661 78720909 78757089 78799629 78827000 78824461 78838396 78922409 79057276 79192370 79341191 79536378
3114.5 79536378 79736924 79890442 79991096 80062640 80141526 80242765 80355436 80464244 80565214 80669522
3134.9H0669522J19335J29652J21653J14941J23275J34063J49107J55228J19257P0637
3155.3H1906670O8450R6172J13213J18268J20270J19680J09441R5480R5439J01471
3175.7H2944554R6971R4753R9385R5427Q0765O5338N9235N4151L5948J8537J8978K2036
3200.1H3686078J6677J5902K7073L5137K4360R769Q840J1390K390j4036k1971k3764
3224.6H3777845l0679l2568j2910L797k6041o7157o3270l6753k2196j8245k5726m5144
3249.1H3400953n1582l9083l5041n2178o9458o6787n2976l6890j5449j01k3270o1703
3273.6H2896435o9666o7603o3873n1587n2286p2223q5347p6420q2302j26427j77431
3296H1971270k10035k14100j85799j53488j71847k43681l04806l14677k91771k76351
$$ plain form
3134.9 80669522 80788857 80918509 81040162 81155103 81278378 81412441 81561548 81716776 81836033 81906670
3155.3 81906670 81975120 82071292 82184505 82302773 82423043 82542723 82652164 82747644 82843083 82944554
3175.7 82944554 83041525 83136278 83235663 83331090 83411855 83477193 83536428 83590579 83626527 83645064 83664042 83686078
3200.1 83686078 83702755 83718657 83745730 83780867 83805227 83814996 83823836 83835226 83837616 83823580 83801609 83777845
3224.6 83777845 83747166 83714598 83701688 83705485 83679444 83612287 83549017 83512264 83490068 83471823 83446097 83400953
3249.1 83400953 83349371 83310288 83275247 83223069 83153611 83086824 83033848 82996958 82981509 82981408 82958138 82896435
3273.6 82896435 82826769 82759166 82695293 82643706 82591420 82519197 82433850 82357430 82275128 82148701 81971270
3296 81971270 81761235 81547135 81361336 81207848 81036001 80792320 80487514 80172837 79881066 79604715
3316.4G9604715k77442k77298k67244k64460k98494l37314l31641l08781k93875k81251
3336.8G6666915l01337l41582l55500l56609l36343k96795l16191l83949l97575l52693
3357.2G3228341l25125l38853l42637k99340k68847l10487l75443l74776l16430k77417
3377.6F9998986k67727k65199k56121k27582j77372j24067j32799j96004j98316j17094
3398F8036705p3367j37770k03753j71757j08486q3607q3852r6441r7781o7806m2582
3420.4F6869503l3676p356L4291O1911O3044P4816J01155Q2171L5512L9405R4455J46008
3444.9F7561239J68979J71143J75744J87034J99449K24697K50352K39700K35259K84917
3465.3F9698513L11756K52080J82801J94454K53272K98244K95532K53737K45255K73663
$$ plain form
3316.4 79604715 79327273 79049975 78782731 78518271 78219777 77882463 77550822 77242041 76948166 76666915
3336.8 76666915 76365578 76023996 75668496 75311887 74975544 74678749 74362558 73978609 73581034 73228341
3357.2 73228341 72903216 72564363 72221726 71922386 71653539 71343052 70967609 70592833 70276403 69998986
3377.6 69998986 69731259 69466060 69209939 68982357 68804985 68680918 68548119 68352115 68153799 68036705
3398 68036705 67963338 67825568 67621815 67450058 67341572 67257965 67174113 67077672 66979891 66912085 66869503
3420.4 66869503 66835827 66828471 66862762 66924673 66987717 67062533 67163688 67245859 67281371 67320776 67415231 67561239
3444.9 67561239 67730218 67901361 68077105 68264139 68463588 68688285 68938637 69178337 69413596 69698513
3465.3 69698513 70010269 70262349 70445150 70639604 70892876 71191120 71486652 71740389 71985644 72259307
3485.7G2259307K78532K72286K86144L00163L05486K97988K90572K94602K78062K57653
3506.1G5120795K75820L16030L47030L34162K96640K91038L10623L33798L25448K89291
3526.5G8240675K90531L27438L53050L62486L48031L16703L26789L55709L42905L06976
3546.9H1571293K98357L09384L10409L14879L34037L50952L43865L00342K71535L34078
3567.3H4739131L99762L73113L42399L51381L63023L77476L97450L81165L25275L04270
3587.7H8354445L56161L72905L52311L63713L88819L83085L60012L31813K92623K86788
3608.1I1842675L16370L30507L33006L08537K92021L38537L44097K71648J89049J89638
3628.5I4756085L10176L40462K90269K50047K29287K27255K18093J79106J33407J66655
$$ plain form
3485.7 72259307 72537839 72810125 73096269 73396432 73701918 73999906 74290478 74585080 74863142 75120795
3506.1 75120795 75396615 75712645 76059675 76393837 76690477 76981515 77292138 77625936 77951384 78240675
3526.5 78240675 78531206 78858644 79211694 79574180 79922211 80238914 80565703 80921412 81264317 81571293
3546.9 81571293 81869650 82179034 82489443 82804322 83138359 83489311 83833176 84133518 84405053 84739131
3567.3 84739131 85138893 85512006 85854405 86205786 86568809 86946285 87343735 87724900 88050175 88354445
3587.7 88354445 88710606 89083511 89435822 89799535 90188354 90571439 90931451 91263264 91555887 91842675
3608.1 91842675 92159045 92489552 92822558 93131095 93423116 93761653 94105750 94377398 94566447 94756085
3628.5 94756085 95066261 95406723 95696992 95947039 96176326 96403581 96621674 96800780 96934187 97100842
3648.8I7100842K66087K59954K07579K30938K60496K05475J49322J41227J07569N6922
3669.2I8986411Q9330Q9222L0714R3609J60474J40738J07956O9869K0617q816L8487
3691.7I9818611Q8275O8575K4539m339j4615K0349L5572j6332p7534l5691P8041Q9377
3716.2A00074828K2351k9039l9613k8527L242L7194J6820m3261n8448J3888Q2314M1055
3740.6A00092804q8632j35535m637K837o1667L2199R5957L5441r501K6638L6364m875
3765.1A00017393j5664j2446K92L1215K7680j0943l7527j4049M47o401J484P254K587
3791.6I9991322q935k4235k4736n5027o7550J1003K0337J0788N3859L5220m0423o6644
3816.1I9834979j9592m2785l0952N3888M7553J4668l981p677K68m9698r2179j7100
$$ plain form
3648.8 97100842 97366929 97626883 97834462 98065400 98325896 98531371 98680693 98821920 98929489 98986411
3669.2 98986411 99075741 99164963 99195677 99289286 99449760 99590498 99698454 99768323 99788940 99780124 99818611
3691.7 99818611 99906886 99975461 100000000 99995661 99981046 100001395 100036967 100020635 99943101 99907410 99985451 100074828
3716.2 100074828 100097179 100068140 100028527 100000000 100003242 100040436 100057256 100013995 99955547 99969435 100051749 100092804
3740.6 100092804 100004172 99868637 99864000 99866837 99805170 99837369 99933326 99968767 99959266 99985904 100022268 100017393
3765.1 100017393 100001729 99989283 99989575 100020790 100048470 100037527 100000000 99985951 99986398 99979997 99981481 99988735 99991322
3791.6 99991322 99982387 99958152 99933416 99878389 99810839 99821842 99842179 99852967 99906826 99942046 99901623 99834979
3816.1 99834979 99815387 99772602 99741650 99795538 99843091 99857759 99853778 99846101 99846369 99796671 99704492 99687392
3840.6I9687392N5277O5815N3096J2171q9061k13396p4381J42199J19352J6308m6974
3863I9727798k1816Q393m0776m0162L3647O3682L9434k0784j1676L0112J472N937J2475
3889.5I9787736j3852J9282M0519j2904o0481o3050l0184M4257Q2391N1475J7941l58
3914I9862772k3001k7251o873K056l266R900K1798Q523J3304L7390L2294J1462j979
3940.5I9937129p09K6756L6824J5390N615J3327K4724K8289J5759O974J7440K5737
3965A00153255J6153M816P105J3614J5473J3352J1813J8478K0635L755j2982p152P367
3991.5A00265682J3697J8024K1887
3997.6A00319290
$$ plain form
3840.6 99687392 99742669 99808484 99861580 99873751 99784690 99571294 99496913 99639112 99758464 99774772 99727798
3863 99727798 99705982 99714375 99673599 99633437 99667084 99730766 99770200 99749416 99737740 99767852 99769324 99775261 99787736
3889.5 99787736 99773884 99793166 99833685 99820781 99760300 99697250 99667066 99711323 99793714 99845189 99863130 99862772
3914 99862772 99839771 99812520 99805647 99807703 99804437 99814337 99836135 99844658 99857962 99895352 99927646 99939108 99937129
3940.5 99937129 99936420 99963176 100000000 100015390 100021005 100034332 100059056 100087345 100103104 100110078 100127518 100153255
3965 100153255 100169408 100174224 100181329 100194943 100210416 100223768 100235581 100254059 100274694 100278449 100265467 100258315 100265682
3991.5 100265682 100279379 100297403 100319290
3997.6 100319290
##END=$$ End of the data block
