##TITLE=G4-Salen $$ Begin of the data block
##JCAMP-DX=5.00 $$ ACD/SpecManager v 10.08
##SPECTROMETER/DATA SYSTEM=Alpha
##DATE=08 Apr 2014 08:54:24
##DATA TYPE=INFRARED SPECTRUM
##DATA CLASS=XYDATA
##ORIGIN=
##OWNER=
##NPOINTS=1765
##FIRSTX=399.75695801
##LASTX=3997.56933594
##MAXX=3997.56933594
##MINX=399.75695801
##MAXY=0.82260418
##MINY=0.22510858
##XFACTOR=1.0000000000
##YFACTOR=1.000000000000000e-9
##FIRSTY=0.82260418
##DELTAX=2.03957629
##XUNITS=1/CM
##YUNITS=ARBITRARY UNITS
##XYDATA=(X++(Y..Y))
399.8H22604179j348555l83854R72689Q6009j552939j284540m48883j163303k794028
418.1H14686775k990126k510250m881144r311378j3953030j6394198r736955O273031
434.4G61182725J8723965J7611325R895265M276931J555980N53131k38002j252472
450.7H12308848j537919j244426j804769k906620l207207l872812o471336j2742996
467.1G78520763k1035850k0761967n962372J0227263J4734924J0016740K878487l920496
483.4G64697492o514311M613877J9398927K0225883J1391103M833579J234591p34329
499.7H19146812m86434L45350l69787j422048o35922N11408k95043j564026q44657
518.1H14385653L14295m48466j404762m67658M84586q11756k115130j066208J18434
$$ y = [822604179, 821255624, 820871770, 821844459, 821930468, 820377529, 819092989, 818644106, 817480803, 814686775, 811696649, 809186399, 804305255, 794993877, 781040847, 764646649, 754909694, 761182725, 779906690, 797518015, 807413280, 811690211, 813246191, 813799322, 813561320, 812308848, 810770929, 809526503, 807721734, 804815114, 801607907, 797735095, 791263759, 778520763, 757484913, 736722946, 730760574, 740987837, 755722761, 765739501, 768617988, 764697492, 758183181, 762797058, 782195985, 802421868, 813812971, 818646550, 819881141, 819146812, 818660378, 819005728, 818635941, 817213893, 816577971, 817089379, 816794336, 815230310, 814385653, 814699948, 814251482, 812846720, 812379062, 812863648, 812051892, 809936762, 808870554, 808988988]
536.4H08988988j076102k391100j554012j153350l595889o801307q989870j0820031
552.7G72607327j1392355q888782p193207p876277L06785J7459690K5198162J7793536
569G98014879O571889R75609Q83579J053930p75636j532554K12848J197755j35124
587.4H06467175r24110K81811P57396o30438j076103M19677R77397o36935j307428
605.8H04328442J99198P05839q76487j410603L9518N10454q97944j329541m9949K0027
626.1H01238954j939177l027738k647578l797949o937802r503960j2840092k2124827
642.5G38419831l5904408l5395324k258420L9841414M9449324L2407999J6273260P463456
658.8H10297132K097845m8221K68341j29819j403213k63274J029194N47826j093268
$$ y = [808988988, 807912886, 805521786, 803967774, 802814424, 799218535, 792417228, 783427358, 772607327, 761214972, 752326190, 745132983, 737256706, 737563491, 755023181, 780221343, 798014879, 804586768, 805562377, 806445956, 807499886, 806724250, 805191696, 805404544, 806602299, 806467175, 805543065, 805824876, 806582272, 805951834, 804875731, 805295408, 806272805, 805635870, 804328442, 804527640, 805233479, 804356992, 802946389, 802985907, 803496361, 802598417, 801268876, 801218927, 801238954, 799299777, 796272039, 793624461, 789826512, 782888710, 773384750, 760544658, 738419831, 702515423, 667120099, 664861679, 704703093, 754152417, 786560416, 802833676, 810297132, 812394977, 812346756, 812615097, 812485278, 811082065, 810818791, 811847985, 812395811, 811302543]
677.1H11302543j513005l50594l55363j869440k158463q94845p65681k223253k647817
695.5G98524082j619935j529038k916634l445030k623200k670288m075825m691542
711.8G74952590m086196m391909o071567p300973p491291q718311j1656166j4903366
728.1G10332811j8827260k5414884l5594642n1904678p8897298r6680104m8520208
742.4C54493737L6821455K4803430m8530400j9801289N9805602N5438012J3288408
756.7D76318955K9082597P5163007P9867661M5642673Q704663k1383524m3496788m2916417
773F06982827j0721385L1181216N2259624M8144758L3883094K1499515J4013708R063005
789.3H06306362M423797O33836j132727j707315k601683l673613m322589n413174p128179
$$ y = [811302543, 809789538, 809438944, 809083581, 807214141, 805055678, 804160833, 803395152, 801171899, 798524082, 796904147, 795375109, 792458475, 789013445, 786390245, 783719957, 779644132, 774952590, 770866394, 766474485, 760402918, 753101945, 745610654, 736892343, 725236177, 710332811, 691505551, 666090667, 630496025, 578591347, 499694049, 403013945, 354493737, 391315192, 416118622, 367588222, 347786933, 407592535, 463030547, 476318955, 505401552, 580564559, 660432220, 706074893, 714779556, 693396032, 649899244, 606982827, 596261442, 627442658, 679702282, 727847040, 761730134, 783229649, 797243357, 806306362, 810730159, 811363995, 810231268, 808523953, 805922270, 802248657, 797926068, 792512894, 785384715]
807.7G85384715o294012j900435J128495j21236k693892l898501m340887n286157o470084
826G55508006p082045p569373q727253j0256350j1567056j3135969j5953184j9844293
842.3F61372483k3879230k7613282l0758679l2087386k9937148k3605436j3798326
856.6D79692996j147837J5394360L5555720N2477241N5068552M0210128J8051505M065991
872.9F99368656M367947R836674J1309206R073973N979955L439248J822770L14116
889.3G45512545j975775n775869j2753129j9164621q424282K0411729L5845876K5863230
905.6G79539704J1552453M709304K591610J980364J299262M84049J84894J08659l66807
923.9H02083492j081407j621067l182769r355247k0195306j7988920O967426K4253785
$$ y = [785384715, 779090703, 777190268, 778318763, 778197527, 775503635, 771605134, 767264247, 761978090, 755508006, 748425961, 740856588, 732129335, 721872985, 710305929, 697169960, 681216776, 661372483, 637493253, 609879971, 579121292, 547033906, 517096758, 493491322, 479692996, 478545159, 493939519, 529495239, 581972480, 637041032, 677251160, 695302665, 699368656, 703736603, 713573277, 724882483, 733956456, 739936411, 743375659, 745198429, 745512545, 743536770, 737760901, 725007772, 705843151, 697418869, 717830598, 753676474, 779539704, 791092157, 795801461, 798393071, 800373435, 801672697, 802156746, 802341640, 802450299, 802083492, 801002085, 799381018, 796198249, 786843002, 766647696, 748658776, 755626202, 779879987]
940.2G79879987J6613305N305886J597881N39303l60727q08537q87632j625300l112197
958.6G97141969m682183o737173j1100411k1613836l8899124m2132318j6503394P763028
974.9F63236558N326152j0371029q564890K3129642M7007978L6859334J6775191N549490
991.2G78948426R06945j027167k475441m354477n968988p038831q500994j0952413
1007.5G39537060j4269650j9112229k7183950m0129423n6522310n6346118q103729
1021.8E17869651O6300810R5168292O3837290K0654142p625341k7999878n0337375
1036.1F77867591p3734998p7963949l5365879L8846314Q5706115Q0874204N3681970
1050.4G49911368L1218946J7529189R259403M451752K265930J122773k59519j463771
$$ y = [779879987, 796493292, 801799178, 803397059, 803936362, 803575635, 802767098, 801879466, 800254166, 797141969, 792459786, 785722613, 774622202, 753008366, 714109242, 671976924, 655473530, 663236558, 668562710, 658191681, 649626791, 672756433, 719764411, 756623745, 773398936, 778948426, 779855371, 778828204, 776352763, 771998286, 766029298, 758990467, 750489473, 739537060, 725267410, 706155181, 678971231, 638841808, 582319498, 525973380, 517869651, 584170461, 679338753, 743176043, 763830185, 756204844, 728204966, 677867591, 604132593, 526168644, 490802765, 529649079, 615355194, 696229398, 749911368, 781130314, 798659503, 807918906, 812370658, 814636588, 815759361, 815499842, 814036071]
1066.7H14036071j798272j721740j887619j837254j116752n49615r87351j742422j860380
1085H00534666j788259k260387l085256l788173m986703p587850j1438906j5683771
1101.4G49915361j8100619j4300227n936623n145073j4993012j5689849P475733L3980787
1117.7G17206478L7728250K3868680J0257363L034235K1934j274645k220571l252209
1134G85369515m745483p343829j2492120k3887634m8497319p8718067p7831745j5247226
1150.3E16606092P3830843J06363476O9629192K7136028Q307993J684368j287460k397716
1166.6G99872816k091110j531184j547873k027690k499938l214896m266679n483508
1182.9G77209938p003129r475112j3165712j8382788k6791632l7929237m0887177k1228612
$$ y = [814036071, 812237799, 810516059, 808628440, 806791186, 805674434, 805124819, 804137468, 802395046, 800534666, 798746407, 796486020, 793400764, 789612591, 784625888, 777038038, 765599132, 749915361, 731814742, 717514515, 711577892, 706432819, 691439807, 675749958, 683225691, 717206478, 754934728, 778803408, 789060771, 792095006, 792116940, 790842295, 788621724, 785369515, 780624032, 773280203, 760788083, 736900449, 688403130, 609685063, 531853318, 516606092, 590436935, 696800411, 766429603, 793565631, 801873624, 803557992, 802270532, 799872816, 797781706, 796250522, 794702649, 792674959, 790175021, 786960125, 782693446, 777209938, 770206809, 760731697, 747565985, 729183197, 702391565, 664462328, 623575151, 602346539]
1199.3F02346539J2380302L2993198L0540585J6282678K379358o421149j1475086j5205562
1215.6F63820863j4222563k846479J4713168K5637090K4834812J8768847J3555646
1229.9G44261384R308279M609644l08990m425645p578195j0894596j5123904j7035246
1246.2G02812731q391082J1692405K6226461K2044778Q365988k206444p678748r379089
1262.5G43487000r032368j0396838j5920163k4609863l4905136m6123564n7857990
1276.8E44641078o7706615o7738742m0627777K2423625Q3004295Q6542070M4126094
1291F04664028J2298107J2104869K5366962L3857822L3128917K5093913J4791191P157683
1307.4G68463492K427459k767265j0230183j4142335l688931J6699493K4854302J6450763
$$ y = [602346539, 614726841, 647720039, 678260624, 694543302, 696922660, 690501511, 679026425, 663820863, 649598300, 646751821, 661464989, 687102079, 711936891, 730705738, 744261384, 753569663, 758179307, 757870317, 753444672, 745866477, 734971881, 719847977, 702812731, 694421649, 706114054, 732340515, 754385293, 762751281, 760544837, 752866089, 743487000, 734454632, 724057794, 708137631, 683527768, 648622632, 602499068, 544641078, 476934463, 409195721, 368567944, 390991569, 473995864, 560537934, 604664028, 616962135, 629067004, 654433966, 688291788, 721420705, 746514618, 761305809, 768463492, 770890951, 768123686, 757893503, 743751168, 740062237, 756761730, 781616032, 798066795]
1323.7G98066795O181180P99120j470804k584041l239154l354073k823472j911342
1340G89664209j080573p79271r55999j544714k257168k761662l118992l872633n360067
1358.3G67933130q176207j3572753k0293236k6895821l1429410k3760557l332674J5571177
1374.7F56043649J9890308J4622271Q768320L849685N11587j797855m009962n821228
1391F92056775q423090j2075901j4321268j5571534j4471412j1327803q655310n700171
1407.3F01510286m238546o480753j1382699j5081525j3683200j373231J7344415L0718863
1423.6E97333610L4698129K9770672K5433302J9893050J2146950O521761J336158l569484
1439.9G23564148p601202j1489212j6484082k5440335l5138011l9860725l3063829
$$ y = [798066795, 804247975, 805047095, 803576291, 800992250, 797753096, 794399023, 791575551, 789664209, 788583636, 787804365, 786848366, 785303652, 783046484, 780284822, 777165830, 773293197, 767933130, 759756923, 746184170, 725890934, 698995113, 667565703, 643805146, 640472472, 656043649, 675933957, 690556228, 699324548, 703174233, 703685820, 701887965, 697878003, 692056775, 683633685, 671557784, 657236516, 641664982, 627193570, 615865767, 607210457, 601510286, 597271740, 590790987, 579408288, 564326763, 550643563, 549270332, 566614747, 597333610, 632031739, 661802411, 687235713, 707128763, 719275713, 725797474, 727133632, 723564148, 715962946, 704473734, 687989652, 662549317, 627411306, 587550581, 554486752]
1454.2E54486752j6110182o741464n005658J3860166M8167706O0995280L7408531J7425895
1470.5G04487026P946849J248717l594935p813513j2999833j8668175k3521721l0945182
1486.8F16139233m3823719n2500486m5728684l9827466k8728038J1040181N0402165
1501.1D66973186O3938975P1644485Q0569088M4736445J5648663P722617K483844j716196
1517.4G52001107l858447n375684m989385k279938R07898L386558M453182M435360
1533.7G48680651K606213K41757l018022n571902n266308n679906o985009r172201
1550.1G15835273j0436535j0747492j0732293j6139746k2629440j6011893j6952098
1564.3F12185776k2041201l0072093m1802645m0002227l5108924k6273131M444390
$$ y = [554486752, 538376570, 531635106, 526629448, 540489614, 588657320, 649652600, 687061131, 704487026, 712433875, 713682592, 710087657, 702274144, 689274311, 670606136, 647084415, 616139233, 572315514, 519815028, 474086344, 434258878, 405530840, 416571021, 466973186, 530912161, 602556646, 683125734, 727862179, 743510842, 751233459, 753717303, 752001107, 748142660, 742766976, 737777591, 735497653, 736405551, 739792109, 744245291, 748680651, 751286864, 751528621, 748510599, 742938697, 737672389, 731992483, 725007474, 715835273, 705398738, 694651246, 683918953, 667779207, 645149767, 629137874, 612185776, 590144575, 560072482, 518269837, 478267610, 443158686, 416885555, 421329945]
1578.6D21329945L1954766M6703636M6138495L3433915J8758297P041394k148866r098471
1594.9E94113111j3027250j5152812j7987371k1269560k2453427j9371659j1538654
1609.2D73312378k014190M081935P090091Q261532M386276l053516j6012371l1975060
1625.5D44077075m8645735o0245127n4582774m2400688j3094172M9476728R0475917
1639.8C65061224R7130149Q0176741O6499114N3270280K8749228K2395134K7180672
1654.1G40462542J4046013O344318M678667K978146J153588L27349P22110J352489
1670.4G72065222J178980J88470j05202J749694M803658Q184492J0734499O346166
1686.7H05145979J740813J58966l46422m28200n08905J97113J100063J247466Q24988
$$ y = [421329945, 453284711, 499988347, 546126842, 579560757, 598319054, 605360448, 603211582, 594113111, 581085861, 565933049, 547945678, 526676118, 504222691, 484851032, 473312378, 471298188, 475380123, 482470214, 490731746, 495118022, 492064506, 476052135, 444077075, 395431340, 335186213, 280603439, 238202751, 225108579, 274585307, 365061224, 462191373, 542368114, 608867228, 662137508, 690886736, 713281870, 740462542, 754508555, 760852873, 765531540, 768509686, 769663274, 769990623, 770712733, 772065222, 773244202, 773432672, 773327470, 775077164, 779880822, 788065314, 798799813, 805145979, 806886792, 807045758, 806699336, 806271136, 805762231, 805959344, 807059407, 808306873, 809131861]
1705.1H09131861K66909j61111k01583j50561j65463P2897N39839J036644J479447
1723.4H11848879J827657J731396J379788R53853Q36909Q21769M79638J46032l8386
1741.8H19987535Q762j23381m31419p64191p54654o11007p59960q73744p40707q16226
1762.2H14121008r18746p65622o00219o06715j104295j288116r98915j033485j389563
1780.5H05415332j601696j640141j778245k012491k638459l132224k414048j359105
1796.9G88838923l90112Q66890J848220K032102J826465J619875J377463Q55923L01540
1815.2G99177289J2219m4763j61171m42207o59168o54399o81996n25475K2233L92258
1835.6G96434820L36826J36256J36554K05517P2002k21014l47674k20775j39237k09808
$$ y = [809131861, 809398770, 809237659, 809036076, 808885515, 808720052, 808792949, 809332788, 810369432, 811848879, 813676536, 815407932, 816787720, 817741573, 818578482, 819400251, 819879889, 820025921, 819987535, 819996297, 819872916, 819441497, 818677306, 817922652, 817311645, 816551685, 815677941, 814937234, 814121008, 813202262, 812436640, 811836421, 811229706, 810125411, 808837295, 807838380, 806804895, 805415332, 803813636, 802173495, 800395250, 798382759, 795744300, 792612076, 790198028, 788838923, 788448811, 789315701, 791163921, 793196023, 795022488, 796642363, 798019826, 798875749, 799177289, 799189508, 799144745, 798983574, 798541367, 797882199, 797227800, 796545804, 796020329, 796042562, 796434820, 796771646, 796907902, 797044456, 797249973, 797321975, 797100961, 796753287, 796532512, 796393275, 796183467]
1856G96183467k20358j53304l01957o33061q87394j212895j716554j978695j523674
1874.4G87555575j29759J275718J571656J057624M23849k06530q42571j074076p77006
1892.7G88854480o58393j030684j630962k146840k274453j873791j205564m89116K54929
1911.1G77799606Q33810J199901J562059J624286J005292J19150n97120j187920j870394
1929.4G80488670k432406k662182k713621k706587k432644j334369J008749L214895
1945.7G70430505L713072K951145J953542J012266K86996J8597l8386k92182o62922
1964.1G79372633q25525p43925o57618o53983n16653k76386k37286l89100m06146k83658
1984.5G74382353l16560m85421n38945m71413m93050o16014o10768l98159k55347k85208
$$ y = [796183467, 795963109, 795809805, 795507848, 794874787, 793987393, 792774498, 791057944, 789079249, 787555575, 787425816, 788701534, 790273190, 791330814, 791754663, 791548133, 790705562, 789631486, 788854480, 788196087, 787165403, 785534441, 783387601, 781113148, 779239357, 778033793, 777544677, 777799606, 778633416, 779833317, 781395376, 783019662, 784024954, 784144104, 783546984, 782359064, 780488670, 778056264, 775394082, 772680461, 769973874, 767541230, 766206861, 767215610, 770430505, 774143577, 777094722, 779048264, 780060530, 780347526, 780366123, 780327737, 780035555, 779372633, 778547108, 777803183, 777145565, 776491582, 775974929, 775698543, 775461257, 775072157, 774666011, 774382353, 774065793, 773580372, 773041427, 772570014, 772076964, 771460950, 770850182, 770452023, 770196676, 769911468]
2004.9G69911468k31206j0014J04725n900j04309r2148j17958k29597k58148j82628
2025.3G68784285k38657m75169o08980n31137m80354n37217n06282l64780l78072n95749
2045.7G64067888p55906p60794q38041j034617r70781m67420R1076L28422L41296L00944
2066.1G60302067J66833q0645k83599l06666k91407m32730n94317n99623o27041q43287
2086.5G56409585j039266r18031n37217j61409J18971L03864K80679L0100k18749k89321
2106.9G53979206k72930l49402m64320m48406l72410m19616n45323n25833l40759k42949
2127.3G49997258k90394k78830k02596k42949l80754m17233l51190l64602m56274m38690
2147.7G46573746k98679k20775k89798l81827m06921m71115o19293p03394o35028n66602
$$ y = [769911468, 769680262, 769670248, 769774973, 769769073, 769664764, 769572616, 769454658, 769225061, 768966913, 768784285, 768545628, 768070459, 767461479, 766930342, 766449988, 765912771, 765406489, 765041709, 764663637, 764067888, 763311982, 762551188, 761713147, 760678530, 759707749, 759240329, 759331405, 759659827, 760001123, 760302067, 760468900, 760388255, 760104656, 759797990, 759506583, 759073853, 758479536, 757879913, 757252872, 756409585, 755370319, 754452288, 753915071, 753753662, 753872633, 754176497, 754457176, 754487276, 754268527, 753979206, 753706276, 753356874, 752892554, 752444148, 752071738, 751652122, 751106799, 750580966, 750240207, 749997258, 749706864, 749428034, 749225438, 748982489, 748601735, 748184502, 747833312, 747468710, 747012436, 746573746, 746275067, 746054292, 745764494, 745382667, 744975746, 744504631, 743885338, 743181944, 742546916, 741980314]
2168G41980314n81801m95433k35856J9193J59978K60890L35813K27689n6505k49982
2188.4G41364300k33114j73628k06292k66909k79009k75791l06249l13341k42830k06470
2208.8G38860667l24428n09739n81980n74887o45041p22885o76811o12557o81996q30353
2229.2G32699990r17613r39906r48965q70526o10173k86102j33276j66595k52962l60191
2249.6G27213681m81904n10394l73066k30431k79427m42445m95613m22895l98636m39882
2270G23138988m17531l53515l45409l48985k74181j65284j11997q7500m5776q3685
2290.4G20905125l07143o26742q78752r48250q35478o72937n88238o28710p62641q99792
2310.8G13756442r32455q87334r40621j115322j152277r32694p60913q87036j081228
$$ y = [741980314, 741398513, 740903080, 740667224, 740686417, 740846395, 741107285, 741443098, 741670787, 741614282, 741364300, 741131186, 740957558, 740751266, 740484357, 740205348, 739929557, 739623308, 739309967, 739067137, 738860667, 738536239, 738026500, 737444520, 736869633, 736224592, 735501707, 734824896, 734212339, 733530343, 732699990, 731782377, 730842471, 729893506, 729022980, 728412807, 728126705, 727993429, 727826834, 727573872, 727213681, 726731777, 726221383, 725848317, 725617886, 725338459, 724896014, 724400401, 723977506, 723578870, 723138988, 722721457, 722367942, 722022533, 721673548, 721399367, 721234083, 721122086, 721034586, 720988810, 720905125, 720597982, 719971240, 719092488, 718144238, 717308760, 716635823, 716047585, 715418875, 714656234, 713756442, 712823987, 711936653, 710996032, 709880710, 708728433, 707795739, 707034826, 706147790, 705066562]
2329.2G05066562j115740j188457j358449j335323r51111l78549O0439K65896K38061
2347.5F99303329j19329p02798j167118j149893p98166n56350m27544j56343N5671
2365.9F94281459K6345m4107o4373j54853l08871l79265l51608l81767n27978p27773
2386.3F91367209r20117j101077j242041j150906p60913l54588k32220l86774n88179
2404.6F84630394o73652o23107m64439k61605q1301J5974L0220K6166m2557k27034
2425F82329059l96252m19974l70801l90231m61936m83990m67181m98712n77391o29961
2445.4F77632630o28233o36995o75976o45459n58734n61058o69420p72596q72850r87351
2465.8F70623958r78470p90119n57184m06921l22938k67863l18051n55157q96514j137554
$$ y = [705066562, 703950822, 702762365, 701403916, 700068593, 699117482, 698738933, 698799372, 699065268, 699303329, 699184000, 698481202, 697314084, 696164191, 695366025, 694809675, 694382131, 694225788, 694281459, 694307804, 694263697, 694199324, 694044471, 693735600, 693356335, 693004727, 692622960, 692094982, 691367209, 690447092, 689346015, 688103974, 686953068, 686192155, 685837567, 685605347, 685218573, 684630394, 683956742, 683333635, 682869196, 682607591, 682526290, 682542264, 682572484, 682598650, 682556093, 682329059, 681932807, 681512833, 681142032, 680751801, 680289865, 679805875, 679338694, 678839982, 678262591, 677632630, 677004397, 676367402, 675691426, 675045967, 674487233, 673926175, 673256755, 672484159, 671611309, 670623958, 669645488, 668855369, 668298185, 667891264, 667568326, 667300463, 666982412, 666427255, 665530741, 664393187]
2486.2F64393187j209140j164377j030803p96139n10573l21806l06547m02569n03540
2504.6F58147693o06537p31886p91847p48933o61373n32389l48150j85132j58012l22700
2525F53060734n86509p78556q07822p10249n57959l50177j58012j48416l57270o86646
2545.4F47919118j016080j268983j363397j127362n14626J82211N33223M36485K14934
2563.7F43995523Q7083r298j29641k76148l91781l97802l17990k19644j30951m8518
2584.1F42160833Q285q226l2067P4446L32058O68824R03487Q30114M89473Q5711k22444
2606.6F45290494l45230l06368j78695J371J56105J61469k2054k99335o24597j084566
2626.9F42748594j627624j941919j685560p63118M36485J287520J565814J468360J205146
$$ y = [664393187, 663184047, 662019670, 660988867, 660192728, 659682155, 659360349, 659053802, 658651233, 658147693, 657541156, 656809270, 656017423, 655268490, 654607117, 654074728, 653726578, 653541446, 653383434, 653060734, 652474225, 651695669, 650887847, 650177598, 649619639, 649269462, 649111450, 648963034, 648605764, 647919118, 646903038, 645634055, 644270658, 643143296, 642628670, 642810881, 643344104, 643780589, 643995523, 644082606, 644073308, 643943667, 643667519, 643275738, 642877936, 642559946, 642340302, 642209351, 642160833, 642169118, 642160892, 642128825, 642203271, 642535329, 643204153, 644107640, 644937754, 645427227, 645512938, 645290494, 644945264, 644638896, 644460201, 644461572, 644617677, 644779146, 644757092, 644457757, 643833160, 642748594, 641120970, 639179051, 637493491, 636730373, 637166858, 638454378, 640020192, 641488552, 642693698]
2645.3F42693698Q76189N28454J81020q6606j37746J7166K18213M32670P95006J238704
2665.7F46756768J506686J589179J645148J675368J618802J470626J245319R93967
2682F58501863P61509N83589M79997M22775L42012J32561k16246o71804j267135j880765
2702.4F57188356k251923k272189k036393j668930j234531p96616m66108k76506j36257
2720.8F46048903J4425J49369J86324J85192K55346K26975k0862k80261l06904l9578
2741.2F46418929M08828Q64864J190662J285136J182198J080573J076341J071453J024246
2759.5F55603230J024961J119853J244485J310944J303018J248121J005411K93434
2775.8F64153457p55847j596868j942873j865148j495541r71972n55456l60191j62959
$$ y = [642693698, 643569887, 644098341, 644279361, 644192755, 644055009, 644072175, 644290388, 644723058, 645518064, 646756768, 648263454, 649852633, 651497781, 653173149, 654791951, 656262577, 657507896, 658501863, 659263372, 659846961, 660326958, 660749733, 661091745, 661224306, 661008060, 660336256, 659069121, 657188356, 654936433, 652664244, 650627851, 648958921, 647724390, 646927774, 646461666, 646185160, 646048903, 646063328, 646212697, 646399021, 646584213, 646839559, 647066534, 647045672, 646765411, 646458507, 646418929, 646827757, 647692621, 648883283, 650168419, 651350617, 652431190, 653507531, 654578984, 655603230, 656628191, 657748044, 658992529, 660303473, 661606491, 662854612, 663860023, 664153457, 663397610, 661800742, 659857869, 657992721, 656497180, 655525208, 654969752, 654609561, 654446602]
2794.2F54446602J26362L49521M27127M66347N91159P52568P96855P09474O48677O75678
2814.6F59990370O45221M42206J30296k07364n42045q68201j165152j361966j418293
2832.9F55645072j329660j164198j098394j232744j461446j591146j617312j721025
2849.3F44429147j955032k270758k696157l232300l808975m193306l961325k981782
2865.6F19329512j507342K26140J956880L239155L778637L706157L215909K367020
2881.9F36312068J213014k00510j816690l640116n732596p972717r565830q634806
2898.2E99961817l367960M881739J1017681J1204123O888688K167165o44505j587629
2914.5F30521119j396954p26164k88605p29323k039969l234446k943277n94497L060043
$$ y = [654446602, 654572964, 654922485, 655349612, 655815959, 656407118, 657159686, 657956541, 658666015, 659314692, 659990370, 660635591, 661077797, 661208093, 661000729, 660458684, 659590483, 658425331, 657063365, 655645072, 654315412, 653151214, 652052820, 650820076, 649358630, 647767484, 646150172, 644429147, 642474115, 640203357, 637507200, 634274900, 630465925, 626272619, 622311294, 619329512, 617822170, 618048310, 620005190, 623244345, 627022982, 630729139, 633945048, 636312068, 637525082, 637324572, 635507882, 631867766, 626135170, 618162453, 608596623, 599961817, 596593857, 601475596, 612493277, 623697400, 630586088, 632753253, 632108748, 630521119, 629124165, 628398001, 628109396, 627380073, 625340104, 622105658, 619162381, 618567884, 621627927]
2932.9F21627927O346762P813334P263065N510568L412426J423240k09749j322269
2949.2F51865304j821280j645088n50866J500606L687144N019426N154431M309237
2965.5F67518914K952158J575172M63486m44293j278162j977384k449692k693295k603233
2983.9F61063671k015412j147389n35429m15504o51598j046002j445949j834333k161383
3002.2F49810672k234340j955390j179457M04835K636552M503787N015432M272640
3018.5F61274731L169060K301991J582563Q42750K49982k15113q01087j576185k294481
3036.9F64534211k629757k864480l389776l850936l665030k621532r76741P61091J885653
3055.3F47182703J648426P74741J524508M269958O338775N823195L911197K425790
$$ y = [621627927, 627974689, 635788023, 643051088, 648561656, 651974082, 653397322, 653187573, 651865304, 650044024, 648398936, 647848070, 649348676, 653035820, 658055246, 663209677, 667518914, 670471072, 672046244, 672509730, 672065437, 670787275, 668809891, 666360199, 663666904, 661063671, 659048259, 657900870, 657365441, 656949937, 656298339, 655252337, 653806388, 651972055, 649810672, 647576332, 645620942, 644441485, 644846320, 647482872, 651986659, 657002091, 661274731, 664443791, 666745782, 668328345, 669171095, 669421077, 669205964, 668404877, 666828692, 664534211, 661904454, 659039974, 655650198, 651799262, 648134232, 645512700, 644535959, 645297050, 647182703, 648831129, 649605870, 651130378, 655400336, 661739111, 667562306, 671473503, 673899293]
3071.6F73899293J757145J565635J520991J440466J334429J175642R36091P55250O13689
3089.9F84998631L55721J82211K86162M31598L52084J44899J06335K12431K14636Q4996
3110.3F87369704O3122K16603K33412N2511j26302k55167l08514k59280j40310p7605
3130.7F86768174j30772j47224q9466j03236k04861k72512k91109l66450n02050o03795
3151.1F84056699n99265n03003m26770l87966l10123k31266k15411k18213j98305j78635
3171.5F80787742j96814k57492k99693l20792l79026m41432m61161m66943n15282n99861
3191.9F76849246o49869o37234o62505p55608p75457p07626o33240n80907n74708n89072
3212.3F70283020o12081o85274p58767p30992o93380p66516q43346q55565q66771q84831
$$ y = [673899293, 675656438, 677222073, 678743064, 680183530, 681517959, 682693601, 683629692, 684384942, 684998631, 685354352, 685536563, 685822725, 686254323, 686606407, 686751306, 686857641, 687070072, 687284708, 687369704, 687432826, 687649429, 687882841, 687935352, 687809050, 687553883, 687245369, 686986089, 686845779, 686768174, 686637402, 686490178, 686400712, 686297476, 686092615, 685820103, 685528994, 685162544, 684660494, 684056699, 683457434, 682954431, 682527661, 682139695, 681829572, 681598306, 681382895, 681164682, 680966377, 680787742, 680590928, 680333436, 680033743, 679712951, 679333925, 678892493, 678431332, 677964389, 677449107, 676849246, 676199377, 675562143, 674899638, 674144030, 673368573, 672660947, 672027707, 671446800, 670872092, 670283020, 669670939, 668985665, 668226898, 667495906, 666802526, 666036010, 665192664, 664337099, 663470328, 662585497]
3232.7F62585497r45330j061141j145780j214028j334488j484573j591384j629293
3249F52179480j450241q35538M1545P15851Q59559N56886J51217j67489m00722n51879
3269.4F51098669n40495m46260m69268o11663p86364r01758r24409r12785r00805q97110
3289.8F43707752r23157r99689j089573j167893j189649j067579r12607r98675j316786
3308.2F34042144j581907j686395j683116j643478j626552j648306j620472j582921
3324.5F20968997j775860k048254k099395k024531j933337j869738k036512k294957
3340.8F04886413k386749k483487k480448k264738k312004k658725k783775k651394
3357.1E84865093k591312k721846k779722k551556k422511k675355l011167l031432
$$ y = [662585497, 661640167, 660579026, 659433246, 658219218, 656884730, 655400157, 653808773, 652179480, 650729239, 649893701, 649935246, 650651097, 651510656, 652067542, 652218759, 652051270, 651650548, 651098669, 650558174, 650111914, 649642646, 649030983, 648244619, 647342861, 646418452, 645505667, 644604862, 643707752, 642784595, 641784906, 640695333, 639527440, 638337791, 637270212, 636357605, 635358930, 634042144, 632460237, 630773842, 629090726, 627447248, 625820696, 624172390, 622551918, 620968997, 619193137, 617144883, 615045488, 613020957, 611087620, 609217882, 607181370, 604886413, 602499664, 600016177, 597535729, 595270991, 592958987, 590300262, 587516487, 584865093, 582273781, 579551935, 576772213, 574220657, 571798146, 569122791, 566111624, 563080192]
3373.4E63080192k730489k461851k359152k362847k359450k196193j844585j456499
3389.7E45309126j494586j931667k014816j568318j219630j493692j925946j759350
3406.1E31901121j317084j171529j236677j343131j343370j093626q88109q79943p42197
3424.4E21885455m49300k70248l01122k59519n1439j10864m20153m01676o139L55303
3444.8E19970298M47154L49879L80099N48780P18176R25601J039624Q68559P92086
3463.2E26040256J132011J356662J013398N27084N52952R13739J169801J193643R39309
3481.5E34838855Q12650J018643J091659J011968J113534J251042J259148J167297
3497.8E43564796J136780J216054J057565Q08061R54687J288355J468062J384735J206279
$$ y = [563080192, 560349703, 557887852, 555528700, 553165853, 550806403, 548610210, 546765625, 545309126, 543814540, 541882873, 539868057, 538299739, 537080109, 535586417, 533660471, 531901121, 530584037, 529412508, 528175831, 526832700, 525489330, 524395704, 523507595, 522627652, 521885455, 521436155, 521165907, 520864785, 520605266, 520553827, 520442963, 520022810, 519621134, 519614995, 519970298, 520417452, 520767331, 521147430, 521696210, 522414386, 523339987, 524379611, 525248170, 526040256, 527172267, 528528929, 529542327, 530069411, 530622363, 531536102, 532705903, 533899546, 534838855, 535651505, 536670148, 537761807, 538773775, 539887309, 541138351, 542397499, 543564796, 544701576, 545917630, 546975195, 547783256, 548737943, 550026298, 551494360, 552879095, 554085374]
3516.2E54085374J224518J375735J529514J423359J129210J143754J351654J488507
3532.5E64751625J625776J601756J402140J511454J807690J739859J347483J195848
3548.8E76983631J356840J453459J513124J661479J793027J772761J543939J441479
3565.1E89519739J762033J946211J757979J712620J863539J983047K088904K159953
3581.5F04794025K151668K170504K174496K139151K099932K073228K094924K169788
3597.8F21867716K152086K018630J879215J768411J807987J861274J836300J846433
3614.1F37038052J709879J633167J786887J679361J380027J153648J148700J429677
3630.4F48959398J463771J310051J166463J047253R79483R32455Q07047O52015P33138
$$ y = [554085374, 555309892, 556685627, 558215141, 559638500, 560767710, 561911464, 563263118, 564751625, 566377401, 567979157, 569381297, 570892751, 572700441, 574440300, 575787783, 576983631, 578340471, 579793930, 581307054, 582968533, 584761560, 586534321, 588078260, 589519739, 591281772, 593227983, 594985962, 596698582, 598562121, 600545168, 602634072, 604794025, 606945693, 609116197, 611290693, 613429844, 615529776, 617603004, 619697928, 621867716, 624019802, 626038432, 627917647, 629686058, 631494045, 633355319, 635191619, 637038052, 638747931, 640381098, 642167985, 643847346, 645227373, 646381021, 647529721, 648959398, 650423169, 651733220, 652899683, 653946936, 654926419, 655858874, 656665921, 657317936, 658051074]
3648.8F58051074Q25285O12081N15878O89029P24793L88443J30296J61469R9659j16944
3669.2F62081063m7624R6380q3744r0659J75119K90990L37004M52340N50926K92301
3689.6F64054096O377J70589L03626K21789L2484r9837L3676J63853K0326j91272j24395
3712F64591312J45734J50621r3162k52843j71483j06275j53839j07348l4452k0862
3732.4F63947403N186J23382J66475j04069n71490o97016j50383L8803j43707j4782
3752.8F62599802J78933P2897j43648j77264q9049q0705j19030j52588j48714j48177
3773.2F61792457k15530k32756j98126k29240k64644k46585k07066j79172j79291k38180
3793.6F59601867l14295l24488l12209k38776j3650J2339j31011q2255K5630j6928
$$ y = [658051074, 658876359, 659488440, 660004318, 660693347, 661418140, 661806583, 661936879, 662098348, 662198007, 662081063, 662033439, 662129819, 662046075, 661955416, 662130535, 662421525, 662758529, 663210869, 663761795, 664054096, 664060473, 664231062, 664534688, 664756477, 664788961, 664689124, 664722800, 664886653, 664906979, 664715707, 664591312, 664737046, 664887667, 664794505, 664541662, 664370179, 664263904, 664110065, 664002717, 663968265, 663947403, 663952589, 664075971, 664242446, 664138377, 663566887, 662869871, 662719488, 662758291, 662614584, 662599802, 662778735, 662851632, 662707984, 662530720, 662441671, 662360966, 662241936, 662089348, 661940634, 661792457, 661576927, 661344171, 661146045, 660916805, 660652161, 660405576, 660198510, 660019338, 659840047, 659601867, 659287572, 658963084, 658650875, 658412099, 658398449, 658410788, 658279777, 658197522, 658223152, 658206224]
3814F58206224j44779j91272k76148k69532k2709O079j20699j86324j76847j41979
3834.4F56682014k21967k53439j03295m8399j073Q1420j9371l78132q08120m54187
3854.8F54475451J84834J52349q8394k73287k48730j49548k36273k64287j35064m4525
3875.2F53372526o3002k33531k38419m8935j05619k04564j93059k62499k15828j32084
3895.5F51674986l07977n11527m84705l58880k15471j22368j20580j46508k13147l42488
3915.9F48851335l81708k39432j79946k94269k57432q2254j31369l38972l96072l29555
3936.3F46220326k94327k74897k27570p1705J24335J69337J86861L16798L94643K92659
3956.7F46836460J53124J40369J26660R298r7632r4712n7280r9182j14262p3493q0109
$$ y = [658206224, 658061445, 657870173, 657594025, 657324493, 657301784, 657307863, 657187164, 657000840, 656823993, 656682014, 656460047, 656206608, 656103313, 656054914, 656053841, 656135261, 656115890, 655737758, 654929638, 654475451, 654660285, 654812634, 654724240, 654450953, 654202223, 654052675, 653816402, 653552115, 653417051, 653372526, 653309524, 653075993, 652837574, 652788639, 652683020, 652478456, 652285397, 652022898, 651807070, 651674986, 651367009, 650855482, 650370777, 650011897, 649796426, 649674058, 649553478, 649406970, 649193823, 648851335, 648469627, 648230195, 648050249, 647755980, 647498548, 647416294, 647284925, 646945953, 646549881, 646220326, 645925999, 645651102, 645423532, 645351827, 645476162, 645645499, 645832360, 646149158, 646543801, 646836460, 646989584, 647129953, 647256613, 647265911, 647168279, 647073567, 647016287, 646917105, 646802843, 646729350, 646649241]
3979.2F46649241o1392m1724j49905k49088k22325j62006j21772p9215m6432
3997.5F45515382
$$ y = [646649241, 646587849, 646546125, 646396220, 646147132, 645924807, 645762801, 645641029, 645561814, 645515382]
##END=$$ End of the data block
