##TITLE=G4-52-SE $$ Begin of the data block
##JCAMP-DX=5.00 $$ ACD/SpecManager v 10.08
##SPECTROMETER/DATA SYSTEM=Alpha
##DATE=17 Oct 2013 10:58:30
##DATA TYPE=INFRARED SPECTRUM
##DATA CLASS=XYDATA
##ORIGIN=
##OWNER=
##NPOINTS=1765
##FIRSTX=399.75695801
##LASTX=3997.56933594
##MAXX=3997.56933594
##MINX=399.75695801
##MAXY=0.82606232
##MINY=0.33036479
##XFACTOR=1.0000000000
##YFACTOR=1.000000000000000e-9
##FIRSTY=0.56556398
##DELTAX=2.03957629
##XUNITS=1/CM
##YUNITS=ARBITRARY UNITS
##XYDATA=(X++(Y..Y))
399.8E65563977k466917j213968j282215j034737M73261J425922Q13246j5795m98176
418.1E61764598r95994r82642j451373k543271k429604j141012k30789n85914j261592
436.5E50142407m41551J610160K578676J510382P7188k50102L65317L57986q04007
454.8E55146456j791477j971364j631618j740873k551734k894998k090812j233637
471.1E39239943j563668k344668k117396q20457K44081k14816j362025j365543n09143
489.5E29186308l62277j319825k283991k247274j562595j425505k261519l040969k703190
507.9E11979163j826704j790762k468824k775014k328694j453250q34137q69960r20176
526.2D96711642j65582R52363J483768J389921J532495K401233L081977K242982M17710
$$ y = [565563977, 563097060, 561883092, 560600877, 559566140, 560039401, 561465323, 562278569, 562262774, 561764598, 560768604, 559785962, 558334589, 555791318, 553361714, 552220702, 551989913, 551403999, 550142407, 549700856, 551311016, 553889692, 555400074, 555477262, 555227160, 555592477, 555950463, 555146456, 553354979, 551383615, 549751997, 548011124, 545459390, 542564392, 540473580, 539239943, 537676275, 535331607, 533214211, 532393754, 532637835, 532423019, 531060994, 529695451, 529186308, 528824031, 527504206, 525220215, 522972941, 521410346, 519984841, 517723322, 514682353, 511979163, 510152459, 508361697, 505892873, 503117859, 500789165, 499335915, 498501778, 497631818, 496711642, 496546060, 497498423, 498982191, 500372112, 501904607, 504305840, 507387817, 509630799, 510048509]
544.6E10048509o00577m44114j72317o49035j631200k112508j719654j275360j742125
562.9D99701619k665728k796650j868963p55817k61724q4758O77049K150685L180414
581.3D97276127L014028K415717K276480K393544J905382O23405l54171j58131N67674
599.6E09960055O35684o9440m82499Q7976R40383J012862L59475j8298P52687K169430
620E15348315K762735K363861K052963K417504K828956K457261J532078J045704J392960
638.4E34202337J935125J733005Q67128M14670P81476J076520O18994l8922j67906
656.7E41422427L24666R14633R39966M46200J12414Q00908J636326J434148R18030
675.1E48949718Q23081J459599J870572J358032N81503L95656P66456P92027j82808
$$ y = [510048509, 509447932, 509003818, 508831501, 508182466, 506551266, 504438758, 502719104, 501443744, 499701619, 497035891, 494239241, 492370278, 491614461, 491352737, 491267979, 491945028, 494095713, 497276127, 500290155, 502705872, 504982352, 507375896, 509281278, 509904683, 509550512, 509392381, 509960055, 510595739, 510526299, 510043800, 510131776, 511072159, 512085021, 512444496, 512426198, 513178885, 515348315, 518111050, 520474911, 522527874, 524945378, 527774334, 530231595, 531763673, 532809377, 534202337, 536137462, 537870467, 538737595, 539152265, 539933741, 541010261, 541629255, 541590333, 541422427, 541747093, 542661726, 543601692, 544047892, 544160306, 544961214, 546597540, 548031688, 548949718, 549772799, 551232398, 553102970, 554461002, 555042505, 555438161, 556204617, 556996644, 556813836]
693.5E56813836j334131j397669m60684L64899N15163N28217J240313K392888L005981
711.8E61668813K897620K748669L250897M296779M807413M273116L631056L626942
728.1E91201305L915966L624976K557516J512527J213193J354396J009822Q2791o59168
746.5F05813324o46531l41714o06060j381456j808465j461506q00490l47138j1503
764.8E98408461Q05318K338469L926992M700721M673779M591703M812062M824758M079997
783.2F33162260K970159K239287K128899K331913K257883J815260J873493K699077
799.5F51478231L373206L214895K418459J809597J794457J787484J155078K16365k94506
817.9F66953266l13521m77433j216829k262175k886772k685308k307892k545834l086269
$$ y = [556813836, 555479705, 554082036, 553621352, 553986251, 554501414, 555029631, 556269944, 558662832, 561668813, 564566433, 567315102, 570565999, 574862778, 579670191, 583943307, 587574363, 591201305, 595117271, 598742247, 601299763, 602812290, 604025483, 605379879, 606389701, 606472492, 605813324, 605166793, 604825079, 604219019, 602837563, 601029098, 599567592, 598767102, 598419964, 598408461, 599213779, 601552248, 605479240, 610179961, 614853740, 619445443, 624257505, 629082263, 633162260, 636132419, 638371706, 640500605, 642832518, 645090401, 646905661, 648779154, 651478231, 654851437, 658066332, 660484791, 662294388, 664088845, 665876329, 667031407, 667247772, 666953266, 666639745, 666162312, 664945483, 662683308, 659796536, 657111228, 654803336, 652257502, 649171233]
836.2F49171233l072738k434731j890063j960099k240896j915574j095176o44565q76546
854.6F33040845j166880n81383J103401L025651M277885M928827N448639N645514M869163
872.9F60591662L083110J076400m93467j770496l200352m611791n337953n177021m714668
891.3F39445424m599452m757523m699827m403591m408300n025863n888761o346166
907.6E99315941o252288o104351o137967n917251n021632l638267k312899j460790
923.9E62470496j067400p70688m02928j46568j38521k55108k62200k62619q49545k431929
944.3E55882990m677236o801188q289873r142995r542942r571374r281337q901924
960.6D89674121q663446q495539q098394p315308o334900n397261m487097l499508
$$ y = [649171233, 646098495, 643663764, 641773701, 639813602, 637572706, 635657132, 634561956, 633917391, 633040845, 631873965, 631292582, 632395983, 635421634, 639699519, 644628346, 650076985, 655722499, 660591662, 663674772, 664751172, 664257705, 662487209, 659286857, 654675066, 649337113, 644160092, 639445424, 634845972, 630088449, 625388622, 620985031, 616576731, 611550868, 605662107, 599315941, 593063653, 586959302, 580821335, 574904084, 569882452, 566244185, 563931286, 562470496, 561403096, 560632408, 560229480, 560082912, 559944391, 559689283, 559427083, 559164464, 558314919, 555882990, 551205754, 544404566, 536114693, 526971698, 517428756, 507857382, 498576045, 489674121, 481010675, 472515136, 464416742, 457101434, 450766534, 445369273, 440882176, 437382668]
977D37382668k525270j818210j550704j601308j666308j621306j569122j541108j395732
995.3D22093600j036853n12093m5121O3658j87158n63175r41634j283497j545965j671344
1015.7D14370418j595498j451492j488209j717865j910001j904041j777619j706123
1032D00819570j798719j933366j909525j774311j708388j708597j563698j170993o79612
1050.4C86572361k43396J77712O83576J205652J601905J857758J990407J869530J160979
1068.7C96876484j43051j264065j360387m23074R55910K264887L244370L857315M206806
1087.1D08215195M371583M308254L992110L507495K931744K351612J839578J429826
1103.4D32947397J236230J422495J874268K245307K378911K342552K239913K087056
$$ y = [437382668, 434857398, 433039188, 431488484, 429887176, 428220868, 426599562, 425030440, 423489332, 422093600, 421056747, 420544654, 420499533, 420563191, 420376033, 419812858, 418871224, 417587727, 416041762, 414370418, 412774920, 411323428, 409835219, 408117354, 406207353, 404303312, 402525693, 400819570, 399020851, 397087485, 395177960, 393403649, 391695261, 389986664, 388422966, 387251973, 386572361, 386328965, 386506677, 387190253, 388395905, 389997810, 391855568, 393845975, 395715505, 396876484, 396733433, 395469368, 394108981, 393685907, 394641817, 396906704, 400151074, 404008389, 408215195, 412586778, 416895032, 420887142, 424394637, 427326381, 429677993, 431517571, 432947397, 434183627, 435606122, 437480390, 439725697, 442104608, 444447160, 446687073, 448774129]
1119.7D48774129J810670J469255J316249J557469K145469K604902K473712J899064
1136D64050919J262635O93887J43707m07457q20160q70943n74351k25663L2038M19169
1156.4D63703781J168520K142071K928853L329188L536671L830672M278213M690647
1172.7D89608616M905462N066603N408228N782306N803227N424679M968464M602730
1189.1E31570315M082382L110766J830698P71820K07365j12236m84228q32379q41319
1207.4E39303184m24147K8610J00434j18554k51293k04742k46107n97358j115084j442969
1227.8E35031974j481175j388252j338661j292884j008451m44889J54078N92589R30667
1246.2E29754996J340688J830220K166867K205133K090037K058030K146959K181947
$$ y = [448774129, 450584799, 452054054, 453370303, 454927772, 457073241, 459678143, 462151855, 464050919, 465313554, 466007441, 466151148, 465743691, 464923531, 464052588, 463478237, 463252574, 463284612, 463703781, 464872301, 467014372, 469943225, 473272413, 476809084, 480639756, 484917969, 489608616, 494514078, 499580681, 504988909, 510771215, 516574442, 521999121, 526967585, 531570315, 535652697, 538763463, 540594161, 541365981, 541573346, 541461110, 540976882, 540144503, 539303184, 538879037, 538907647, 539008081, 538889527, 538638234, 538433492, 538187385, 537590027, 536474943, 535031974, 533550799, 532162547, 530823886, 529531002, 528522551, 528077662, 528231740, 528824329, 529754996, 531095684, 532925904, 535092771, 537297904, 539387941, 541445971, 543592930, 545774877]
1262.5E45774877K080023J961410J968205K054751J983762J617313J167595R16064
1278.8E59524000R26256J052797J087606R69112Q19265O81520L83437j38700p78258
1297.2E64527035j281083j479626j535475j650452j783193j711785j356185r06825
1313.5E52822411n60105k52723J00672L66091K68221l00884j124084j787960k020061
1331.8E47511578j948476j783312j612007j371026r57787n64039n05626p48337j021087
1350.2E36999881j190781j353324j600146j832247k083897k573371l173292l499150
1366.5E19693673l479004k990306k514302k649665l065110l417015l686934l569067
1382.8D94322270k866268k005965j235455n12391m6522O1244M8578R7871M20391J024664
$$ y = [545774877, 547854900, 549816310, 551784515, 553839266, 555823028, 557440341, 558607936, 559524000, 560450256, 561503053, 562590659, 563559771, 564379036, 565060556, 565443993, 565305293, 564527035, 563245952, 561766326, 560230851, 558580399, 556797206, 555085421, 553729236, 552822411, 552262306, 552009583, 552110255, 552476346, 552744567, 552443683, 551319599, 549531639, 547511578, 545563102, 543779790, 542167783, 540796757, 539838970, 539274931, 538769305, 538020968, 536999881, 535809100, 534455776, 532855630, 531023383, 528939486, 526366115, 523192823, 519693673, 516214669, 513224363, 510710061, 508060396, 504995286, 501578271, 497891337, 494322270, 491456002, 489450037, 488214582, 487702191, 487655669, 487716913, 487765491, 487863362, 488283753, 489308417]
1403.2D89308417J503050J596540J539022J570433J729697J989037K141863K037108
1419.5E03415167J852215J931250J920223J517177Q57710K55228J4066l47018q07405
1437.9E10608613n26785P5578N20289P10905N14150J89602K11477P88212J707256K133429
1458.3E16932726J972139K225816K728224L053009L689885N231619P169724P379472
1474.6E50382614O010354M658758L400147K237380J143157o5088j806438l532171l904104
1493E58524609m118026n210459n746365n219578m536391n467057q612931q770406p362783
1511.3E03480613o764501n605728l928005k373278k036363k290041k322465k516836
1527.6D75643396k263605j906961j922578j365125n41657n39273o60360M6283R23127
$$ y = [489308417, 490811467, 492408007, 493947029, 495517462, 497247159, 499236196, 501378059, 503415167, 505267382, 507198632, 509118855, 510636032, 511493742, 511748970, 511763036, 511416018, 510608613, 510081828, 510157406, 510677695, 511388600, 511902750, 512092352, 512303829, 513092041, 514799297, 516932726, 518904865, 521130681, 523858905, 526911914, 530601799, 535833418, 543003142, 550382614, 556392968, 561051726, 564451873, 566689253, 567832410, 567767322, 565960884, 562428713, 558524609, 554406583, 549196124, 543449759, 538230181, 533693790, 528226733, 519613802, 510843396, 503480613, 496716112, 491110384, 487182379, 484809101, 482772738, 480482697, 478160232, 475643396, 473379791, 471472830, 469550252, 468185127, 467643470, 467104197, 466443837, 466490120, 467413247]
1546D67413247J804560K657950L365248M015744M514963N129754M736751L258646L117204
1564.3E00014067L371119L179729K677441K112210J970946J704276R53674M61221K03192
1582.7E16647875R2686j01388n28574j108706j595020k092779k662301l320754m132270
1601.1E01198769m909516n538255o270796p338017q043528q057057q951813j0923893
1617.4D41165894j0249614r713024j1330754j1539906j0789395j0307997q882642p918000
1633.7C60434562q311451o531000l502071j608371k69592P57337J472324J840591K493888
1652C46776217L238321L126949L510922M625529N826086O560236O611019P354558Q191228
1670.4C95821065P659852P871539Q530855Q215695Q179278R299606J1180967J0445088
$$ y = [467413247, 469217807, 471875757, 475241005, 479256749, 483771712, 488901466, 493638217, 496896863, 500014067, 503385186, 506564915, 509242356, 511354566, 513325512, 515029788, 515983462, 516444683, 516647875, 516740561, 516639173, 516110599, 515001893, 513406873, 511314094, 508651793, 505331039, 501198769, 496289253, 490750998, 484480202, 477142185, 469098657, 461041600, 452089787, 441165894, 430916280, 421203256, 409872502, 398332596, 387543201, 377235204, 368352562, 360434562, 352123111, 345592111, 342090040, 340481669, 340212077, 340969414, 342441738, 344282329, 346776217, 350014538, 353141487, 356652409, 361277938, 367104024, 373664260, 380275279, 387629837, 395821065, 403480917, 411352456, 419883311, 428099006, 436278284, 445577890, 456758857, 467203945]
1686.7D67203945R555519J0702341J1544615J3800532J5697062J5424192J6048133
1701E59976339J3306797J1076152J0705888R195626Q000493P334888O830454O346166
1717.3F32772803N129278L982902L589928L366053L003776K787769K568006K266765
1733.6F59467280J796186J706779K080917K498746L051818L829956M623711N256474
1749.9F84311867N504310N279660N303145N338549N068779M903913M434108M062236
1766.3G24206567M027843L880799L554463K969265K511204K469063K445697K258420
1782.6G48323321K047241J910448J950503J988172J782954J468658J438082J520097
1798.9G62429476J481771J337052J254558J299024J351416J316309J176476J089454
$$ y = [467203945, 476759464, 487461805, 499006420, 512806952, 528504014, 543928206, 559976339, 573283136, 584359288, 595065176, 604260802, 612261295, 619596183, 626426637, 632772803, 637902081, 641884983, 645474911, 648840964, 651844740, 654632509, 657200515, 659467280, 661263466, 662970245, 665051162, 667549908, 670601726, 674431682, 679055393, 684311867, 689816177, 695095837, 700398982, 705737531, 710806310, 715710223, 720144331, 724206567, 728234410, 732115209, 735669672, 738638937, 741150141, 743619204, 746064901, 748323321, 750370562, 752281010, 754231513, 756219685, 758002639, 759471297, 760909379, 762429476, 763911247, 765248299, 766502857, 767801881, 769153297, 770469606, 771646082, 772735536]
1815.2G72735536J079083J138806J200557J210332J147449J059293R67682Q06391P34150
1833.6G82079279P43032P61568Q50380R75132Q50320N30958M70102N73098N97299N57839
1854G88989007N51284N91278O20186N65529N48780O15776N81085M09305L24071L72469
1874.4G94168770M47512N20349N41329N11587M73141N13971N80490N24699M32909L92795
1894.7G99107552L76224L91066M11272L56019L16739L70443L87490K92897K25484L12626
1915.1H02547812M11630L62337K33412J37209J47224K36094K59459K20895J90794J97530
1935.5H04944396K62380K93135K11597J10447J22845J71245J72674J59800K02835K87294
1955.9H06938648K66493J82271J68979K37345K76626K05218J04368R6381J84893K45333
$$ y = [772735536, 773814619, 774953425, 776153982, 777364314, 778511763, 779571056, 780538738, 781345129, 782079279, 782822311, 783583879, 784434259, 785409391, 786259711, 786790669, 787260771, 787833869, 788431168, 788989007, 789540291, 790131569, 790751755, 791317284, 791866064, 792481840, 793062925, 793472230, 793796301, 794168770, 794616282, 795136631, 795677960, 796189547, 796662688, 797176659, 797757149, 798281848, 798714757, 799107552, 799483776, 799874842, 800286114, 800642133, 800958872, 801329315, 801716805, 802009702, 802235186, 802547812, 802959442, 803321779, 803555191, 803692400, 803839624, 804075718, 804335177, 804556072, 804746866, 804944396, 805206776, 805499911, 805711508, 805821955, 805944800, 806116045, 806288719, 806448519, 806651354, 806938648, 807205141, 807387412, 807556391, 807793736, 808070362, 808275580, 808379948, 808476329, 808661222, 808906555]
1976.3H08906555J93000R3818Q3387J40607J72973J57177R4056L4988O2823J10150
1996.7H10049534R6142N3167J2160K0087Q046q0764j50025j07944l9935r1434k10464
2019.2H09558570k43544j66118j19210j79290k62499k49505j65999j17898j63138k22862
2039.6H07668507j98960j44661j05738j12295j09852l1352N2512N4896J5020J2815
2060H07100892P3612J34587J09613M7565K8967P2301J30594J63018J20223L3915K1160
2082.4H08036447Q8930J43528J22070R3877J09732J45257J54376J28984R7573J22369
2102.8H09243143K11715K30909J31547N4300J09375J86860J49310M7564Q464N4896
2123.2H10428083J41501J56761N5551J4603R5606J67608J32919K6345J0669J39475
$$ y = [808906555, 809099555, 809193373, 809276760, 809417367, 809590340, 809747517, 809841573, 809876561, 809939384, 810049534, 810145676, 810198843, 810211003, 810231090, 810239136, 810158372, 810008347, 809900403, 809860468, 809769034, 809558570, 809315026, 809148908, 809029698, 808850408, 808587909, 808338404, 808172405, 808054507, 807891369, 807668507, 807469547, 807324886, 807219148, 807106853, 806997001, 806965649, 807018161, 807073057, 807088077, 807100892, 807174504, 807309091, 807418704, 807466269, 807495236, 807567537, 807698131, 807861149, 807981372, 808015287, 808036447, 808125377, 808268905, 808390975, 808484852, 808594584, 808739841, 808894217, 809023201, 809120774, 809243143, 809454858, 809685767, 809817314, 809871614, 809980989, 810167849, 810317159, 810364723, 810373187, 810428083, 810569584, 810726345, 810781896, 810796499, 810892105, 811059713, 811192632, 811218977, 811229646, 811369121]
2143.6H11369121K19524J36793K8371O4195K09391K65658J82509J15097J86145L16799
2164H13093603L51607K65301K14338L31044M79102M59075L13580K36392L15190M27127
2184.4H16486359L93152K70247K48254L51429M38094L73959K24829K03550L44336M18425
2204.8H19752634L08990J86384K29060L66271M06802L06964J82092J82211K99454L50118
2225.2H22570980K33769J07527J36792K37406K43306J44303P9751J11103J89960K09272
2245.6H24264169R8347R060Q3685J75596J42157P0095O1988J23322J54853J04726M6551
2268H25334549N0843J18375J67965J31488M2796K6107P9870R0182K0147p4566r4950
2290.4H25892806m7386j3530k9921j00017j76787j53661r0361j52826k65420k60293
$$ y = [811369121, 811588645, 811725438, 811753809, 811818004, 812027395, 812293053, 812475562, 812590659, 812776804, 813093603, 813445210, 813710511, 813924849, 814255893, 814734995, 815194070, 815507650, 815744042, 816059232, 816486359, 816879511, 817149758, 817398012, 817749441, 818187535, 818561494, 818786323, 818989873, 819334209, 819752634, 820061624, 820248008, 820477068, 820843339, 821250141, 821557105, 821739197, 821921408, 822220862, 822570980, 822804749, 822912276, 823049068, 823286474, 823529780, 823674083, 823753834, 823864937, 824054897, 824264169, 824362516, 824371576, 824455261, 824630857, 824773014, 824843109, 824905097, 825028419, 825183272, 825287998, 825334549, 825385392, 825503767, 825671732, 825803220, 825846016, 825872123, 825951993, 826042175, 826062322, 825987756, 825892806, 825845420, 825831890, 825801969, 825701952, 825525165, 825371504, 825281143, 825128317, 824862897, 824602604]
2310.8H24602604j83284j28389j69694l27051m21643l31402j99616k51532m15921m37200
2331.2H21736872k50041r8586k09213l66151l36230j67429J44064L23177J6808m76122
2351.6H20317149p38799p54297o92785n32389k99871o4492J19031K21550K04504J90436
2372H17970037K93613L24368K05458J62422K22624K15113O0558j59919l07143l06308
2392.4H18680823k34187k38001l31819l98934l63588k94924l20971m32849m99249m64201
2412.8H15102100m19676m62711n37991n41807m75645m36246n03123n95271o01828n52238
2433.2H09975564n34415n68092o02364n90384n58019n55515n87642o25968o09696n53191
2453.6H04190278n24461n50270o05583o12736n60642n19394n22316n48243n65529n56231
$$ y = [824602604, 824419320, 824290931, 824121237, 823794186, 823372543, 823041141, 822841525, 822589993, 822174072, 821736872, 821486831, 821388245, 821179032, 820812881, 820476651, 820309222, 820453286, 820776463, 820793271, 820317149, 819578350, 818824053, 818131268, 817598879, 817299008, 817234516, 817353547, 817575097, 817779601, 817970037, 818263650, 818588018, 818793476, 818955898, 819178522, 819393635, 819454193, 819294274, 818987131, 818680823, 818446636, 818208635, 817876816, 817477882, 817114294, 816819370, 816498399, 816065550, 815566301, 815102100, 814682424, 814219713, 813681722, 813139915, 812664270, 812228024, 811724901, 811129630, 810527802, 809975564, 809441149, 808873057, 808270693, 807680309, 807122290, 806566775, 805979133, 805353165, 804743469, 804190278, 803665817, 803115547, 802509964, 801897228, 801336586, 800817192, 800294876, 799746633, 799181104, 798624873]
2474G98624873n16057n04076n66900n89192n30899m88281m89294n33760n67734n42462
2494.4G93296218m81308m48703m78626n12182m97699m56870m59254n04434n15580m75943
2514.8G88465619m46021m67122n21004n52297n23209m99428n51045o29186o42360n82635
2535.2G83051312n37515n75065o48380o53803n77271n04076n15759n97060o40810o05762
2555.6G77195811n67317n64456n71191n56111n18203m93109n10753n69999o05643n68688
2576G71670341n30004n56111o03855o08921n58972n17250n32388n66364n63085n14388
2596.4G66119003m83215n33461o12378o36995o42598o53445o69718p28727p93695q19028
2616.8G59545743q19027q49545r34541r92537r73403r59695r76443r87708j020194
$$ y = [798624873, 798108816, 797604740, 797037840, 796448648, 795917749, 795429468, 794940174, 794406414, 793838680, 793296218, 792814910, 792366207, 791887581, 791375399, 790877700, 790420830, 789961576, 789457142, 788941562, 788465619, 788019598, 787552476, 787031472, 786479175, 785955966, 785456538, 784905493, 784276307, 783633947, 783051312, 782513797, 781938732, 781290352, 780636549, 780059278, 779555202, 779039443, 778442383, 777801573, 777195811, 776628494, 776064038, 775492847, 774936736, 774418533, 773925424, 773414671, 772844672, 772239029, 771670341, 771140337, 770584226, 769980371, 769371450, 768812478, 768295228, 767762840, 767196476, 766633391, 766119003, 765635788, 765102327, 764489949, 763852954, 763210356, 762556911, 761887193, 761158466, 760364771, 759545743, 758726716, 757877171, 756942630, 755950093, 754976690, 754016995, 753040552, 752052844, 751032650]
2635.1G51032650j042664j001119r71973j031995j081347j051426j015365j016856
2651.4G42819905j043081j051307j020610r92417r91464r88245r67741r37164r23872
2669.8G33904004r46700r77099r52959q80123q39412q43108q62181q85665q79407q26836
2690.2G25010514q43823r41217r73403r44793r44197r96590j046360j056969j059472
2708.5G16203690j064897j066327j074493j085460j076579j052440j038193j038850
2724.8G07706451j011133r53197r28402r60112r52959q81195q63612q95619r04977
2743.2F99355245q77560q34584q16107q23438q40902q43227q14259p85172p82311q16524
2763.6F91121161q68499q78215q65162q76963r19759r90033j040459j053214j060784
$$ y = [751032650, 749989986, 748988867, 748016894, 746984899, 745903552, 744852126, 743836761, 742819905, 741776824, 740725517, 739704907, 738712490, 737721026, 736732781, 735765040, 734827876, 733904004, 732957304, 731980205, 731027246, 730147123, 729307711, 728464603, 727602422, 726716757, 725837350, 725010514, 724166691, 723225474, 722252071, 721307278, 720363081, 719366491, 718320131, 717263162, 716203690, 715138793, 714072466, 712997973, 711912513, 710835934, 709783494, 708745301, 707706451, 706695318, 705742121, 704813719, 703853607, 702900648, 702019453, 701155841, 700260222, 699355245, 698477685, 697643101, 696826994, 696003556, 695162654, 694319427, 693505168, 692719996, 691937685, 691121161, 690252662, 689374447, 688509285, 687632322, 686712563, 685722530, 684682071, 683628857, 682568073]
2782F82568073j083374j143217j201689j207769j231551j309395j387775j444936j483023
2800.3F71075344j514792j546443j587212j625955j653671j703084j778066j836419
2816.6F57829702j869619j916230k021730k151429k206743k220690k312303k500832
2832.9F40630126k725184k973676l323853l824174m470408n181551n711794n808473
2849.3F06611013n379319m425883l162563k090573j623333j809001k405286l058314
2865.6E82656741l540397l734707l501952k933860k281904j661241j189709r82463
2881.9E62830508j001239j098037j172125j271188j453281j662850j857221k034068
2898.2E51280499k184332k387404k702296l057361l426552l862679m376590m888594
$$ y = [682568073, 681484699, 680341482, 679139793, 677932024, 676700473, 675391078, 674003303, 672558367, 671075344, 669560552, 668014109, 666426897, 664800942, 663147271, 661444187, 659666121, 657829702, 655960083, 654043853, 652022123, 649870694, 647663951, 645443261, 643130958, 640630126, 637904942, 634931266, 631607413, 627783239, 623312831, 618131280, 612419486, 606611013, 601231694, 596805811, 593643248, 591552675, 589929342, 588120341, 585715055, 582656741, 579116344, 575381637, 571879685, 568945825, 566663921, 565002680, 563812971, 562830508, 561829269, 560731232, 559559107, 558287919, 556834638, 555171788, 553314567, 551280499, 549096167, 546708763, 544006467, 540949106, 537522554, 533659875, 529283285, 524394691]
2914.5E24394691n191922n103052m657030l950298l016948j900554o85901M80324J503051
2932.9E01872361K454698L356874M033685M343450M253983L774107L062725K334594
2949.2E29486477J660943J095295Q19624R85205J531422K237320K921283L571928M209161
2967.6E48518658M764914N147636N291462N222201N074621M902959M583895M102170
2983.9E87608516L621161L230274K869427K401888J788855J168072O36578J54257l13938
3002.2F03165090p43687j041353j104533j011312r56238r72867r77337r66132j043677
3020.6E94347954j284838j597464j813889j825988j723051j725435j865626j969337
3036.9E80542326j983345k018928k113879k225816k285004k249896k210796k265036
$$ y = [524394691, 519202769, 514099717, 509442687, 505492389, 502475441, 500574887, 499888986, 500369310, 501872361, 504327059, 507683933, 511717618, 516061068, 520315051, 524089158, 527151883, 529486477, 531147420, 532242715, 533062339, 534047544, 535578966, 537816286, 540737569, 544309497, 548518658, 553283572, 558431208, 563722670, 568944871, 574019492, 578922451, 583506346, 587608516, 591229677, 594459951, 597329378, 599731266, 601520121, 602688193, 603324771, 603479028, 603165090, 602421403, 601380050, 600275517, 599264205, 598307967, 597335100, 596357763, 595391631, 594347954, 593063116, 591465652, 589651763, 587825775, 586102724, 584377289, 582511663, 580542326, 578558981, 576540053, 574426174, 572200358, 569915354, 567665458, 565454662, 563189626]
3053.2E63189626k339721k327263k220154k060056j935482j888335j822710j675248
3069.5E46920657j547754j520276j491904j397967j322210j294434j267553j245021
3085.8E35833538j196564j072406j001955j056611j086295j052141j048446j111865
3102.2E27207255j198887j221121j207590j261890j305878j282930j323998j429856
3118.5E16975105j531244j652240j714170j682341j661003j674652j749277j851022
3134.8E03459156j842559j791417j844883j930803j968205j971811j924396j869261
3151.1D88315821j939893k113074k196342k125710k003223j964122k061963k177507
3167.4D71733987k169728k078980k038598k081722k146155k140611k089739k095580
$$ y = [563189626, 560849905, 558522642, 556302488, 554242432, 552306950, 550418615, 548595905, 546920657, 545372903, 543852627, 542360723, 540962756, 539640546, 538346112, 537078559, 535833538, 534636974, 533564568, 532562613, 531506002, 530419707, 529367566, 528319120, 527207255, 526008368, 524787247, 523579657, 522317767, 521011889, 519728959, 518404961, 516975105, 515443861, 513791621, 512077451, 510395110, 508734107, 507059455, 505310178, 503459156, 501616597, 499825180, 497980297, 496049494, 494081289, 492109478, 490185082, 488315821, 486375928, 484262854, 482066512, 479940802, 477937579, 475973457, 473911494, 471733987, 469564259, 467485279, 465446681, 463364959, 461218804, 459078193, 456988454, 454892874]
3183.7D54892874k128721k107411k053112k010375j995385k015948k028436j972705
3200.1D38580781j881689j842528j837313j832009j821786j778424j729697j714140
3216.4D24143195j747519j781076j760781j768887j808494j788557j755774j771628
3232.7D09960479j882077k022832k063692k053618k063245k105296k182722k256453
3249C93330544k261251k238750k290220k365529k356559k284288k241940k215117k125114
3267.4C72951776j986802j887232j822323j719713j576751j436353j306921j176745
3283.7C60038936j053959r60261q72582p61807o51538n75632n45740n04881l95000
3302C53717536k51532k07543l03447l72291l43144k76893k12193j87188j84417j61678
$$ y = [454892874, 452764153, 450656742, 448603630, 446593255, 444597870, 442581922, 440553486, 438580781, 436699092, 434856564, 433019251, 431187242, 429365456, 427587032, 425857335, 424143195, 422395676, 420614600, 418853819, 417084932, 415276438, 413487881, 411732107, 409960479, 408078402, 406055570, 403991878, 401938260, 399875015, 397769719, 395586997, 393330544, 391069293, 388830543, 386540323, 384174794, 381818235, 379533947, 377292007, 375076890, 372951776, 370964974, 369077742, 367255419, 365535706, 363958955, 362522602, 361215681, 360038936, 358984977, 358024716, 357152134, 356390327, 355738789, 355163157, 354617417, 354112536, 353717536, 353466004, 353258461, 352955014, 352582723, 352239579, 351962686, 351750493, 351563305, 351378888, 351217210]
3322.4C51217210j71065k59370l25828l12657l13252l28272l27170l96163n06758n54830
3342.8C47721845n75870n80639n64992o31661p35551p31498o74844o87062p37459p40617
3363.2C41061652o70702o31690p34925q64357q49902p39068o76394o67363o51270n76109
3383.6C33999872m64141l53754k51561k98798m71682m64290k12789l6895j87754l98964
3404C30859244l06189j09405n0008k8848J1712N5939J18494J62840J89543L13341N44846
3426.5C31761509P22647P18266P27355Q24303P75098O55502P03127R05871J099080
3444.8C38892758J161724J134992J150787J206219J288563J427472J519680J471758
3461.1C49253953J487016J677662J795918J638740J362890J367093J644492J910537
$$ y = [351217210, 351046145, 350786775, 350460947, 350148290, 349835038, 349506766, 349179596, 348783433, 348276675, 347721845, 347145975, 346565336, 346000344, 345368683, 344633132, 343901634, 343226790, 342539728, 341802269, 341061652, 340390950, 339759260, 339024335, 338159978, 337310076, 336571008, 335894614, 335227251, 334575981, 333999872, 333535731, 333181977, 332930416, 332631618, 332159936, 331695646, 331482857, 331445962, 331258208, 330859244, 330553055, 330443650, 330393642, 330364794, 330376506, 330432445, 330550939, 330713779, 330903322, 331216663, 331761509, 332484156, 333202422, 333929777, 334754080, 335529178, 336184680, 336887807, 337793678, 338892758, 340054482, 341189474, 342340261, 343546480, 344835043, 346262515, 347782195, 349253953, 350740969, 352418631, 354214549, 355853289, 357216179, 358583272, 360227764, 362138301]
3477.4C62138301J973599J827568J760632J903892J989960J932174J926661J993388
3493.8C77446175K076983K116740K126276K087981J930684J855284K009302K209872
3510.1C93859297K346695K329915K171338K172261K373159K546400K457500K271562
3526.4D12528127K297551K420694K537846K663821K667576K601564K736032K938867
3542.7D33392078K915114K701700K655387K829790K924174K889245K935648L109903
3559D56353039L250837L272682L230810L334225L480404L461153L445595L511638L639519
3577.4D86979902L860891M012078M004866L930926L843129L868281L930867L985286
3593.7E18416226M056215M124463M166603M159570M120171M067480M163742M307151
$$ y = [362138301, 364111900, 365939468, 367700100, 369603992, 371593952, 373526126, 375452787, 377446175, 379523158, 381639898, 383766174, 385854155, 387784839, 389640123, 391649425, 393859297, 396205992, 398535907, 400707245, 402879506, 405252665, 407799065, 410256565, 412528127, 414825678, 417246372, 419784218, 422448039, 425115615, 427717179, 430453211, 433392078, 436307192, 439008892, 441664279, 444494069, 447418243, 450307488, 453243136, 456353039, 459603876, 462876558, 466107368, 469441593, 472921997, 476383150, 479828745, 483340383, 486979902, 490840793, 494852871, 498857737, 502788663, 506631792, 510500073, 514430940, 518416226, 522472441, 526596904, 530763507, 534923077, 539043248, 543110728, 547274470, 551581621]
3610E51581621M249335M153728M055500M022062M172504M140973L989994L853143L865480
3628.4E88084340M034221L834307L661514L691792L721893L764331L795922L767908
3644.7F18356228L683209L571570L398717L116965K943516L133952L231049K976835
3661F44412041K804577K892494K885640K673566K691388K569318K129913K030134K104044
3679.4F67193115K093792K244532K430141K356052J933754J591623J609861J670659
3695.7F83123529J670659J624524J449049J317858J390517J533091J458109J119911
3712F94687247R81510J038849J127541J178146J093030R04500Q26717J033783J247108
3730.3G04118431J286208J012743O56068Q07047J054645P71343N91278J095295J005292
$$ y = [551581621, 555830956, 559984684, 564040184, 568062246, 572234750, 576375723, 580365717, 584218860, 588084340, 592118561, 595952868, 599614382, 603306174, 607028067, 610792398, 614588320, 618356228, 622039437, 625611007, 629009724, 632126689, 635070205, 638204157, 641435206, 644412041, 647216618, 650109112, 652994752, 655668318, 658359706, 660929024, 663058937, 665089071, 667193115, 669286907, 671531439, 673961580, 676317632, 678251386, 679843009, 681452870, 683123529, 684794188, 686418712, 687867761, 689185619, 690576136, 692109227, 693567336, 694687247, 695668757, 696707606, 697835147, 699013293, 700106323, 701010823, 701837540, 702871323, 704118431, 705404639, 706417382, 707073450, 707880497, 708935142, 709706485, 710297763, 711393058, 712398350]
3748.7G12398350L71576L57091P53284P90655O10948O77526Q06033P57158O77705N30302
3769.1G18730628M94481O30140P20262P19905N66125M70877N26071N28752N12958N53489
3789.5G24453688O44147O96659O65009O91235N89371M42564N22733L01540R6321M38452
3809.9G29541719Q23498P46369M62294N32329M01556J61887L28660M35709M37379M47691
3830.3G34319091N69880P49469M99427P1943R7692K37107K73109L96609O87003O80327
3850.7G38581657m3749k53082M09365N64814M48703L53277L46720L20554J15931J29700
3871.1G40973890K36153K57969L65556L22759L24309L61859K00093J79887J64688M7624
3891.5G43434787K19524M33743L74019K44319Q7202q5294o7592K0742Q7381K33710
$$ y = [712398350, 712769926, 713127017, 713880301, 714670956, 715281904, 715959430, 716765463, 717522621, 718200326, 718730628, 719225109, 719855249, 720575511, 721295416, 721861541, 722332418, 722858489, 723387241, 723900199, 724453688, 725097835, 725794494, 726459503, 727150738, 727740109, 728182673, 728705406, 729006946, 729103267, 729541719, 730365217, 731111586, 731573880, 732106209, 732507765, 732669652, 732998312, 733434021, 733871400, 734319091, 734888971, 735638440, 736137867, 736209810, 736307502, 736544609, 736817718, 737214327, 737901330, 738581657, 738537908, 738284826, 738694191, 739259005, 739707708, 740060985, 740407705, 740728259, 740844190, 740973890, 741210043, 741468012, 741833568, 742156327, 742480636, 742842495, 743042588, 743222475, 743387163, 743434787, 743654311, 744088054, 744462073, 744706392, 744793594, 744708300, 744640708, 744661450, 744748831, 744982541]
3911.9G44982541L31342K37882R7454Q6367J41740J69277J77502J63436J06991P5101
3932.3G46569633J26839J47343J31726J29402J12057J31547J67072J64449J25825Q6368
3952.7G47892261J22964J88708J79827J34945J24276R2089L6538O4731J67191K03490
3973.1G49207020J38402P9512O4254Q4341J43528J75297J08063K9326N4359J28031
3993.4G50212133J98066K31207
3997.5G50641406
$$ y = [744982541, 745313883, 745551765, 745649219, 745735586, 745877326, 746046603, 746224105, 746387541, 746494532, 746569633, 746696472, 746843815, 746975541, 747104943, 747217000, 747348547, 747515619, 747680068, 747805893, 747892261, 748015225, 748203933, 748383760, 748518705, 748642981, 748735070, 748771608, 748836339, 749003530, 749207020, 749345422, 749424934, 749489188, 749573529, 749717057, 749892354, 750000417, 750029743, 750084102, 750212133, 750410199, 750641406]
##END=$$ End of the data block
