##TITLE=G4-52-SE $$ Begin of the data block
##JCAMP-DX=5.00 $$ ACD/SpecManager v 10.08
##SPECTROMETER/DATA SYSTEM=Alpha
##DATE=17 Oct 2013 10:58:30
##DATA TYPE=INFRARED SPECTRUM
##DATA CLASS=XYDATA
##ORIGIN=
##OWNER=
##NPOINTS=1765
##FIRSTX=399.75695801
##LASTX=3997.56933594
##MAXX=3997.56933594
##MINX=399.75695801
##MAXY=0.82629490
##MINY=0.33043647
##XFACTOR=1.0000000000
##YFACTOR=1.000000000000000e-9
##FIRSTY=0.56513947
##DELTAX=2.03957629
##XUNITS=1/CM
##YUNITS=ARBITRARY UNITS
##XYDATA=(X++(Y..Y))
399.8E65139472k749681j758575j771033j226366L92318J641691J345038J48118p61509
418.1E60399473j071036q92878j181841j995265k123952j335979n17189o86049j212597
436.5E49382687l37422J496255K342880J455247Q6785k41161L60191M15206o69956
454.8E54290712j748502j881600j538455j853764k707243l021539k278387j182556
471.1E38078666j155913k135396k277851j022697K14756j8001j139104j407087o50227
489.5E28487146l66211j321673k239287k117098j489162j341820k165913l090680k850294
507.9E11505008j885414j827419k547383k802969k375423j550854q87364p78526p16537
526.2D96133119j3113J026809J494557J349926J476586K313017K989471K301038N99265
$$ plain form
399.8 565139472 562389791 560631216 558860183 557633817 558026135 559667826 561012864 561160982 560399473
418.1 560399473 559328437 558435559 557253718 555258453 553134501 551798522 551281333 550595284 549382687
436.5 549382687 549045265 550541520 552884400 554339647 554426432 554185271 554545462 554960668 554290712
454.8 554290712 552542210 550660610 549122155 547268391 544561148 541539609 539261222 538078666
471.1 538078666 536922753 534787357 532509506 531486809 531701565 531683564 530544460 529137373 528487146
489.5 528487146 528120935 526799262 524559975 522442877 520953715 519611895 517445982 514355302 511505008
507.9 511505008 509619594 507792175 505244792 502441823 500066400 498515546 497628182 496849656 496133119
526.2 496133119 496120006 497146815 498641372 499991298 501467884 503780901 506770372 509071410 509670675
544.6E09670675n69523n87880k52009n75006j627326k204358j684904j158476j632601
562.9D99378592k614945k822489j907289p92503k92719r3430O87957K127409L230303
581.3D96900886L200740K530575K182960K188385J857877P70747k35677j66952M81903
599.6E09711444O07431J7345m20928l2902P66457R99033N20051K24530Q63612K090454
620E15346527K690137K242505J814842K320051K930642K633631J728237J106739J272916
638.4E34086227J784981J676619R40680M71473P23243J098811P61748P6174n5909M70221
658.8E42034268R57072Q06511L23414J37747P97271J487077J344442R55045R51827
677.1E49794674J589119J966954J421272N48482L31819P85411Q03947k73049j417279
$$ plain form
544.6 509670675 509101152 508513272 508261263 507686257 506058931 503854573 502169669 501011193 499378592
562.9 499378592 496763647 493941158 492033869 491241366 490948647 490855217 491543174 493670583 496900886
581.3 496900886 500101626 502632201 504815161 507003546 508861423 509632170 509396493 509229541 509711444
599.6 509711444 510318875 510336220 509915292 509882390 510648847 511647880 512167931 512392461 513256073 515346527
620 515346527 518036664 520279169 522094011 524414062 527344704 529978335 531706572 532813311 534086227
638.4 534086227 535871208 537547827 538488507 538959980 539683223 540782034 541543782 541619956 541564047 542034268
658.8 542034268 542991340 543797851 544121265 544259012 545056283 546543360 547887802 548842847 549794674
677.1 549794674 551383793 553350747 554772019 555320501 555652320 556437731 557241678 556968629 555551350
695.5E55551350j384318l98516M07099N74708O60122J302719K321243K881706K766609
713.8E64682722K693713L274917M340768M847050M251480L602445L720820M053474
730.2E95467389L625691K433717J443326J242459J345456R21190K0682o25848n79954
748.5F05294108l33488o50286j398862j766324j361251o98506l47674l7551Q44776
766.9E99544942K310336L785491M577994M610598M543663M765748M801631M132569
783.2F33072972L091812K351344K184391K257347K104283J814544J957416K661705
799.5F51495814L318131L248751K476216J834273J718879J607478J081466L57032j22964
817.9F67015076k74360n36263j290441k352595k924085k647638k304852k546847l078580
$$ plain form
695.5 555551350 554167032 553768516 554175615 554750323 555410445 556713164 559034407 561916113 564682722
713.8 564682722 567376435 570651352 574992120 579839170 584090650 587693095 591413915 595467389
730.2 595467389 599093080 601526797 602970123 604212582 605558038 606479228 606499910 605874062 605294108
748.5 605294108 604960620 604310334 602911472 601145148 599783897 599085391 598737717 598700166 599544942
766.9 599544942 601855278 605640769 610218763 614829361 619373024 624138772 628940403 633072972
783.2 633072972 636164784 638516128 640700519 642957866 645062149 646876693 648834109 651495814
799.5 651495814 654813945 658062696 660538912 662373185 664092064 665699542 666781008 667138040 667015076
817.9 667015076 666740716 666204453 664914012 662561417 659637332 656989694 654684842 652137995 649059415
836.2F49059415l131211k520502j910090j870096k088785j824021j076758o30498q84235
854.6F33123219j165092n71609J049459L005147M361928M996777N420446N571604M795432
872.9F60587311K999246J021445m65393j722038l194988m634797n377949n202532m698693
891.3F39311612m604817m821241m747390m396201m378378n000591n862236o327629
907.6E99173129o269455o129325o166041n954623n011082l574729k270400j466692
923.9E62330782j086831p63118l65376j34409j75118k94805k81393k55526q05020k417982
944.3E55751204m718065o816804q278847r139955r532094r546578r285390q946210
960.6D89487261q692861q485734q066893p310957o377190n417884m452020l445595
$$ plain form
836.2 649059415 645928204 643407702 641497612 639627516 637538731 635714710 634637952 634007454 633123219
854.6 633123219 631958127 631386518 632435977 635441124 639803052 644799829 650220275 655791879 660587311
872.9 660587311 663586557 664608002 664142609 662420571 659225583 654590786 649212837 644010305 639311612
891.3 639311612 634706795 629885554 625138164 620741963 616363585 611362994 605500758 599173129
907.6 599173129 592903674 586774349 580608308 574653685 569642603 566067874 563797474 562330782
923.9 562330782 561243951 560480833 560115457 559981048 559805930 559511125 559229732 558974206 558169186 555751204
944.3 555751204 551033139 544216335 535937488 526797533 517265439 507718861 498433471 489487261
960.6 489487261 480794400 472308666 464241773 456930816 450553626 445135742 440683722 437238127
977D37238127k483875j806736j567632j620322j666069j624435j585484j554817j399278
995.3D21929479r88245m49330o3091K0772j82897n43654r31561j294047j574516j678735
1015.7D14244175j579195j460851j527100j731903j893103j886546j767934j714438
1032D00683105j808405j934886j919955j757979j675815j702249j549184j167208p13080
1050.4C86454344k53052K00004O68406J155347J591116J892805K048135J909524J111657
1068.7C96778286k31803j280963j323015m08053R47237K256930L223866L818452M177511
1087.1D07958448M398078M395723M058093L484040K871245K335698J861274J445174
1103.4D32807773J246065J431406J862109K239972K407074K363503K225697K052635
$$ plain form
977 437238127 434754252 432947516 431379884 429759562 428093493 426469058 424883574 423328757 421929479
995.3 421929479 420941234 420491904 420428813 420449585 420266688 419723034 418791473 417497426 415922910 414244175
1015.7 414244175 412664980 411204129 409677029 407945126 406052023 404165477 402397543 400683105
1032 400683105 398874700 396939814 395019859 393261880 391586065 389883816 388334632 387167424 386454344
1050.4 386454344 386201292 386401296 387069702 388225049 389816165 391708970 393757105 395666629 396778286
1068.7 396778286 396546483 395265520 393942505 393534452 394481689 396738619 399962485 403780937 407958448
1087.1 407958448 412356526 416752249 420810342 424294382 427165627 429501325 431362599 432807773
1103.4 432807773 434053838 435485244 437347353 439587325 441994399 444357902 446583599 448636234
1119.7D48636234J822650J534313J321405J502186K128989K619654K471924J888066
1136D63925421J262397P05004J53064m07815q19921q65638n73904k26587L5405M28915
1156.4D63616341J168758K123266K930224L344268L524184L814638M281342M677385
1172.7D89480406M868418N054235N409003N762517N800247N446852M979670M602134
1189.1E31403482M069030L098250J841247P57575J56164j43588m93764q24929q00848
1207.4E39062619l88443J1563O4611j10089k10226j78814k52187o22869j131713j433015
1227.8E34811437j451909j383245j364053j285672r70125m41015J43290O22272R72212
1246.2E29653192J354396J822472K151727K204180K120674K084076K117753K116501
$$ plain form
1119.7 448636234 450458884 451993197 453314602 454816788 456945777 459565431 462037355 463925421
1136 463925421 465187818 465892822 466045886 465638071 464818150 463952512 463378608 463152021 463187426 463616341
1156.4 463616341 464785099 466908365 469838589 473182857 476707041 480521679 484803021 489480406
1172.7 489480406 494348824 499403059 504812062 510574579 516374826 521821678 526801348 531403482
1189.1 531403482 535472512 538570762 540412009 541169584 541325748 541182160 540688396 539863467 539062619
1207.4 539062619 538674176 538685739 538750350 538640261 538430035 538251221 537999034 537376165 536244452 534811437
1227.8 534811437 533359528 531976283 530612230 529326558 528356433 527915418 528058708 528680980 529653192
1246.2 529653192 531007588 532830060 534981787 537185967 539306641 541390717 543508470 545624971
1262.5E45624971K041877J983463K014816K067268J964569J602769J168370R13978
1278.8E59382081R12130J060247J118422R82880Q14677O74724L87192j28329p78734
1297.2E64425290j284063j469553j515567j647115j790285j693189j349151r33409
1313.5E52742958n63204k51711O3837L52442K96414k91645j125694j760900j986444
1331.8E47476053j942694j810491j638353j357198r31978n81503n46336p60138j026690
1350.2E36880672j198888j320362j560986j841366k127588k620816l183544l475428
1366.5E19551694l455340k971769k515972k668321l067374l410578l703385l589928
1382.8D94169027k848268j963764j207739n18144o8247P0214P5341J17600M35948J009315
$$ plain form
1262.5 545624971 547666848 549650311 551665127 553732395 555696964 557299733 558468103 559382081
1278.8 559382081 560294211 561354458 562472880 563455760 564270437 564945161 565332353 565204024 564425290
1297.2 564425290 563141227 561671674 560156107 558508992 556718707 555025518 553676367 552742958
1313.5 552742958 552179754 551928043 551991880 552344322 552640736 552349091 551223397 549462497 547476053
1331.8 547476053 545533359 543722868 542084515 540727317 539795339 539213836 538667500 537907362 536880672
1350.2 536880672 535681784 534361422 532800436 530959070 528831482 526210666 523027122 519551694
1366.5 519551694 516096354 513124585 510608613 507940292 504872918 501462340 497758955 494169027
1382.8 494169027 491320759 489356995 488149256 487631112 487562865 487633079 487708420 487826020 488261968 489271283
1403.2D89271283J480878J605063J549006J576304J734018J963377K090186K022148
1419.5E03292263J876533J924991J899958J516223Q65280K74301L6299l39329q00014
1437.9E10546505n21421O4850M98593O82294N04077K10881K21133P58708J680910K165735
1458.3E16812265K017319K235711K721548L070354L691912N197525P154286P399976
1474.6E50300896O032467M633248L342628K238572J182377q9228j877069l555775l880620
1493E58327496m109919n237639n782723n237878m542470n510032q667588q745968p292271
1511.3E03201008o689906n556822l901154k358198k034217k293349k299785k457798
1527.6D75609779k230405j906455j899302j343310n76436o03199o79940Q4906R96858
$$ plain form
1403.2 489271283 490752161 492357224 493906230 495482534 497216552 499179929 501270115 503292263
1419.5 503292263 505168796 507093787 508993745 510509968 511375248 511649549 511685848 511346519 510546505
1437.9 510546505 510025084 510089934 510588527 511270821 511774898 511985779 512206912 512965620 514646530 516812265
1458.3 516812265 518829584 521065295 523786843 526857197 530549109 535746634 542900920 550300896
1474.6 550300896 556333363 560966611 564309239 566547811 567730188 567640960 565763891 562208116 558327496
1493 558327496 554217577 548979938 543197215 537959337 533416867 527906835 519239247 510493279 503201008
1511.3 503201008 496511102 490954280 487053126 484694928 482660711 480367362 478067577 475609779
1527.6 475609779 473379374 471472919 469573617 468230307 467653871 467050672 466370732 466455638 467452496
1546D67452496J868964K692818L381759M009694M467130N105585M811883L297507L095687
1564.3E00183523L332495L169060K727866K131820J930773J679778R50158M56333J93000
1582.7E16754806O5744j10507n16892j118540j602888k072990k658964l335475m113317
1601.1E01290977m889160n550474o269753p325977q061231q106380q993030j0896772
1617.4D41198200j0194063r699613j1350066j1557996j0785311j0292113q907497q003205
1633.7C60408336q359552o479024l461838j611442k85267P50392J504690J866311K453088
1652C46785694L220111L191233L558368M645347N834937O536723O547212P304013Q217513
1670.4C95841151P717073P894427Q532763Q212804Q138955R221286J1172562J0505885
$$ plain form
1546 467452496 469321460 472014278 475396037 479405731 483872861 488978446 493790329 497087836 500183523
1564.3 500183523 503516018 506685078 509412944 511544764 513475537 515155315 516105473 516561806 516754806
1582.7 516754806 516820550 516710043 516193151 515074611 513471723 511398733 508739769 505404294 501290977
1601.1 501290977 496401817 490851343 484581590 477255613 469194382 461088002 452094972 441198200
1617.4 441198200 431004137 421304524 409954458 398396462 387611151 377319038 368411541 360408336
1633.7 360408336 352048784 345569760 342107922 340496480 340211213 340961605 342466295 344332606 346785694
1652 346785694 350005805 353197038 356755406 361400753 367235690 373772413 380319625 387623638 395841151
1670.4 395841151 403558224 411452651 419985414 428198218 436337173 445558459 456731021 467236906
1686.7D67236906R571642J0685921J1503935J3727784J5634119J5397072J6081274
1701E59838653J3365566J1107147J0735273R223998P990539P286430O787419O364226
1717.3F32699251N196393M023671L605604L392518L022968K761543K499640K243996
1733.6F59445584J866221J757860K100528K520621L056466L808200M587889N253196
1749.9F84396565N546212N298972N289674N329311N060136M882515M400193M029394
1766.3G24232972M016459L871798L538490K980113K536594K486468K464473K272487
1782.6G48399854K043962J914263J955986J974523J774788J469076J430094J518071
1798.9G62480617J493513J348555J261056J301467J352608J320303J173198J085818
$$ plain form
1686.7 467236906 476808548 487494469 498998404 512726188 528360307 543757379 559838653
1701 559838653 573204219 584311366 595046639 604270637 612261176 619547606 626335025 632699251
1717.3 632699251 637895644 641919315 645524919 648917437 651940405 654701948 657201588 659445584
1733.6 659445584 661311805 663069665 665170193 667690814 670747280 674555480 679143369 684396565
1749.9 684396565 689942777 695241749 700531423 705860734 710920870 715803385 720203578 724232972
1766.3 724232972 728249431 732121229 735659719 738639832 741176426 743662894 746127367 748399854
1782.6 748399854 750443816 752358079 754314065 756288588 758063376 759532452 760962546 762480617
1798.9 762480617 763974130 765322685 766583741 767885208 769237816 770558119 771731317 772817135
1815.2G72817135J085937J141488J190246J201510J146793J058400R65655Q07702P44462
1833.6G82159328P61688P72655Q38518R43721Q46147N64397M70101N52118O07610N74231
1854G89090514N50091N82219O12855N77628N74231O15061N44250L77595L20673L83377
1874.4G94228494M51446N16534N35726N07593M94957N61357O14166N31793M18842L56555
1894.7G99217463L49164L95178M31836L82662L22103L38137L56138K98441K63333L40521
1915.1H02694976L87311L26872K32399J58131J79708K53200K52128K14040J90079J93298
1935.5H05082142K56956K88188K05756J15037J45733J85668J59801J54554K07603K80798
1955.9H07082236K74360J97709J54316K08735K60354J97112J11282J21713K06887K44916
$$ plain form
1815.2 772817135 773903072 775044560 776234806 777436316 778583109 779641509 780607164 781414866 782159328
1833.6 782159328 782921016 783693671 784532189 785475910 786322057 786886454 787356555 787908673 788516283 789090514
1854 789090514 789640605 790222824 790835679 791413307 791987538 792602599 793146849 793524444 793845117 794228494
1874.4 794228494 794679940 795196474 795732200 796239793 796734750 797296107 797910273 798442066 798860908 799217463
1894.7 799217463 799566627 799961805 800393641 800776303 801098406 801436543 801792681 802091122 802354455 802694976
1915.1 802694976 803082287 803409159 803641558 803799689 803979397 804232597 804484725 804698765 804888844 805082142
1935.5 805082142 805339098 805627286 805833042 805948079 806093812 806279480 806439281 806593835 806801438 807082236
1955.9 807082236 807356596 807554305 807708621 807917356 808177710 808374822 808486104 808607817 808814704 809059620
1976.3H09059620J74642P6830Q2850J52231J75893J52707J11818O2526O1035R1970
1996.7H10202122O4432K2233K9743O9856L5584q8811j57118r1791j3590p5042k27332
2019.2H09770286k73585j71304j17064j82807k48849k31922j81735j64270j82331j98662
2039.6H07817757j69933j22606j00017j15871j20998n6803N0425P3672O139j6034O9082
2062H07314813J43588J04367O4552P0632R8705J43886J43170Q2195M1723N8234J05440
2084.4H08371305J28270R9241R2626J28269J68085J74165J36852R3162J08600J71840
2104.8H09672415J86384J15871N9128J29521K03431J48713O0618L1889O1452J36316
2125.2H10805738J58250P2301L1173J07527J85013J50680M1187J9193J13010J66118
$$ plain form
1976.3 809059620 809234262 809311092 809393942 809546173 809722066 809874773 809986591 810049117 810110152 810202122
1996.7 810202122 810266554 810288787 810318530 810388386 810423970 810335159 810178041 810086250 810072660 809997618 809770286
2019.2 809770286 809496701 809325397 809208333 809025526 808776677 808544755 808363020 808198750 808016419 807817757
2039.6 807817757 807647824 807525218 807425201 807309330 807188332 807131529 807181954 807255626 807261765 807245731 807314813
2062 807314813 807458401 807562768 807627320 807697952 807796657 807940543 808083713 808165908 808207631 808265865 808371305
2084.4 808371305 808499575 808598816 808691442 808819711 808987796 809161961 809298813 809391975 809500575 809672415
2104.8 809672415 809858799 809974670 810033798 810163319 810366750 810515463 810576081 810607970 810669422 810805738
2125.2 810805738 810963988 811036289 811067462 811174989 811360002 811510682 811551869 811571062 811684072 811850190
2145.6H11850190J13845L7134O5863K03788K56419J58608R4772J86920L22938L47614
2166H13638091K56479K19107L33309M70876M62771L17097K40981L34084M52221M12225
2186.4H17137241K69533K45273L56316M31240L64661K26855K08378L34799M02987L00944
2206.8H20278227J74404K32279L98397M20749K78831J54853J93596L19898L36826K14696
2227.2H23002756J24037J75536K60233K38061J37210R2626J34647J90794J74403P6294
2247.6H24606597M0591J20700J65522J12533N8770O5566J16884J44363J23143Q9288
2268H25643957O1929Q5413J50442J34647M2737K7895O8128O2048J7703n5671q3565
2290.4H26155663q107K4557o0975j47045j57416r5188m2618j03592k28703k55406j88589
$$ plain form
2145.6 811850190 811964035 812001169 812067032 812270820 812527239 812685847 812780619 812967539 813290477 813638091
2166 813638091 813894570 814113677 814446986 814917862 815380633 815697730 815938711 816272795 816725016 817137241
2186.4 817137241 817406774 817652047 818008363 818439603 818804264 819031119 819239497 819574296 819977283 820278227
2206.8 820278227 820452631 820684910 821083307 821504056 821782887 821937740 822131336 822451234 822788060 823002756
2227.2 823002756 823126793 823302329 823562562 823800623 823937833 824030459 824165106 824355900 824530303 824606597
2247.6 824606597 824647188 824767888 824933410 825045943 825104713 825170279 825287163 825431526 825554669 825643957
2268 825643957 825705886 825791299 825941741 826076388 826119125 826147020 826215148 826277196 826294899 826239228 826155663
2290.4 826155663 826147556 826172113 826111138 825964093 825806677 825711489 825668871 825565279 825336576 825081170 824892581
2312.9H24892581j52231j93417l03328m02570l53396j89006j91927l44157l51012k11775
2333.3H22199762j96874l44932l94941l17454j71900J52111L33727J1742n24819q09431
2353.6H19936991o85692n18739m71890l24250j3411J39475Q3983J27256K14458K54809
2374H18742990K80142K08438J32203J50502J46746J2875j75476k89321k84434k27510
2394.4H18697155k38896l45111m26113l76225k87056l17514m33385m75764m35710m29571
2414.8H14931810m61280m85719n10990n00441m82857n39899o04212n86748n39899n33998
2435.2H09685767n64277n99146o00458n67674n39661n60820o19352o25789n78284n52714
2455.6H03877592n65469n77152n72324n66840n47945n10157n09142n64576n88596n44548
$$ plain form
2312.9 824892581 824740350 824546933 824243605 823841035 823487639 823298633 823106706 822762549 822411537 822199762
2333.3 822199762 822002888 821657956 821263015 820945561 820773661 820925772 821259499 821271241 820746422 819936991
2353.6 819936991 819251299 818732560 818260670 817936420 817923009 818062484 818146467 818273723 818488181 818742990
2374 818742990 819023132 819231570 819363773 819514275 819661021 819673896 819498420 819209099 818924665 818697155
2394.4 818697155 818458259 818113148 817687035 817310810 817023754 816706240 816272855 815797091 815361381 814931810
2414.8 814931810 814470530 813984811 813473821 812973380 812490523 811950624 811346412 810759664 810219765 809685767
2435.2 809685767 809121490 808522344 807921886 807354212 806814551 806253731 805634379 805008590 804430306 803877592
2455.6 803877592 803312123 802734971 802162647 801595807 801047862 800537705 800028563 799463987 798875391 798330843
2476G98330843n09679n46276n82517n37872m81903m91441n36501n48065n25534m76897
2496.4G93094158m38630m67360n00203m74751m37438m72546n34177n27560m85242m60267
2516.8G88295984m77016n14209n24819n13911n06818n26429n75721o01828n67615n42522
2537.2G82945096n89907o67214o83189o01828n03003n01275n93245o48082n93066n14626
2557.6G77049661n34058o16372o15418n24163m74930n11229n75184o07372n65231n05626
2578G71520078n23031n99920o34790n81920n20408n16176n58675n82039n24282m66109
2598.4G66012728n17428o18636o56963o28233o15000o69182p58826q32439q43525q16345
2618.8G59056151q43942r10640r44793r52304r59396r58204r88186j060307j082003
$$ plain form
2476 798330843 797821164 797274888 796692371 796154499 795672596 795181155 794644654 794096589 793571055 793094158
2496.4 793094158 792655528 792188168 791687965 791213214 790775776 790303230 789769053 789241493 788756251 788295984
2516.8 788295984 787818968 787304759 786779940 786266029 785759211 785232782 784657061 784055233 783487618 782945096
2537.2 782945096 782355189 781687975 781004786 780402958 779899955 779398680 778805435 778157353 777564287 777049661
2557.6 777049661 776515603 775899231 775283813 774759650 774284720 773773491 773198307 772590935 772025704 771520078
2578 771520078 770997047 770397127 769762337 769180417 768660009 768143833 767585158 767003119 766478837 766012728
2598.4 766012728 765495300 764876664 764219701 763591468 762976468 762307286 761548460 760716021 759872496 759056151
2618.8 759056151 758212209 757301569 756356776 755404472 754445076 753486872 752498686 751438379 750356376
2637.1G50356376j016378r64940j022935j093864j047850r74774j001537j057088j061619
2655.5G41115391j030802r79424r57370r81688r90868r54449r25124r45747r85086
2673.9G32364833r65356q65043q00252q36789q82268q95679q91507q56042q58009q95917
2694.3G23617971r03666r37522r83178r90808j017153j062394j081109j080751j065672
2712.6G14495718j065909j078010j069129j056134j050532j051247j027644r76443
2728.9G06120670r39369r30608r25898q92341q44062q44419q92520q89241q19922p94291
2749.3F97347999q37505q69394q52644q27730q18431p93755p99179q53658q58128q50499
2769.7F88987076r04679r38773r29773r75311j058519j093626j097560j127600j178921
$$ plain form
2637.1 750356376 749339998 748375058 747352123 746258259 745210409 744235635 743234098 742177010 741115391
2655.5 741115391 740084589 739105165 738147795 737166107 736175239 735220790 734295666 733349919 732364833
2673.9 732364833 731399477 730534434 729734182 728897393 728015125 727119446 726227939 725371897 724513888 723617971
2694.3 723617971 722714305 721776783 720793605 719802797 718785644 717723250 716642141 715561390 714495718
2712.6 714495718 713429809 712351799 711282670 710226536 709176004 708124757 707097113 706120670
2728.9 706120670 705181301 704250693 703324795 702432454 701588392 700743973 699851453 698962212 698142290 697347999
2749.3 697347999 696510494 695641100 694788456 693960726 693142295 692348540 691549361 690695703 689837575 688987076
2769.7 688987076 688082397 687143624 686213851 685238540 684180021 683086395 681988835 680861235 679682314
2788.1F79682314j219093j271010j343965j391232j394034j410901j492739j592338
2804.4F68567002j644254j642883j660287j708448j755059j821816j880824j924098
2820.7F54529333k021909k146721k209425k257585k346754k488375k702355k979636
2837F35376573l343583l832280m469693n169093n694867n823314n404830m417896l156304
2855.4E94064713k115250j626968j775742k381921l077626l581226l723800l468633
2871.7E72313547k971828k349555j685799j179218r63568r81033j074195j167476j282633
2890.1E58658242j455664j687408j884580k014279k164602k387047k686739l042579
2906.4E41335344l422141l867626m401028m918337n218506n128383m675985l957212
$$ plain form
2788.1 679682314 678463221 677192211 675848246 674457014 673062980 671652079 670159340 668567002
2804.4 668567002 666922748 665279865 663619578 661911130 660156071 658334255 656453431 654529333
2820.7 654529333 652507424 650360703 648151278 645893693 643546939 641058564 638356209 635376573
2837 635376573 632032990 628200710 623731017 618561924 612867057 607043743 601638913 597221017 594064713
2855.4 594064713 591949463 590322495 588546753 586164832 583087206 579505980 575782180 572313547
2871.7 572313547 569341719 566992164 565306365 564127147 563163579 562182546 561108351 559940875 558658242
2890.1 558658242 557202578 555515170 553630590 551616311 549451709 547064662 544377923 541335344
2906.4 541335344 537913203 534045577 529644549 524726212 519507706 514379323 509703338 505746126
2922.7E05746126l004730j858413o28114M94779J472115K440989L363013M044950M352570
2941E16423285M232764L752411L069341K339780J656652J080155P97749R96112J557708
2959.4E35905957K230168K912402L594100M245162M796744N166053N305171N244017
2975.7E69399774N091131M895806M570842M113972L653824L261030K903104K440035
2992F00329518J801730J153588O14881J44661k88785p05957j023233j106799j020252
3010.4E99899352r65119r87291r53019q94844j000047j291454j627743j837909j841128
3028.7E88500798j739979j722157j855135j977086j999497k034843k101183k184570
3045.1E72886348k270639k274096k226651k241373k307653k333999k269149k094924
$$ plain form
2922.7 505746126 502741396 500882983 500254869 500749648 502221763 504662752 508025765 512070715 516423285
2941 516423285 520656049 524408460 527477801 529817581 531474233 532554388 533352137 534348249 535905957
2959.4 535905957 538136125 541048527 544642627 548887789 553684533 558850586 564155757 569399774
2975.7 569399774 574490905 579386711 583957553 588071525 591725349 594986379 597889483 600329518
2992 600329518 602131248 603284836 603899717 604044378 603755593 603049636 602026403 600919604 599899352
3010.4 599899352 598934233 597946942 596993923 596099079 595099032 593807578 592179835 590341926 588500798
3028.7 588500798 586760819 585038662 583183527 581206441 579206944 577172101 575070918 572886348
3045.1 572886348 570615709 568341613 566114962 563873589 561565936 559231937 556962788 554867864
3061.4E54867864j930416j875162j788795j642168j541733j502455j489699j416862
3077.7E41680574j299083j248121j276076j298308j207173j053810j014293j076459
3094E32207251j079619j011789j018405j149297j264691j264930j224279j220584j227618
3112.4E21746039j255750j367510j489997j555085j614749j678705j721919j726031
3128.7E09336293j688957j703382j810730j861453j811683j834452j933902j970202
3145D94721532j957566j962274j961291j984179k077073k125889k081007k039909k047628
3163.4D76484716k087027k121776k109885k070785k080053k142757k161384k104580
3179.7D59606469k070248k083034k107531k134025k113402k029687j964509j980961
$$ plain form
3061.4 554867864 552937448 551062286 549273491 547631323 546089590 544587135 543097436 541680574
3077.7 541680574 540381491 539133370 537857294 536558986 535351813 534298003 533283710 532207251
3094 532207251 531127632 530115843 529097438 527948141 526683450 525418520 524194241 522973657 521746039
3112.4 521746039 520490289 519122779 517632782 516077697 514462948 512784243 511062324 509336293
3128.7 509336293 507647336 505943954 504133224 502271771 500460088 498625636 496691734 494721532
3145 494721532 492763966 490801692 488840401 486856222 484779149 482653260 480572253 478532344 476484716
3163.4 476484716 474397689 472275913 470166028 468095243 466015190 463872433 461711049 459606469
3179.7 459606469 457536221 455453187 453345656 451211631 449098229 447068542 445104033 443123072
3196D43123072k017170j967519j871735j838058j849682j853346j799822j719296j702279
3214.3D26504165j736522j774847j790852j759618j744896j810253j836002j789003
3230.7D12262172j797170j884699j974314k043933k098411k100766k087086k135277
3247C96140516k253950k319664k290785k293378k352327k374441k324074k253264k180785
3265.3C75497848k100378k003402j903772j826764j724570j586974j451582j312554
3281.6C61587852j184970j075506r51171q19385p26402o82294o19799n39720m84884
3300C54503721m02480k97070k90871l63349l43979k37822j78695k14070k73824k58744
3320.4C51642817j85072j54108k30700l35514l55393l35664l13699l06964l95536n14537
$$ plain form
3196 443123072 441105902 439138383 437266648 435428590 433578908 431725562 429925740 428206444 426504165
3214.3 426504165 424767643 422992796 421201944 419442326 417697430 415887177 414051175 412262172
3230.7 412262172 410465002 408580303 406605989 404562056 402463645 400362879 398275793 396140516
3247 396140516 393886566 391566902 389276117 386982739 384630412 382255971 379931897 377678633 375497848
3265.3 375497848 373397470 371394068 369490296 367663532 365938962 364351988 362900406 361587852
3281.6 361587852 360402882 359327376 358376205 357556820 356830418 356148124 355528325 354988605 354503721
3300 354503721 354101241 353804171 353513300 353149951 352805972 352568150 352389455 352175385 351901561 351642817
3320.4 351642817 351457745 351303637 351072937 350737423 350382030 350046366 349732667 349425703 349030167 348515630
3340.8C48515630n62519n79149n89430n98311o44714p00712p15286p11262p16716p14421
3361.2C41983110p14600p25985p33525p47591p94917q15004p42674o59436o33627o38366
3381.6C34777385n87821m94182l84361k70873l30895m92841m19796j54793o5595k64346
3402C31311882m36455k93911p3820l4184l7044J0133N3257J23173K04444K50190L35246
3424.4C31412911M92096O71506P43091P71851Q46952P95901O71923O98179Q56817J031905
3444.8C38993132J142621J130521J126618J217484J320422J426369J515269J472145
3461.1C49344581J445681J639277J834482J715302J421184J397788J630128J875311
3477.4C62303734J949400J795828J754701J944333K009064J925975J947642J993388
$$ plain form
3340.8 348515630 347953111 347373962 346784532 346186221 345541507 344840795 344125509 343414247 342697531 341983110
3361.2 341983110 341268510 340542525 339809000 339061409 338266492 337451488 336708814 336049378 335415751 334777385
3381.6 334777385 334189564 333695382 333311021 333040148 332709253 332216412 331796616 331641823 331576228 331311882
3402 331311882 330875427 330581516 330507696 330473512 330436468 330446601 330499858 330623031 330827475 331077665 331412911
3424.4 331412911 331905007 332576513 333319604 334091455 334938407 335734308 336406231 337104410 337961227 338993132
3444.8 338993132 340135753 341266274 342392892 343610376 344930798 346357167 347872436 349344581
3461.1 349344581 350790262 352429539 354264021 355979323 357400507 358798295 360428423 362303734
3477.4 362303734 364253134 366048962 367803663 369747996 371757060 373683035 375630677 377624065
3493.8C77624065K019554K086014K157360K143323K005995J933932K045214K193272
3510.1C94208729K277553K255589K165556K215236K414972K569378K482146K290278
3526.4D12879437K281875K408206K528250K656043K714515K683848K789169K937913
3542.7D33879256K879799K702027K697498K825707K887994K897710K983987L151536
3559D56905514L238022L230810L233940L382623L514826L449083L416419L527105L676623
3577.4D87574965L842175L980547M005313L910959L855884L974437L995419L971279
3593.7E19110978M073083M178464M180730M173100M177630M076481M091799M226446
3610E52288711M205287M140794M051864M053712M243433M190386M013419L897369L942668
$$ plain form
3493.8 377624065 379643619 381729633 383886993 386030316 388036311 389970243 392015457 394208729
3510.1 394208729 396486282 398741871 400907427 403122663 405537635 408107013 410589159 412879437
3526.4 412879437 415161312 417569518 420097768 422753811 425468326 428152174 430941343 433879256
3542.7 433879256 436759055 439461082 442158580 444984287 447872281 450769991 453753978 456905514
3559 456905514 460143536 463374346 466608286 469990909 473505735 476954818 480371237 483898342 487574965
3577.4 487574965 491417140 495397687 499403000 503313959 507169843 511144280 515139699 519110978
3593.7 519110978 523184061 527362525 531543255 535716355 539893985 543970466 548062265 552288711
3610 552288711 556493998 560634792 564686656 568740368 572983801 577174187 581187606 585084975 589027643
3628.4E89027643M086971L818214L616631L670514L712654L739476L771663L722549
3644.7F19166315L577053L519297L463208L138841K904296L093183L218412L016949
3661F45097554K851486K866685K823770K683163K742410K545774K104640K054929K093733
3679.4F67864144K109885K304316K441644K332390J929104J556396J524389J620233
3695.7F83682501J667798J603365J438618J404047J518487J569927J375795J026868
3712F95287406R69649J065731J155197J225651J141071R04620P92742J000046J220584
3730.3G04762697J305223J076340O81937P74861J003265P21693N51224J086116J047551
3748.7G13010907M48048L86298P18176P43568N53787N90324P33674P65145P65502O34313
$$ plain form
3628.4 589027643 593114614 596932828 600549459 604219973 607932627 611672103 615443766 619166315
3644.7 619166315 622743368 626262665 629725873 632864714 635769010 638862193 642080605 645097554
3661 645097554 647949040 650815725 653639495 656322658 659065068 661610842 663715482 665770411 667864144
3679.4 667864144 669974029 672278345 674719989 677052379 678981483 680537879 682062268 683682501
3695.7 683682501 685350299 686953664 688392282 689796329 691314816 692884743 694260538 695287406
3712 695287406 696257055 697322786 698477983 699703634 700844705 701749325 702542067 703542113 704762697
3730.3 704762697 706067920 707144260 707826197 708601058 709604323 710326016 710877240 711963356 713010907
3748.7 713010907 713458955 713845253 714563429 715306997 715860784 716451108 717184782 717949927 718715429 719349742
3769.1G19349742N37693O18041O96242P03215O05584N20229M99248M81129M89056N51105
3789.5G25051284O88910P30455O45697O31392M82381L74973N46157M04954K50041N09799
3809.9G30316043Q02100P02560M22835M70817L34144K30074M41372M11272L90768M71532
3830.3G34993517N94139P28846M27544o556P0691K45988L03686M50671O89506O29485
3850.7G39127517k5571k04324L61144M86076M29809L74854L30865K98381J54674K12491
3871.1G41545916L08036K73705L12626K56598K96653L62694J84834J71184K17319J00613
3891.5G44030178J88350L75927L51071K23577Q4937j9551J2517N6744Q3864K09272
3911.9G45596886K92420K30789J27733P8917J06573J39355J59443J79887J59740J13189
$$ plain form
3769.1 719349742 719887435 720505476 721201718 721904933 722510517 723030746 723529994 724011123 724500179 725051284
3789.5 725051284 725740194 726470649 727116346 727747738 728230119 728605092 729151249 729556203 729806244 730316043
3809.9 730316043 731118143 731820703 732243538 732714355 733048499 733278573 733719945 734131217 734521985 734993517
3830.3 734993517 735587656 736316502 736744046 736737490 736808181 737054169 737357855 737808526 738498032 739127517
3850.7 739127517 739101946 738897622 739258766 739744842 740174651 740549505 740880370 741178751 741333425 741545916
3871.1 741545916 741853952 742127657 742440283 742696881 742993534 743356228 743541062 743712246 743929565 744030178
3891.5 744030178 744218528 744594455 744945526 745169103 745254040 745234489 745247006 745303750 745387614 745596886
3911.9 745596886 745889306 746120095 746247828 746326745 746433318 746572673 746732116 746912003 747071743 747184932
3932.3G47184932J03295J36554J62781J61528J63973J63853J51574J35303Q5711N3645
3952.7G48503149P6592R5188J38462J98900J82689J21176J03295J13249J24633J36018
3973.1G49793351J40845J13130L3736N5313K12133K39969R1076K6047J06871J61290
3993.4G50973761J38581J27375
3997.5G51239717
$$ plain form
3932.3 747184932 747288227 747424781 747587562 747749090 747913063 748076916 748228490 748363793 748449504 748503149
3952.7 748503149 748579741 748674929 748813391 749012291 749194980 749316156 749419451 749532700 749657333 749793351
3973.1 749793351 749934196 750047326 750081062 750136375 750348508 750588477 750679553 750705600 750812471 750973761
3993.4 750973761 751112342 751239717
3997.5 751239717
##END=$$ End of the data block
