##TITLE=G4-52-SE $$ Begin of the data block
##JCAMP-DX=5.00 $$ ACD/SpecManager v 10.08
##SPECTROMETER/DATA SYSTEM=Alpha
##DATE=17 Oct 2013 10:58:30
##DATA TYPE=INFRARED SPECTRUM
##DATA CLASS=XYDATA
##ORIGIN=
##OWNER=
##NPOINTS=1765
##FIRSTX=399.75695801
##LASTX=3997.56933594
##MAXX=3997.56933594
##MINX=399.75695801
##MAXY=0.82662749
##MINY=0.33070257
##XFACTOR=1.0000000000
##YFACTOR=1.000000000000000e-9
##FIRSTY=0.56203461
##DELTAX=2.03957629
##XUNITS=1/CM
##YUNITS=ARBITRARY UNITS
##XYDATA=(X++(Y..Y))
399.8E62034607k397299j486063j076758n75244K52545R11235J028657N72861j98007
418.1E59066534j029849r79960r41038k197564k731740j330495j63019p54118j607716
436.5E47331035n52118J660168K728880J718759K01405J8119N73934L54886p77424
454.8E53257644j750231j850605j517355j863658k740384k983689k131760j095891
471.1E37324071j271427k140581j940191p95901j36256n19037j123250r65953l17335
489.5E28114140l60668j423239k445400k419412j569689j290083k210974l054023k771616
507.9E10569036j902759j696944k306640k673388k287030j485229r38385r72778q92311
526.2D95413572J5586J138598J525074J313597J434416K299905K936542K201557O12914
$$ plain form
399.8 562034607 559637308 558151245 557074487 556499243 556751788 557663023 558691680 559264541 559066534
418.1 559066534 558036685 557056725 556115687 553918123 551186383 549855888 549692869 548938751 547331035
436.5 547331035 546778917 548439085 551167965 552886724 553088129 553106248 553680182 554035068 553257644
454.8 553257644 551507413 549656808 548139453 546275795 543535411 540551722 538419962 537324071
471.1 537324071 536052644 533912063 531971872 531175971 531039715 530520678 529397428 528431475 528114140
489.5 528114140 527753472 526330233 523884833 521465421 519895732 518605649 516394675 513340652 510569036
507.9 510569036 508666277 506969333 504662693 501989305 499702275 498217046 497278661 496305883 495413572
526.2 495413572 495429158 496567756 498092830 499406427 500840843 503140748 506077290 508278847 508891761
544.6E08891761m32193m68075k04683n63502j550496k094030j696706j286983j741976
562.9D98853117k653897k847194j873732p19011k55197o0499O81013K093166L233016
581.3D96450782L234327K513766K181292K296686J939177Q04186k36809k23458M77970
599.6E09437919P08937J37329l57449l57P89702J014411M71056N3167O80089K047062
620E14981866K791643K438307K026975K424479K937495K593041J615047J011551J298904
638.4E34119308J878917J741231Q91924L46303O69241J164734Q57651P4685j31667
656.7E41612327M26233R34064P93755K87354L0578R23931J791239J418114Q90672Q96454
677.1E50004721J561582J960099J428604N76675K89619O40928P13170k12491j287937
$$ plain form
544.6 508891761 508459568 507991493 507786810 507223308 505672812 503578782 501882076 500595093 498853117
562.9 498853117 496199220 493352026 491478294 490759283 490504086 490443587 491124600 493217766 496450782
581.3 496450782 499685109 502198875 504380167 506676853 508616030 509420216 509183407 508959949 509437919
599.6 509437919 510146856 510284185 509926736 509926379 510716081 511730492 512201548 512254715 512934804 514981866
620 514981866 517773509 520211816 522238791 524663270 527600765 530193806 531808853 532820404 534119308
638.4 534119308 535998225 537739456 538631380 538977683 539646924 540811658 541669309 541743994 541612327
656.7 541612327 542038560 542972624 543766379 544053733 544084311 545008242 546799481 548217595 549108267 550004721
677.1 550004721 551566303 553526402 554955006 555531681 555821300 556462228 557175398 556962907 555674970
695.5E55674970j333415m25876M36247O38127O25372J235724K365768K990007K857685
713.8E65064609K761245L276586M227281M660189M192293L728509L800213M017890
730.2E95728815L612518K427637J425922J291275J402677R22620k6643o50466m95911
748.5F05638444k81870p50005j563311j865446j364410o92845l45766r835Q94487K352536
768.9F02011979L791511M580080M648805M637241M828096M768431M101634L065526
785.2F36433303K259314K106488K278507K137065J786172J916766K611220L255964
801.6F54784799L221750K529502J952648J795173J619100J066745K75611k49683l28422
819.9F66667223m86314j205325k300263k955437k697408k320111k588152l115654l098786
$$ plain form
695.5 555674970 554341555 553915679 554351926 554990053 555615425 556851149 559216917 562206924 565064609
713.8 565064609 567825854 571102440 575329721 579989910 584182203 587910712 591710925 595728815
730.2 595728815 599341333 601768970 603194892 604486167 605888844 606811464 606784821 606134355 605638444
748.5 605638444 605356574 604606569 603043258 601177812 599813402 599120557 598774791 598764956 599659443 602011979
768.9 602011979 605803490 610383570 615032375 619669616 624497712 629266143 633367777 636433303
785.2 636433303 638692617 640799105 643077612 645214677 647000849 648917615 651528835 654784799
801.6 654784799 658006549 660536051 662488699 664283872 665902972 666969717 667245328 666995645 666667223
819.9 666667223 666180909 664975584 662675321 659719884 657022476 654702365 652114213 648998559 645899773
838.3F45899773k452076j911461j970172k193213j851379j052738o25491r03249j213848
856.6F31726146o15657J083434L066719M340350M923403N418063N635619M845738L027141
875F63450956J020849n48720j861871l253758m556834n300522n204260m703820m583776
893.3F34458244m770339m701078m432261m469156n048096n874097o341517o236494
909.6E92585206o078601o167173n984545n027711l550589k222240j451433j092911
926E61010003p55072l42488r3341j61290l24428l02434k81155q60930k444386m699349
946.4E50745130o801188q244217r092510r530723r571790r299785q960754q706838
962.7D80537325q496612q096695p325858o344914n382479m430860l412545k442747
$$ plain form
838.3 645899773 643447697 641536236 639566064 637372851 635521472 634468734 633843243 632939994 631726146
856.6 631726146 631110489 632193923 635260642 639600992 644524395 649942458 655578077 660423815 663450956
875 663450956 664471805 663923085 662061214 658807456 654250622 648950100 643745840 639042020 634458244
893.3 634458244 629687905 624986827 620554566 616085410 611037314 605163217 598821700 592585206
909.6 592585206 586506605 580339432 574354887 569327176 565776587 563554347 562102914 561010003
926 561010003 560254931 559912443 559819102 559657812 559333384 559030950 558749795 557888865 555444479 550745130
946.4 550745130 543943942 535699725 526607215 517076492 507504702 498204917 489244163 480537325
962.7 480537325 472040713 463944018 456618160 450273246 444890767 440459907 437047362 434604615
979D34604615j802206j597136j657129j696050j600206j536607j539320j413882j021087
997.3D20740992m67658p0304j9222k34366n30034q52466j251012j603812j706898j580507
1017.7D12424713j454502j516521j746118j930684j892716j721173j681566j842857
1034.1C98638576j958579j872301j734793j712859j709759j532882j156599o91950
1050.4C86268854k22355K17944O42866J122952J588672J888067K000957J857102J124204
1068.7C96489263j66476j229137j326144m23133R55104K247721L190339L809273M218698
1087.1D07765508M442095M390985M020512L461600K884000K361417J873702J443088
1103.4D32642907J238614J426846J888514K281457K402693K328247K213478K087205
$$ plain form
979 434604615 432802409 431205273 429548144 427852094 426251888 424715281 423175961 421762079 420740992
997.3 420740992 420273334 420203030 420183808 419949442 419419408 418566942 417315930 415712118 414005220 412424713
1017.7 412424713 410970211 409453690 407707572 405776888 403884172 402162999 400481433 398638576
1034.1 398638576 396679997 394807696 393072903 391360044 389650285 388117403 386960804 386268854
1050.4 386268854 386046499 386264443 386907309 388030261 389618933 391507000 393507957 395365059 396489263
1068.7 396489263 396322787 395093650 393767506 393344373 394299477 396547198 399737537 403546810 407765508
1087.1 407765508 412207603 416598588 420619100 424080700 426964700 429326117 431199819 432642907
1103.4 432642907 433881521 435308367 437196881 439478338 441881031 444209278 446422756 448509961
1119.7D48509961J856149J507967J295477J516998K134621K614379K489955J923054
1136D63848561J275957O79165J18732m04685p84696q36879n76287k49833L3259M41134
1156.4D63544428J177311K139211K915561L300309L510744L820657M276455M671276
1172.7D89355952M865706N038648N392790N774975N805850N415440M954576M594088
1189.1E31198025M070043L116727J851261P65085J78278j40727n10275q38459q18550
1207.4E38871408m04954K6822J00195r5844k26379k03609k56300o07491j127302j439452
1227.8E34637094j444996j365960j347422j274824r67205m20272J62601N96702R34065
1246.2E29509783J345634J852155K191961K201915K074658K046526K150357K199232
$$ plain form
1119.7 448509961 450366110 451874077 453169554 454686552 456821173 459435552 461925507 463848561
1136 463848561 465124518 465803683 465922415 465517730 464733034 463896155 463319868 463070035 463103294 463544428
1156.4 463544428 464721739 466860950 469776511 473076820 476587564 480408221 484684676 489355952
1172.7 489355952 494221658 499260306 504653096 510428071 516233921 521649361 526603937 531198025
1189.1 531198025 535268068 538384795 540236056 541001141 541179419 541038692 540528417 539689958 538871408
1207.4 538871408 538466454 538493276 538593471 538497627 538271248 538067639 537811339 537203848 536076546 534637094
1227.8 534637094 533192098 531826138 530478716 529203892 528236687 527816415 527979016 528575718 529509783
1246.2 529509783 530855417 532707572 534899533 537101448 539176106 541222632 543372989 545572221
1262.5E45572221K078176J958668J989424K052665J933515J576603J173198R39309
1278.8E59273779R43363J062691J106263R99510Q28445O64830L68535j42514p60615
1297.2E64344287j255334j469731j533747j654386j787424j709938j359403r08316
1313.5E52666008n57303k69949O6995L50356K76447k94984j113891j741886j976133
1331.8E47405660j958072j818419j620888j344621r38058n83291n39303p66635j018822
1350.2E36817551j178027j351058j610637j849413k107441k593637l175735l498435
1366.5E19453168l481984k973140k495884k665520l090561l409147l664762l565222
1382.8D94106948k859175j982778j212657n10573n4657Q5383Q8453J27882M51297J046747
$$ plain form
1262.5 545572221 547650397 549609065 551598489 553651154 555584669 557161272 558334470 559273779
1278.8 559273779 560217142 561279833 562386096 563385606 564214051 564878881 565247416 565104902 564344287
1297.2 564344287 563088953 561619222 560085475 558431089 556643665 554933727 553574324 552666008
1313.5 552666008 552108705 551838756 551905751 552256107 552532554 552237570 551123679 549381793 547405660
1331.8 547405660 545447588 543629169 542008281 540663660 539725602 539142311 538603008 537836373 536817551
1350.2 536817551 535639524 534288466 532677829 530828416 528720975 526127338 522951603 519453168
1366.5 519453168 515971184 512998044 510502160 507836640 504746079 501336932 497672170 494106948
1382.8 494106948 491247773 489264995 488052338 487541765 487487108 487572491 487660944 487788826 488240123 489286870
1403.2D89286870J521945J609921J528025J556754J733333J986652K128751K051413
1419.5E03403664J876354J923501J912475J515865Q32558K27511p808l61085p66754
1437.9E10556281m62711J01864N03361O79970N09262K15292K31981P63596J640975
1456.2E14739871K130687K021134K203047K668918L059923L704906N180537P113696
1472.6E42822719P380604O012202M614949L345489K226592J138269j46091j934349
1488.9E65460384l575027l869236m116892n230904n738854n223454m567205n523086
1505.2E27615726q632898q674085p241309o682247n546957l878266k371490k055615
1521.5D82532859k255976k274633k468109k211988j865804j853883j325608o09576
$$ plain form
1403.2 489286870 490808815 492418736 493946761 495503515 497236848 499223500 501352251 503403664
1419.5 503403664 505280018 507203519 509115994 510631859 511464417 511691928 511684120 511323035 510556281
1437.9 510556281 510093570 510195434 510698795 511378765 511888027 512103319 512335300 513098896 514739871
1456.2 514739871 516870558 518891692 521094739 523763657 526823580 530528486 535709023 542822719
1472.6 542822719 550203323 556215525 560830474 564175963 566402555 567540824 567394733 565460384
1488.9 565460384 561885357 558016121 553899229 548668325 542929471 537706017 533138812 527615726
1505.2 527615726 518982828 510308743 503067434 496385187 490838230 486959964 484588474 482532859
1521.5 482532859 480276883 478002250 475534141 473322153 471456349 469602466 468276858 467667282
1537.8D67667282o00756n70565J85460J037121J862108K659679L362179M019558M475325
1556.2D84097391N065591M785180L352403L153563L338933L116548K665520K130508
1572.5E11705637J953602J658499R18210M45067J98603P9394j25647n28634j102149
1590.9E15202582j617134k119779k690792l348232m109919m852772n509108o266892
1607.2D84687954p338911q040935q047759q953572j0921806j0227233r709775j1355013
1623.5D10092950j1549860j0764331j0283530q907914p988930q355140o504387l480077
1639.8C42258781j617670k98321P22289J494497J885057K464681L216952L186435L545523
1658.2C56858224M642367N862862O570518O545156P254332Q164943P710695P908016
$$ plain form
1537.8 467667282 467066526 466495961 466681421 467718542 469580650 472240329 475602508 479622066 484097391
1556.2 484097391 489162982 493948162 497300565 500454128 503793061 506909609 509575129 511705637
1572.5 511705637 513659239 515317738 516235948 516681015 516879618 516959012 516833365 516304731 515202582
1590.9 515202582 513585448 511465669 508774877 505426645 501316726 496463954 490954846 484687954
1607.2 484687954 477349043 469308108 461260349 452306777 441384971 431157738 421447963 410092950
1623.5 410092950 398543090 387778759 377495229 368587315 360598385 352243245 345738858 342258781
1639.8 342258781 340641111 340342790 341065079 342559576 344444633 346909314 350126266 353312701 356858224
1658.2 356858224 361500591 367363453 373933971 380479127 387733459 395898402 403609097 411517113
1674.5D11517113Q547515Q234382Q162468R224117J1121244J0438174R539991J0685563
1690.8D87470567J1513710J3720930J5606284J5362740J6068279J3396144J1148155
1705.1E84286809J0766447R255826Q035898P326722O801606O352722N175412M025757
1721.4F42027199L616929L379643K994240K761900K546012K270461J845896J751661
1737.7F63193941K105534K519727L056526L815830M595995N234480N522847N313158
1754F95358038N304396N312204N032897M872978M422724M052937M006625L848433L531397
1772.4G35742629K984225K560973K524794K459883K230466K040982J938105J946091
1788.7G54428148J931370J749694J498997J479268J541674J483024J330494J253248
$$ plain form
1674.5 411517113 420064628 428299010 436461478 445685595 456806839 467245013 476785004 487470567
1690.8 487470567 498984277 512705207 528311491 543674231 559742510 573138654 584286809
1705.1 584286809 595053256 604309082 612344980 619671702 626473308 632826030 638001442 642027199
1721.4 642027199 645644128 649023771 652018011 654779911 657325923 659596384 661442280 663193941
1737.7 663193941 665299475 667819202 670875728 674691558 679287553 684522033 690044880 695358038
1754 695358038 700662434 705974638 711007535 715880513 720303237 724356174 728362799 732211232 735742629
1772.4 735742629 738726854 741287827 743812621 746272504 748502970 750543952 752482057 754428148
1788.7 754428148 756359518 758109212 759608209 761087477 762629151 764112175 765442669 766695917
1805G66695917J301050J347542J304328J179516J123071J108945J134395J187146J191139
1823.4G77573049J114011J057029J008987Q43942P45476P40528P53641Q38399R39071
1841.7G85614133Q18252N60046N10692N98014O28471N77211N47469N73456N96047N47528
1862.1G91571319N44071O15657N70237L76940L01957L86775M61995N10693N29706N14985
1882.5G96384335M92692N31792N68807N07892M46736M09723L76522L89874M14610L57986
1902.9H00880969L02136L49938L87252L16560K52485L07679L73483L33667K34246J75894
1923.3H03914309K05218K48790K22921J84536J86086K20061K76446K75850J80721J09733
1943.7H06024671J62124J96100J58667J50681K07364K84434K82585K05398J49846K08199
$$ plain form
1805 766695917 767996967 769344509 770648837 771828353 772951424 774060369 775194764 776381910 777573049
1823.4 777573049 778687060 779744089 780753076 781597018 782342494 783083022 783836663 784675062 785614133
1841.7 785614133 786432385 786992431 787503123 788101137 788729608 789306819 789854288 790427744 791023791 791571319
1862.1 791571319 792115390 792731047 793301284 793678224 793980181 794366956 794828951 795339644 795869350 796384335
1882.5 796384335 796877027 797408819 797977626 798485518 798932254 799341977 799718499 800108373 800522983 800880969
1902.9 800880969 801183105 801533043 801920295 802236855 802489340 802797019 803170502 803504169 803738415 803914309
1923.3 803914309 804119527 804368317 804591238 804775774 804961860 805181921 805458367 805734217 805914938 806024671
1943.7 806024671 806186795 806382895 806541562 806692243 806899607 807184041 807466626 807672024 807821870 808030069
1964.1H08030069K80022K23578J24633J21057J93000K22921J74642J01447R8228J47045
1984.5H09716642J69039J44481Q0109L0518P1287J32084J00195L2365R656L5048J8716
2006.9H10540140o4791j22010q6129l9995j10507k33352k48372j47403j12056k07782
2027.3H09167743k84314k42711j60098j17123j37150j83761j97113j64687j06097r4592
2047.7H07480097r4950m0591L1352O0558L3021L517N2750J31607J17004O7174O1632
2070.2H07903171R7513J42097J35720P6115M1306N5254Q7797J10090J04487J11342
2090.5H08864892J29044J51276J58012J26839R6380J30594K10464K22862J28627M4226
2110.9H10263216R1970J91272J94967Q7440L457M6134J55091J70469N5433L039J04666
$$ plain form
1964.1 808030069 808310091 808533669 808658302 808779359 808972359 809195280 809369922 809471369 809569597 809716642
1984.5 809716642 809885681 810030162 810110271 810140789 810212076 810344160 810444355 810476720 810486376 810521424 810540140
2006.9 810540140 810475349 810353339 810267210 810227215 810116708 809883356 809634984 809487581 809375525 809167743
2027.3 809167743 808883429 808640718 808480620 808363497 808226347 808042586 807845473 807680786 807574689 807480097
2047.7 807480097 807385147 807344556 807375908 807436466 807469487 807473004 807525754 807657361 807774365 807841539 807903171
2070.2 807903171 808000684 808142781 808278501 808354616 808395922 808451176 808538973 808649063 808753550 808864892
2090.5 808864892 808993936 809145212 809303224 809430063 809526443 809657037 809867501 810090363 810218990 810263216
2110.9 810263216 810355186 810546458 810741425 810828865 810832322 810878456 811033547 811204016 811259449 811262488 811367154
2133.4H11367154J99497J45376L9517L4571J23024J73867J06215J9730O6518K11299
2153.8H12486768K68280J87338J19745J86503K90752L08454K60830K43664L42488M76181
2174.2H15171003M68254L29793K53975L32356M29630L75986K43068K47419L83198M46797
2194.6H18681479L57270K29478K35736L67939M19081L00288J70171K17378L71933M00067
2215H21750820K75671J89781K37346L07620K96056K12669J45078J71006K39014K23935
2235.4H24048996J30951Q8692J29044J90914J88529R5904M5121J06811J64092J41323
2255.8H25330377Q2612O0796J05501J30772R6798O2347O8724J26362J73986J20639
2276.1H26358914L0816N0068R7990O9201K0504m4346r8050m9531L6657J0550j17719
$$ plain form
2133.4 811367154 811566651 811712027 811751544 811786115 811909139 812083006 812189221 812208951 812275469 812486768
2153.8 812486768 812755048 812942386 813062131 813248634 813539386 813847840 814108670 814352334 814694822 815171003
2174.2 815171003 815639257 815969050 816223025 816555381 816985011 817360997 817604065 817851484 818234682 818681479
2194.6 818681479 819038749 819268227 819503963 819871902 820290983 820591271 820761442 820978820 821350753 821750820
2215 821750820 822026491 822216272 822453618 822761238 823057294 823269963 823415041 823586047 823825061 824048996
2235.4 824048996 824179947 824268639 824397683 824588597 824777126 824873030 824918151 825024962 825189054 825330377
2255.8 825330377 825412989 825473785 825579286 825710058 825806856 825869203 825937927 826064289 826238275 826358914
2276.1 826358914 826389730 826439798 826537788 826606989 826627493 826583147 826485097 826435566 826472223 826482773 826365054
2298.6H26365054k04981j48654n6863r9778k11000k22802j52707j17481j79231k98500
2319H24673057l74020l13758j69218k09570l73900l68059k28941j53482k07305k95162
2339.4H21979642l13878k19882L5584K40982R537m64201o81103n75900n44250n30123
2359.8H18936408l25501k1458J51277J28507O2108R1732J82628K03073J43409J18435
2380.2H19670618J47640J46687J9789j88827l03805k79606k29776k41398l29674m05788
2400.6H18005860l73364l04281l25442m35650n02527m56691m06444m44054n13971n41687
2421H13701749n14150m87745n32746n94318n79476n25296n19752n65768o01947n84543
2441.3H08196008n40435n26786n73337o37054o25849n76139n54085n56707n61058n49078
$$ plain form
2298.6 826365054 826160073 826011419 825954556 825854778 825643778 825420976 825268269 825150788 824971557 824673057
2319 824673057 824299037 823985279 823816061 823606491 823232591 822864532 822635591 822482109 822274804 821979642
2339.4 821979642 821665764 821445882 821481466 821722448 821731985 821267784 820586681 820010781 819466531 818936408
2359.8 818936408 818610907 818589449 818740726 818869233 818931341 819023073 819205701 819408774 819552183 819670618
2380.2 819670618 819818258 819964945 819984734 819795907 819492102 819212496 818982720 818741322 818411648 818005860
2400.6 818005860 817632496 817328215 817002773 816567123 816064596 815607905 815201461 814757407 814243436 813701749
2421 813701749 813187599 812699854 812167108 811572790 810993314 810468018 809948266 809382498 808780551 808196008
2441.3 808196008 807655573 807128787 806555450 805918396 805292547 804716408 804162323 803605616 803044558 802495480
2461.7H02495480n39542n27262n19634n44786n88238n96404n39482m93050n30004n70357
2482.1G97046721n41806m95792m87029n22137n59747n48840m76360m35650m80056n15580
2502.5G91983724m88818m28677m33147n06818n17905m71472m58599m87983n40673n61059
2522.9G87088573n13256m78923n20229n96226o17086n60105n43595o03497o58452o59466
2543.3G81337738n86629n15401n35488n95630o09576n76675n48065n45263n83232n98311
2563.7G75643468n33402m87506n03123n59569o07192n63622n13136n45561n93543o01411
2584.1G70135403n70357n35250n37097n57661n48482n06103m85540n36620o16610o50585
2604.5G64591098o45876o50823o79553p25806p92086q39650q30412q42691r12666r50456
$$ plain form
2461.7 802495480 801955938 801428676 800909042 800364256 799776018 799179614 798640132 798147082 797617078 797046721
2482.1 797046721 796504915 796009123 795522094 794999957 794440210 793891370 793415010 792979360 792499304 791983724
2502.5 791983724 791494906 791066229 790633082 790126264 789608359 789136887 788678288 788190305 787649632 787088573
2522.9 787088573 786575317 786096394 785576165 784979939 784362853 783802748 783259153 782655656 781997204 781337738
2543.3 781337738 780751109 780235708 779700220 779104590 778495014 777918339 777370274 776825011 776241779 775643468
2563.7 775643468 775110066 774622560 774119437 773559868 772952676 772389054 771875918 771330357 770736814 770135403
2584.1 770135403 769565046 769029796 768492699 767935038 767386556 766880453 766394913 765858293 765241683 764591098
2604.5 764591098 763945222 763294399 762614846 761889040 761096954 760257304 759426892 758584201 757671535 756721079
2624.9G56721079r52363r85264j011432j009762r97722r82642r83477j004696j058221
2643.3G47735500j084804j029790r83417j020789j062035j039565j005828r89378r94742
2661.6G38525152j022517j002551r23633q76010r09030r68754r53853q84235q56400
2680G30128169q54850q47399q80480r07361q44598q26359r04202r39906r45270r65118
2700.4G21212626r93729j045227j069606j038849j034915j073420j101435j100301
2716.7G12755144j058519j029790j050472j037955r61840r18687r54389r85146r28938
2735G03829408q56817q67248r01401q97944q72135q21769p91431q31246q69572q54254
2755.4F95265591q40008q29935p87497p78019q28743q49426q47638r03129r67682r47475
$$ plain form
2624.9 756721079 755768716 754783452 753772020 752762258 751764536 750781894 749798417 748793721 747735500
2643.3 747735500 746650696 745620906 744637489 743616700 742554665 741515100 740509272 739519894 738525152
2661.6 738525152 737502635 736500084 735576451 734700441 733791411 732822657 731868804 730984569 730128169
2680 730128169 729273319 728425920 727545440 726638079 725793481 724967122 724062920 723123014 722177744 721212626
2700.4 721212626 720218897 719173670 718104064 717065215 716030300 714956880 713855445 712755144
2716.7 712755144 711696625 710666835 709616363 708578408 707616568 706697881 705743492 704758346 703829408
2735 703829408 702972591 702105343 701203942 700305998 699433863 698612094 697820663 696989417 696119845 695265591
2755.4 695265591 694425583 693595648 692808151 692030132 691201389 690351963 689504325 688601196 687633514 686686039
2775.8F86686039r45866j054585j135230j132250j142383j178324j200795j258254
2792.2F77638352j347065j377821j379073j431644j521647j584589j613617j631856
2808.5F65751040j652658j696408j758277j803816j862108j955092k048493k136230
2824.8F50837958k177060k214610k360106k553463k736091k975405l325343l817141
2841.1F28678739m467010n155683n674481n827129n419255m430413l178954k126515
2857.4E92399299j637101j809776k399266l073215l589869l758311l504395k960682
2873.7E69666684k308250j663267j192928r80913r67026j057923j163602j286507j466155
2892.1E57580113j670658j854122k025425k207637k430380k714931l030897l405273
$$ plain form
2775.8 686686039 685740173 684685588 683550358 682418108 681275725 680097401 678896606 677638352
2792.2 677638352 676291287 674913466 673534393 672102749 670581102 668996513 667382896 665751040
2808.5 665751040 664098382 662401974 660643697 658839881 656977773 655022681 652974188 650837958
2824.8 650837958 648660898 646446288 644086182 641532719 638796628 635821223 632495880 628678739
2841.1 628678739 624211729 619056046 613381565 607554436 602135181 597704768 594525814 592399299
2857.4 592399299 590762198 588952422 586553156 583479941 579890072 576131761 572627366 569666684
2873.7 569666684 567358434 565695167 564502239 563521326 562554300 561496377 560332775 559046268 557580113
2892.1 557580113 555909455 554055333 552029908 549822271 547391891 544676960 541646063 538240790
2908.4E38240790l884196m410028m881621n168080n122304m702687l983498l032207
2924.7E03056169j881004o49810M83752J490473K465070L377378M050016M346669M232347
2943.1E20971060L765583L106296K406239J712740J091182P83205R74655J531422K229751
2961.4E38572133K940952L596902M218757M787445N170644N311429N270839N139053
2977.8E75008154M919052M552066M123271L709912L280461K858400K385319J798212
2994.1F02634847J219213O86705J74523k90215p29800j039981j090169r91345r43780
3012.4E99629998r69529r43065q94963j007677j297593j621127j809120j791358j712620
3030.8E87582946j721323j846611j970053j996338k031029k130270k240657k295077
$$ plain form
2908.4 538240790 534356594 529946566 525064945 519896865 514774561 510071874 506088376 503056169
2924.7 503056169 501175165 500525355 501009107 502499580 504964650 508342028 512392044 516738713 520971060
2943.1 520971060 524736643 527842939 530249178 531961918 533053100 533836305 534810960 536342382 538572133
2961.4 538572133 541513085 545109987 549328744 554116189 559286833 564598262 569869101 575008154
2977.8 575008154 579927206 584479272 588602543 592312455 595592916 598451316 600836635 602634847
2994.1 602634847 603854060 604540765 604715288 604425073 603695273 602655292 601565123 600573778 599629998
3012.4 599629998 598660469 597717404 596822441 595814764 594517171 592896044 591086924 589295566 587582946
3030.8 587582946 585861623 584015012 582044959 580048621 578017592 575887322 573646665 571351588
3047.1E71351588k242863k169729k219557k317608k308130k205908k075553j973331
3063.4E53838909j920104j828432j663089j511693j461745j492261j460433j366556
3079.7E41134596j317322j291395j250147j159907j033425r94027j047551j077295
3096E31963527j040578j016438j094043j213968j282096j285255j249969j233637j284897
3114.4E21262646j367927j420259j508475j640916j703381j702011j689553j674056
3130.7E08556068j720727j833200j886010j870513j883805j914620j934648j961589
3147D93550956j944899j913965j995415k117544k130687k056599j998901k017737k104699
3165.4D75270510k175927k148778k083987k076238k109557k131433k122402k112836
$$ plain form
3047.1 571351588 569108725 566938996 564719439 562401831 560093701 557887793 555812240 553838909
3063.4 553838909 551918805 550090373 548427284 546915591 545453846 543961585 542501152 541134596
3079.7 541134596 539817274 538525879 537275732 536115825 535082400 534088373 533040822 531963527
3096 531963527 530922949 529906511 528812468 527598500 526316404 525031149 523781180 522547543 521262646
3114.4 521262646 519894719 518474460 516965985 515325069 513621688 511919677 510230124 508556068
3130.7 508556068 506835341 505002141 503116131 501245618 499361813 497447193 495512545 493550956
3147 493550956 491606057 489692092 487696677 485579133 483448446 481391847 479392946 477375209 475270510
3165.4 475270510 473094583 470945805 468861818 466785580 464676023 462544590 460422188 458309352
3181.7D58309352k098232k091080k098233k054631k005518k018720k050578k056420
3198D41835940k000451j909226j852453j836687j841963j812428j753777j735926j763880
3216.4D25329149j805723j786888j712203j712232j794577j838297j810729j803369
3232.7D11065131j903474k021789k068490k083183k095460k138675k202779k249568
3249C94301713k268702k282113k308756k340824k356410k307713k229660k189726k134234
3267.4C73883575k005547j881212j790464j677930j569122j476646j374215j245677
3283.7C60862762j081646r26941q10355p44552o89506n97775n37396n04315m24534
3302C54545742l24547k89321l22789l55393l17126k20269k07752k73854k61485j76102
$$ plain form
3181.7 458309352 456211120 454120040 452021807 449967176 447961658 445942938 443892360 441835940
3198 441835940 439835489 437926263 436073810 434237123 432395160 430582732 428828955 427093029 425329149
3216.4 425329149 423523426 421736538 420024335 418312103 416517526 414679229 412868500 411065131
3232.7 411065131 409161657 407139868 405071378 402988195 400892735 398754060 396551281 394301713
3249 394301713 392033011 389750898 387442142 385101318 382744908 380437195 378207535 376017809 373883575
3267.4 373883575 371878028 369996816 368206352 366528422 364959300 363482654 362108439 360862762
3283.7 360862762 359781116 358854175 358043820 357299268 356609762 356011987 355474591 354970276 354545742
3302 354545742 354221195 353931874 353609085 353253692 352936566 352716297 352508545 352234691 351973206 351797104
3322.4C51797104j59383k50816l32862l28601l24040l65049l67284l63350m52548n55098
3342.8C48298073n82278n77599n99772o67512p44313p58916p08401o80715p05838p31409
3363.2C41541320p20441o96570p38501q40903q44627p19399o35296o28084o35564o15656
3383.6C34466279n30005l62605k32070l06577m55469m36514k60026j23292k02060l54916
3404C31202745k89768j07020l3706m3035k6643L4064J27524J94013K26409L64720N69672
3426.5C32218975P00325P10308P31349Q03173P68035O72937P10159R08375J107127
3444.8C39330763J173019J123279J129508J232595J349806J456351J479238J399040
3461.1C49673599J421332J643271J818657J688867J410961J415164J663744J888454
$$ plain form
3322.4 351797104 351637721 351386905 351054043 350725442 350401402 350036353 349669069 349305719 348853171 348298073
3342.8 348298073 347715795 347138196 346538424 345870912 345126599 344367683 343659282 342978567 342272729 341541320
3363.2 341541320 340820879 340124309 339385808 338544905 337700278 336980879 336345583 335717499 335081935 334466279
3383.6 334466279 333936274 333573669 333341599 333035022 332579553 332143039 331883013 331759721 331557661 331202745
3404 331202745 330912977 330805957 330772251 330729216 330702573 330736637 330864161 331058174 331284583 331649303 332218975
3426.5 332218975 332919300 333629608 334360957 335164130 335932165 336605102 337315261 338223636 339330763
3444.8 339330763 340503782 341627061 342756569 343989164 345338970 346795321 348274559 349673599
3461.1 349673599 351094931 352738202 354556859 356245726 357656687 359071851 360735595 362624049
3477.4C62624049J951456J838535J784146J903951J973778J938641J966834K008051
3493.8C77989441K044231K093553K140105K129048J984597J909971K034843K175808
3510.1C94501597K276152K282530K176881K222866K425790K560466K484381K330959
3526.4D13261622K337724K443612K533883K649039K707630K677560K789497K964348
3542.7D34364915K924085K700895K646535K786458K881944K942145L072858L226608
3559D57546443L258794L212989L206551L355801L520965L492535L448426L535629L684610
3577.4D88262743L846109L969907M027456L994883L904938L950537L984808L964246
3593.7E19905627M040241M180014M237950M197836M132986M048347M125596M275739
$$ plain form
3477.4 362624049 364575505 366414040 368198186 370102137 372075915 374014556 375981390 377989441
3493.8 377989441 380033672 382127225 384267330 386396378 388380975 390290946 392325789 394501597
3510.1 394501597 396777749 399060279 401237160 403460026 405885816 408446282 410930663 413261622
3526.4 413261622 415599346 418042958 420576841 423225880 425933510 428611070 431400567 434364915
3542.7 434364915 437289000 439989895 442636430 445422888 448304832 451246977 454319835 457546443
3559 457546443 460805237 464018226 467224777 470580578 474101543 477594078 481042504 484578133 488262743
3577.4 488262743 492108852 496078759 500106215 504101098 508006036 511956573 515941381 519905627
3593.7 519905627 523945868 528125882 532363832 536561668 540694654 544743001 548868597 553144336
3610E53144336M252195M206181M095494M030228M199386M157185L957987L817618L879368
3628.4E89739978M104436L910661L670990L636301L695786L758728L768683L753423
3644.7F20038986L657341L561735L447652L135801K912104L083944L186584K949059
3661F45973206K795219K881050K845705K644598K730906K606809K098501J976371K084970
3679.4F68637335K121747K284527K436578K333581J914502J560926J576841J668632
3695.7F84534669J660407J592993J458407J362145J393497J515507J429320J028955
3712F95975900R52661J133024J204610J179934J075148Q95203Q32021J062870J298010
3730.3G05609381J310289R71019O07610P80761J031638P35819N30183J044393J004815
$$ plain form
3610 553144336 557396531 561602712 565698206 569728434 573927820 578085005 582042992 585860610 589739978
3628.4 589739978 593844414 597755075 601426065 605062366 608758152 612516880 616285563 620038986
3644.7 620038986 623696327 627258062 630705714 633841515 636753619 639837563 643024147 645973206
3661 645973206 648768425 651649475 654495180 657139778 659870684 662477493 664575994 666552365 668637335
3679.4 668637335 670759082 673043609 675480187 677813768 679728270 681289196 682866037 684534669
3695.7 684534669 686195076 687788069 689246476 690608621 692002118 693517625 694946945 695975900
3712 695975900 696928561 698061585 699266195 700446129 701521277 702416480 703248501 704311371 705609381
3730.3 705609381 706919670 707890689 708498299 709279060 710310698 711046517 711576700 712621093 713625908
3748.7G13625908M11510L90351P76529Q11697O01172O11782P22647P20203P10249N75363
3769.1G19957411M67360O01530P67470Q09550O75559N30660M64320L98458M36425N80668
3789.5G25689411P04289P01010O39498O86467N39958L17276M52518L74913K23876M71115
3809.9G30800331P71403P40230N28753N03063K91765K00033M47273M32611L87490M62412
3830.3G35565364N84722O82115L90172J2577J13785K75612L28303M82320P31826O69599
3850.7G39836395p9751l19004L61085N49674M98056M44889L45230K66493J18971J32203
3871.1G42154241K18570K48253L78490L30209L03090L89040K27034J23083J19329N7339
3891.5G44548678K20478M36485M02748K48552Q9109j9968L0637Q3804O9082J69575
$$ plain form
3748.7 713625908 714037418 714427769 715204298 716015995 716617167 717228949 717951596 718671799 719382048 719957411
3769.1 719957411 720424771 721026301 721793771 722603321 723278880 723809540 724273860 724672318 725108743 725689411
3789.5 725689411 726393700 727094710 727734208 728420675 728960633 729277909 729730427 730105340 730329216 730800331
3809.9 730800331 731571734 732311964 732840717 733343780 733635545 733835578 734282851 734715462 735102952 735565364
3830.3 735565364 736150086 736832201 737222373 737234950 737348735 737624347 737952650 738434970 739166796 739836395
3850.7 739836395 739756644 739437640 739798725 740348399 740846455 741291344 741636574 741903067 742022038 742154241
3871.1 742154241 742372811 742621064 742999554 743329763 743632853 744021893 744248927 744372010 744491339 744548678
3891.5 744548678 744769156 745205641 745608389 745856941 745946050 745926082 745956719 746040523 746109605 746279180
3911.9G46279180L05891K43545N9724K6047J39057J87695J67370J76728J88410J85132
3932.3G47958779J40965Q7798R8824Q7560R8705J79470J73449J38164J40845J20521
3952.7G49225080J39654J75535J55449J10328Q4341O8009P2300J16349J51157J61231
3973.1G50459433J49786J22249P2062N2691J36018J69038P3433M1783R9301J23024
3993.4G51498818J51933J86145
3997.5G51836896
$$ plain form
3911.9 746279180 746585071 746828616 746888340 746914387 747053444 747241139 747408509 747585237 747773647 747958779
3932.3 747958779 748099744 748187542 748286366 748373926 748472631 748652101 748825550 748963714 749104559 749225080
3952.7 749225080 749364734 749540269 749695718 749806046 749890387 749958396 750030696 750147045 750298202 750459433
3973.1 750459433 750609219 750731468 750803530 750856221 750992239 751161277 751234710 751276493 751375794 751498818
3993.4 751498818 751650751 751836896
3997.5 751836896
##END=$$ End of the data block
