##TITLE=G4 - Co(HBPa)2ClO4 $$ Begin of the data block
##JCAMP-DX=5.00 $$ ACD/SpecManager v 10.08
##SPECTROMETER/DATA SYSTEM=Alpha
##DATE=27 May 2015 08:52:56
##DATA TYPE=INFRARED SPECTRUM
##DATA CLASS=XYDATA
##ORIGIN=
##OWNER=
##NPOINTS=1765
##FIRSTX=399.76428223
##LASTX=3997.64306641
##MAXX=3997.64306641
##MINX=399.76428223
##MAXY=0.85749871
##MINY=0.54968095
##XFACTOR=1.0000000000
##YFACTOR=1.000000000000000e-9
##FIRSTY=0.77831054
##DELTAX=2.03961372
##XUNITS=1/CM
##YUNITS=ARBITRARY UNITS
##XYDATA=(X++(Y..Y))
$$ plain form
399.8 778310537 774899840 770928741 768604398 769233048 771171987 773913026 777479887 780337691 781869888
418.1 781869888 782135308 781030118 779283524 777859032 776398778 773850799 770832002 767866254 764044404
436.5 764044404 760497153 759558320 760695517 761966109 762123287 759737909 754706323 749265313 745374262
454.8 745374262 742753863 741210818 741778672 744316697 747775674 750593901 751007736 749674559 748990297
473.2 748990297 749645114 750705779 752006054 753700554 755071044 756545484 759168208 761341035 761248767
491.5 761248767 759458959 756736457 754150867 753797889 755948365 759120762 763031542 767387152 770784616
509.9 770784616 773193240 775318384 776704788 777014554 777043641 777113795 776759207 776159823 775591969 774688303
530.3 774688303 773464024 772135079 770445764 768721759 767745078 767527461 768006265 769562006 771723628
$$ packed form
399.8G78310537l410697l971099k324343O28650J938939K741039L566861K857804J532197
418.1G81869888K65420j105190j746594j424492j460254k547979l018797k965748l821850
436.5G64044404l547251r38833J137197J270592J57178k385378n031586n441010l891051
454.8G45374262k620399j543045N67854K538025L458977K818227M13835j333177o84262
473.2G48990297O54817J060665J300275J694500J370490J474440K622724K172827r2268
491.5G61248767j789808k722502k585590l52978K150476L172397L910780M355610L397464
509.9G70784616K408624K125144J386404L09766K9087P0154l54588n99384n67854r03666
530.3G74688303j224279j328945j689315j724005r76681k17617M78804J555741K161622
$$ plain form
548.7 771723628 773445249 774584830 775212824 775086999 774487793 773846209 773075879 772086978 770975053
567 770975053 769687057 768318832 767056704 765605450 763774514 762193203 761514246 761481583 761093438
585.4 761093438 759549618 756748676 752938032 748604655 744952857 743561745 744750381 747209013
601.7 747209013 749795496 752026558 752855301 750843644 744624972 732520223 713152647 687701404
618 687701404 662269175 646286011 647648871 668218613 701047897 733847857 757778764 771420598
634.3 771420598 779308319 786141574 792144656 796073854 798200548 799168885 799415410 799066365 797492862
652.7 797492862 794036150 788993955 784149289 782399714 785102129 789858520 794035852 796983957
669 796983957 798106134 797373354 796079338 795859635 796607494 797531307 798449576 799102426 799285412 799683392
$$ packed form
548.7G71723628J721621J139581O27994j25825n99206o41584p70330r88901j111925
567G70975053j287996j368225j262128j451254j830936j581311o78957l2663l88145
585.4G61093438j543820k800942l810644m333377l651798j391112J188636K458632
601.7G47209013K586483K231062Q28743k011657o218672j2104749j9367576k5451243
618F87701404k5432229j5983164J362860K0569742L2829284L2799960K3930907J3641834
634.3G71420598P887721O833255O003082L929198K126694R68337K46525l49045j573503
652.7G97492862l456712n042195m844666j749575K702415M756391M177332K948105
669G96983957J122177p32780j294016k19703P47859R23813R18269O52850J82986L97980
$$ plain form
689.4 799683392 800734460 801803291 802551508 803034246 802887917 802188456 801445305 800403953 798734069
707.7 798734069 796587586 793407261 788434505 782489061 776972532 772379935 768476963 763695955
724.1 763695955 755808890 745080054 735149026 730454922 733436763 742704749 754094183 763907313
740.4 763907313 770254076 771950245 767761648 757283807 741101563 719627976 693853438 667105258
756.7 667105258 644132674 628465533 621436775 624582231 638998568 660195887 681465566 701282144
773 701282144 720589280 738743544 754145682 765416980 773604393 782287061 793197691 804684818
789.3 804684818 814942181 823229730 829168200 833069861 835637033 836979032 837265730 837226748 837069392
807.7 837069392 836598337 836109340 835610509 834374309 832029521 828629255 823951602 818530560 814624310
$$ packed form
689.4G99683392J051068J068831P48217M82738j46329o99461p43151j041352j669884
707.7G98734069k146483l180325m972756n945444n516529m592597l902972m781008
724.1G63695955p887065j0728836r931028m694104K981841R267986J1389434R813130
740.4G63907313O346763J696169m188597j0477841j6182244k1473587k5774538k6748180
756.7F67105258k2972584j5667141p028758L145456J4416337K1197319K1269679J9816578
773G01282144J9307136J8154264J5402138J1271298Q187413Q682668J0910630J1487127
789.3H04684818J0257363Q287549N938470L901661K567172J341999K86698l8982j57356
807.7H37069392m71055m88997m98831j236200k344788l400266m677653n421042l906250
$$ plain form
826 814624310 814021111 815950990 818788469 821598768 823564470 824285865 823990166 822575152 819810569
844.4 819810569 816154420 812104642 807839632 804471374 803596079 805028200 807101488 808446825 808085859
862.8 808085859 805268884 799644530 790714562 778030097 762459517 746889532 736308753 735592067
879.1 735592067 744821727 758622646 771353781 780422270 784834146 783956349 778500795 771136999
895.4 771136999 765836358 766483188 773840189 784468055 794537485 802597761 808372021 811712027
911.7 811712027 812964320 812788785 811515570 809277833 806232154 802251279 797211707 792042971 788628101
930.1 788628101 787806928 788507998 789132297 788290858 785123348 780503988 777180016 777895927 782999575
948.4 782999575 790132284 796446085 800405324 801919401 801793039 800973117 799951732 798907042 798003316
$$ packed form
826H14624310o03199J929879K837479K810299J965702P21395k95699j415014k764583
844.4H19810569l656149m049778m265010l368258q75295J432121K073288J345337l60966
862.8H08085859k816975n624354q929968j2684465j5570580j5569985j0580779p16686
879.1G35592067R229660J3800919J2731135R068489M411876q77797n455554p363796
895.4G71136999n300641O46830P357001J0627866J0069430Q060276N774260L340006
911.7H11712027J252293j75535j273215k237737l045679l980875n039572n168736l414870
930.1G88628101q21173P01070O24299q41439l167510m619360l323972P15911N103648
948.4G82999575P132709O313801L959239J514077j26362q19922j021385j044690r03726
$$ plain form
966.8 798003316 797186017 796300113 795391262 794462860 793500006 792663634 791845083 790609479 788802564
985.1 788802564 786602139 784006476 780887485 777403653 773717105 769737661 765488923 761067212
1001.4 761067212 756147981 750310063 743514836 735854268 727808475 720948458 717175066 716967463
1017.8 716967463 718700886 719328940 716124773 708116293 696035087 682102680 669948518 662585616
1034.1 662585616 659707785 658916771 658916771 658887625 657127082 652944684 647304356 640857518 633744955 626961768
1054.5 626961768 621612370 617782176 615178108 613041341 609888434 604939342 598934889 592981756
1070.8 592981756 587636530 583121300 579625487 576983333 574543715 571861506 569108069 566607475
1087.1 566607475 564467371 562656939 560992122 559435964 558005929 556342959 553949654 551211059
$$ packed form
966.8G98003316q17299q85904r08851r28402r62854q36372q18551j235604j806915
985.1G88802564k200425k595663l118991l483832l686548l979444m248738m421711
1001.4G61067212m919231n837918o795227p660568q045793o860017l773392k07603
1017.8G16967463J733423O28054l204167q008480j2081206j3932407j2154162p362902
1034.1F62585616k877831p91014%k9146j760543m182398n640328o446838p112563o783187
1054.5F26961768n349398l830194k604068k136767l152907m949092o004453n953133
1070.8E92981756n345226m515230l495813k642154k439618k682209k753437k500594
1087.1E66607475k140104j810432j664817j556158j430035j662970k393305k738595
$$ plain form
1103.4 551211059 549680948 551900804 560138822 572298288 583061993 590264082 594660282 597966373
1119.8 597966373 606760263 625542939 646795988 663496137 677910089 692554295 706710339
1134 706710339 719380498 730462909 740055680 747966528 753739953 756875038 757525444 756889284 756536067
1152.4 756536067 757098675 758684695 762123764 768139362 776657224 787373304 799190760 810253918
1168.7 810253918 819193721 825604737 829789639 832406759 834032834 834823608 834807575 834063232 832519650
1187.1 832519650 829893887 825833321 820174575 813885748 809373617 808407962 810675681 814819336
1203.4 814819336 819313705 822640359 824002683 823552728 821815848 819388688 817024469 815221488
1219.7 815221488 813606381 811415315 808130920 803554058 798131406 792965174 788872421 785748720
$$ packed form
1103.4E51211059j530111K219856Q238018J2159466J0763705P202089M396200L306091
1119.8E97966373Q793890J8782676K1253049J6700149J4413952J4644206J4156044
1134G06710339J2670159J1082411R592771P910848N773425L135085O50406o36160l53217
1152.4G56536067N62608J586020L439069O015598Q517862J0716080J1817456J1063158
1168.7H10253918Q939803O411016M184902K617120J626075P90774j6033p44343j543582
1187.1H32519650k625763m060566n658746o288827m512131r65655K267719M143655
1203.4H14819336M494369L326654J362324m49955j736880k427160k364219j802981
1219.7H15221488j615107k191066l284395m576862n422652n166232m092753l123701
$$ plain form
1236 785748720 782793224 778852224 772637010 763400793 752083302 740928650 731340051 722873569
1252.3 722873569 714454174 705883920 697619557 688957572 677102506 659034848 635498047 612881839
1268.6 612881839 598521292 594319820 597203612 603225768 609082282 613153100 616378665 621115863
1285 621115863 629496813 642621934 660363317 681499541 704154849 726500928 747185290 765245616
1301.3 765245616 779828966 790274978 796430409 798972130 799566329 800170779 801860988 804332554
1317.6 804332554 806699395 808919847 811895907 816159606 821169734 825803101 829377651 831960320
1333.9 831960320 833944976 835619807 836878538 837502182 837618709 837456524 837012231 836170495 835079551
1352.3 835079551 833990932 832814157 831667840 830824792 829688430 827688158 825485766 823327422
$$ packed form
1236G85748720k955496l941000o215214r236217j1317491j1154652r588599q466482
1252.3G22873569q419395q570254q264363q661985j1855066j8067658k3536801k2616208
1268.6F12881839j4360547m201472K883792O022156N856514M070818L225565M737198
1285F21115863Q380950J3125121J7741383K1136224K2655308K2346079K0684362J8060326
1301.3G65245616J4583350J0446012O155431K541721N94199O04450J690209K471566
1317.6H04332554K366841K220452K976060M263699N010128M633367L574550K582669
1333.9H31960320J984656J674831J258731O23644J16527j62185m44293q41736j090944
1352.3H35079551j088619j176775j146317q43048j136362k000272k202392k158344
$$ plain form
1368.6 823327422 820917964 818335056 815485656 812518537 809772193 807432890 806380153 807525933
1384.9 807525933 809691429 810519397 810066998 809490561 808680713 807283282 805406511 803660929 802436352
1403.3 802436352 800701559 797865570 794217706 789262772 783049643 776820362 770367146 762477517
1419.6 762477517 755535960 750625014 745852470 740745783 735215783 729173064 723082900 714913070
1435.9 714913070 702721119 689531207 676934600 665168166 653953075 642117560 630817533
1450.2 630817533 622327209 618715107 623699486 639728844 661320031 685321808 706864238 714179456
1466.5 714179456 704027832 677733541 633184969 589663386 572095394 581257999 607746184
1480.8 607746184 640985787 673595190 703912497 732135713 757412434 778643727 797727942
$$ packed form
1368.6H23327422k409458k582908k849400k967119k746344k339303j052737J145780
1384.9H07525933K165496Q27968m52399n76437q09848j397431j876771j745582j224577
1403.3H02436352j734793k835989l647864m954934o213129o229281o453216p889629
1419.6G62477517o941557m910946m772544n106687n530000o042719o090164q169830
1435.9G14913070j2191951j3189912j2596607j1766434j1215091j1835515j1300027
1450.2F30817533q490324l612102M984379J6029358K1591187K4001777K1542430P315218
1466.5G14179456j0151624k6294291m4548572m3521583j7567992R162605K6488185
1480.8F07746184L3239603L2609403L0317307K8223216K5276721K1231293J9084215
$$ plain form
1495 797727942 814616024 825723469 832159877 837616205 843689680 847171962 846103251 844619513
1511.4 844619513 844172537 844085932 843663931 843199670 842404664 840873480 839504361 838276088 837557375
1529.7 837557375 837851465 837882638 837888896 839721918 841889024 840855420 838103592 835459113 833272696
1548.1 833272696 831007540 828116655 824880838 821667314 814215958 798414648 784027278 772274494
1564.4 772274494 762600720 758038819 759481072 766047120 777001023 788090527 791323662 787091434
1580.7 787091434 777653933 763127744 742527306 714232981 679693520 648406446 635014713
1595 635014713 646602094 674894989 704556108 723756790 728186727 719818711 705255389 694547474
1611.3 694547474 694200158 703488171 716623783 726321697 732747436 737292051 739907384 741704166
$$ packed form
1495G97727942J6888082J1107445O436408N456328O073475L482282j068711j483738
1511.4H44619513m46976q6605m22001m64261p95006j531184j369119j228273p18713
1529.7H37557375K94090L1173O258J833022K167106j033604k751828k644479k186417
1548.1H33272696k265156k890885l235817l213524p451356j5801310j4387370j1752784
1564.4G72274494r673774m561901J442253O566048J0953903J1089504L233135m232228
1580.7G87091434r437501j4526189k0600438k8294325l4539461l1287074j3391733
1595F35014713J1587381K8292895K9661119J9200682M429937q368016j4563322j0707915
1611.3F94547474l47316R288013J3135612R697914O425739M544615K615333J796782
$$ plain form
1627.6 741704166 743387103 746064365 750783861 755998015 758951783 761336207 765015602 770158589
1643.9 770158589 776439488 781861126 786361516 792393982 797456980 799091041 801360786 805528879
1660.3 805528879 810268819 814059496 817825377 822537541 826513767 829289079 832192481 834578514
1676.6 834578514 836602211 839872360 844014466 846026361 845695138 845931411 846772015 848295212 850762486
1694.9 850762486 853015184 854273796 853987038 853155136 852776945 852231264 851881981 852352738 853708148
1713.3 853708148 855572760 856049597 854353607 853053510 852906466 853058934 853559077 854880929 856703103
1731.7 856703103 857498705 856616378 856183112 856272459 856092811 856153786 856651545 857320011 857477725 856621087
1752 856621087 855814576 855756342 855967045 856092989 855772197 855309188 855415583 855975807 856679380 856419802
$$ packed form
1627.6G41704166J682937K677262M719496N214154K953768K384424L679395N142987
1643.9G70158589O280899N421638M500390O032466N062998J634061K269745M168093
1660.3H05528879M739940L790677L765881M712164L976226K775312K903402K386033
1676.6H34578514K023697L270149M142106K011895l31223K36273Q40604J523197K467274
1694.9H50762486K252698J258612k86758q31902l78191n45681l49283M70757J355410
1713.3H53708148J864612M76837j695990j300097j47044J52468N00143J321852J822174
1731.7H56703103P95602q82327m33266Q9347j79648O0975M97759O68466J57714q56638
1752H56621087q06511n8234K10703J25944l20792m63009J06395N60224P03573k59578
$$ plain form
1772.4 856419802 854819834 853601396 853377521 853300393 852948308 852643549 852523565 852932870 853788197
1790.8 853788197 853840947 852957308 852481067 852605522 852438688 851709723 851187885 851204276 851322055 851112247
1811.2 851112247 850670159 850298524 850010812 849851847 849956453 850196183 850336909 850512624 850378811 849501073
1831.6 849501073 848736286 848437607 848140121 848074913 848578393 848730087 847817600 846776009 846055925 845521331
1852 845521331 845199704 844997168 844750822 844507217 844383180 844495654 844935894 845131576 844408870 843416274
1872.4 843416274 842905760 842709124 842462838 842173159 841982722 841819048 841722846 841677547 841366172 840919793
1892.8 840919793 840594530 840269387 839919388 839669764 839563012 839534581 839504361 839409173 839179695 838956535
1913.2 838956535 839040995 839214861 838991761 838560522 838144064 837688506 837290466 837002993 836811244 836631119
$$ packed form
1772.4H56419802j599968j218438k23875p7128l52085l04759j19984M09305Q55327
1790.8H53788197N2750q83639m76241J24455j66834p28965n21838J6391J17779k09808
1811.2H51112247m42088l71635k87712j58965J04606K39730J40726J75715j33813q77738
1831.6H49501073p64787k98679k97486o5208N03480J51694r12487j041591p20084n34594
1852H45521331l21627k02536k46346k43605j24037J12474M40240J95682p22706r92596
1872.4H43416274n10514j96636k46286k89679j90437j63674r6202m5299l11375m46379
1892.8H40919793l25263l25143l49999k49624j06752k8431l0220r5188k29478k23160
1913.2H38956535Q4460J73866k23100m31239m16458m55558l98040k87473j91749j80125
$$ plain form
1933.6 836631119 836403489 836259186 836319745 836364925 836105704 835693240 835341573 835087478 834948778 834859073
1954 834859073 834715843 834535956 834372640 834221184 834112108 833974659 833637178 833174884 832773685 832434356
1974.4 832434356 832093656 831754506 831425250 831083119 830768645 830553114 830419242 830250025 829883814 829388261
1994.8 829388261 828988373 828730583 828535855 828342378 828149199 827979922 827826798 827699602 827641129 827635825
2015.2 827635825 827541173 827244103 826818228 826268077 825812757 826023281 826714396 827200353 827399015 827505946
2035.6 827505946 827597737 827677429 827721596 827723145 827676892 827606738 827591836 827665627 827754080 827816904 827892125 827980995
2060 827980995 828058004 828117788 828136027 828106582 828045726 827986896 827972174 827969253 827939332 827900887 827864468 827824056
2084.5 827824056 827787578 827744126 827678740 827617884 827569366 827503622 827446997 827420115 827343047 827193081 827056050
$$ packed form
1933.6H36631119k27630j44303O0559M5180k59221m12464l51667k54095j38700q9705
1954H34859073j43230j79887j63316j51456j09076j37449l37481m62294m01199l39329
1974.4H32434356l40700l39150l29256l42131l14474k15531j33872j69217l66211m95553
1994.8H29388261l99888k57790j94728j93477j93179j69277j53124j27196n8473n304
2015.2H27635825r4652k97070m25875n50151m55320K10524O91115M85957J98662J06931
2035.6H27505946R1791P9692M4167J549m6253p0154j4902P3791Q8453O2824P5221Q8870
2060H27980995P7009N9784J8239k9445o0856n8830j4722k921k9921l8445l6419m0412
2084.5H27824056l6478m3452o5386o0856m8518o5744n6625k6882p7068j49966j37031
$$ plain form
2106.9 827056050 826938808 826794088 826659381 826559484 826437712 826288462 826162040 826031566 825854838 825685620
2127.3 825685620 825549722 825379968 825177372 825010478 824853539 824672639 824517787 824392557 824242592 824086189
2147.7 824086189 823976398 823877394 823751152 823639095 823555231 823477745 823423862 823397934 823362768 823337138 823424637
2170.2 823424637 823624611 823811293 823943377 824029744 824067295 824067295 824038923 823976994 823888540 823791265 823673069
2192.6 823673069 823536754 823412299 823294878 823154747 823007941 822883487 822756112 822607398 822481275 822384059
2213 822384059 822283745 822201312 822125137 822000325 821844816 821710646 821599424 821499586 821417332 821335256 821228743
2235.4 821228743 821141064 821107507 821046174 820915878 820781410 820636094 820426702 820195258 819995821 819785714
2255.8 819785714 819549978 819354296 819200575 819060028 818963468 818887293 818783998 818687439 818615019 818555176
$$ packed form
2106.9H27056050j17242j44720j34707r9897j21772j49250j26422j30474j76728j69218
2127.3H25685620j35898j69754k02596j66894j56939j80900j54852j25230j49965j56403
2147.7H24086189j09791r9004j26242j12057q3864p7486n3883k5928l5166k5630Q7499
2170.2H23424637J99974J86682J32084Q6367L7551%k8372o1929q8454r7275j18196
2192.6H23673069j36315j24455j17421j40131j46806j24454j27375j48714j26123r7216
2213H22384059j00314q2433p6175j24812j55509j34170j11222r9838q2254q2076j06513
2235.4H21228743q7679l3557o1333j30296j34468j45316k09392k31444j99437k10107
2255.8H19785714k35736j95682j53721j40547r6560p6175j03295r6559p2420n9843
$$ plain form
2276.2 818555176 818516731 818489492 818431556 818315983 818176866 818046331 817865014 817613125 817358434 817093551
2296.6 817093551 816779315 816442490 816096485 815718472 815320313 814918995 814485908 814066172 813749969 813432217
2317 813432217 812977254 812459588 811989009 811614215 811297119 810931563 810554683 810285866 810037136 809665680
2337.4 809665680 809263706 809014380 808962882 809335768 810223162 810828626 810419619 809294939 808315873 807673454
2357.8 807673454 807214797 807016551 807110786 807396233 807803512 808290720 808789015 809294283 809889436 810555875
2378.2 810555875 811182082 811688066 812045157 812235951 812287092 812278092 812226117 812114418 811996102 811912537
2398.6 811912537 811816990 811699986 811579883 811437845 811288178 811146677 810978293 810753524 810515046 810299754
2419 810299754 810071647 809827507 809608817 809410512 809194624 808962584 808755636 808577776 808400869 808226347
$$ packed form
2276.2H18555176l8445k7239n7936j15573j39117j30535j81317k51889k54691k64883
2296.6H17093551l14236l36825l46005l78013l98159m01318m33087m19736l16203l17752
2317H13432217m54963n17666m70579l74794l17096l65556l76880k68817k48730l71456
2337.4H09665680m01974k49326n1498L72886Q87394O05464m09007j124680r79066o42419
2357.8H07673454m58657j98246R4235K85447M07279M87208M98295N05268N95153O66439
2378.2H10555875O26207N05984L57091J90794N1141r000n1975j11699j18316q3565
2398.6H11912537r5547j17004j20103j42038j49667j41501j68384k24769k38478k15292
2419H10299754k28107k44140k18690j98305k15888k32040k06948j77860j76907j74522
$$ plain form
2439.4 808226347 808060646 807916880 807801843 807688534 807579398 807492256 807393432 807253420 807098508 806927264
2459.8 806927264 806697011 806434512 806186199 805942118 805713892 805553138 805484056 805466354 805448711 805401325
2480.2 805401325 805294514 805141687 804975390 804775417 804528832 804265261 804009020 803778052 803586006 803409338
2500.6 803409338 803210378 802990198 802788854 802621365 802451193 802262545 802088857 801941514 801772892 801570117
2521 801570117 801400542 801264167 801097631 800922275 800764978 800584435 800391853 800212145 799997032 799742341
2541.4 799742341 799503148 799286127 799066722 798850417 798646927 798442483 798251450 798139513 798108935 798082173
2561.8 798082173 798055410 798050761 798006296 797892094 797752261 797575414 797331750 797083139 796850443 796592116
2582.2 796592116 796362460 796218872 796135485 796098173 796083450 796045840 796001196 795994401 795996249 795975029 795970500 795970440
$$ packed form
2439.4H08226347j65701j43766j15037j13309j09136q7142r8824j40012j54912j71244
2459.8H06927264k30253k62499k48313k44081k28226j60754o9082j7702j7643m7386
2480.2H05401325j06811j52827j66297j99973k46585k63571k56241k30968j92046j76668
2500.6H03409338j98960k20180k01344j67489j70172j88648j73688j47343j68622k02775
2521H01570117j69575j36375j66536j75356j57297j80543j92582j79708k15113k54691
2541.4G99742341k39193k17021k19405k16305k03490k04444j91033j11937l0578k6762
2561.8G98082173k6763m649m4465j14202j39833j76847k43664k48611k32696k58327
2582.2G96592116k29656j43588q3387l7312j4723l7610m4644o795J848k1220m529o0
$$ plain form
2606.6 795970440 795912087 795818985 795751691 795681477 795552194 795391560 795211434 794980168 794732630 794514537
2627 794514537 794314146 794134915 793997705 793864787 793689489 793495119 793306649 793091416 792856812 792641342
2647.4 792641342 792399585 792115331 791855037 791610599 791348338 791105866 790883005 790622354 790327430 790054977
2667.8 790054977 789806366 789555371 789313972 789075971 788819551 788549900 788267553 787951827 787612617 787296593
2688.2 787296593 786990643 786638975 786256790 785897791 785568714 785257161 784951806 784615099 784265697 783975184
2708.6 783975184 783704638 783382416 783062041 782780528 782515347 782296002 782128096 781942844 781683624 781380236
2729 781380236 781078637 780786455 780535638 780293584 779976666 779634118 779356301 779159606 779010475 778859317
2749.4 778859317 778701901 778553426 778427303 778312087 778168857 778023779 777913213 777803540 777680397 777567863
$$ packed form
2606.6G95970440n8353r3102o7294p0214j29283j60634j80126k31266k47538k18093
2627G94514537k00391j79231j37210j32918j75298j94370j88470k15233k34604k15470
2647.4G92641342k41757k84254k60294k44438k62261k42472k22861k60651k94924k72453
2667.8G90054977k48611k50995k41399k38001k56420k69651k82347l15726l39210l16024
2688.2G87296593l05950l51668l82185l58999l29077l11553l05355l36707l49402k90513
2708.6G83975184k70546l22222l20375k81513k65181k19345j67906j85252k59220l03388
2729G81380236l01599k92182k50817k42054l16918l42548k77817j96695j49131j51158
2749.4G78859317j57416j48475j26123j15216j43230j45078j10566j09673j23143j12534
$$ plain form
2769.8 777567863 777469635 777361572 777185798 776933074 776656926 776378512 776077926 775750101 775422513 775068343
2790.2 775068343 774640620 774186015 773773730 773349464 772800148 772180498 771621048 771129668 770699143 770318925
2810.6 770318925 769950390 769643426 769449651 769318163 769167423 768954098 768674374 768323064 767906547 767469466
2831 767469466 767048120 766632378 766184568 765581548 764705479 763666034 762609661 761487365 760247469
2849.3 760247469 759010136 757898271 756900072 756004453 755202532 754441857 753748178 753173590 752692997
2867.7 752692997 752319098 752120256 752031684 751908720 751751900 751615644 751490355 751350701 751156807 750879943
2888.1 750879943 750532866 750153363 749763429 749298453 748688459 748010397 747323632 746548593 745664358 744746864
2908.5 744746864 743804634 742764652 741582751 740262628 738847613 737427235 736105859 734942615
$$ packed form
2769.8G77567863r8228j08063j75774k52724k76148k78414l00586l27825l27588l54170
2790.2G75068343m27723m54605m12285m24266n49316o19650n59450m91380m30525l80218
2810.6G70318925l68535l06964j93775j31488j50740k13325k79724l51310m16517m37081
2831G67469466m21346m15742m47810o03020q76069j039445j056373j122296j239896
2849.3G60247469j237333j111865r98199q95619q01921p60675o93679n74588m80593
2867.7G52692997l73899j98842q8572j22964j56820j36256j25289j39654j93894k76864
2888.1G50879943l47077l79503l89934m64976o09994o78062o86765p75039q84235r17494
2908.5G44746864r42230j039982j181901j320123j415015j420378j321376j163244
$$ plain form
2924.8 734942615 734003603 733392894 733167529 733383954 734082818 735164881 736450613 737817228 739170611
2943.2 739170611 740402222 741468608 742405057 743243754 743976951 744576395 745027363 745349646 745556831
2961.5 745556831 745663166 745671391 745548368 745323122 745087862 744853854 744613409 744454145 744291604 743842542
2981.9 743842542 743058622 742135108 741184354 740273833 739399731 738417625 737355888 736306429 735260785
3000.3 735260785 734282851 733434558 732796788 732478559 732401371 732261002 731769800 730868399 729662776 728237331
3020.7 728237331 726620734 724876165 723212898 721928656 721128523 720696270 720362008 719966471 719729960
3039 719729960 719668269 719369471 718647778 717689991 716667533 715507507 714164674 712799072 711502492
3057.4 711502492 710432947 709877610 709867358 710187197 710583687 710890889 711146653 711491227 711996019 712528408
$$ packed form
2924.8G34942615r39012o10709k25365K16425O98864J082063J285732J366615J353383
2943.2G39170611J231611J066386R36449Q38697P33197N99444M50968L22283K07185
2961.5G45556831J06335Q225j23023k25246k35260k34008k40445j59264j62541m49062
2981.9G43842542p83920r23514r50754r10521q74102r82106j061737j049459j045644
3000.3G35260785r77934q48293o37770l18229p7188j40369m91202r01401j205623j425445
3020.7G28237331j616597j744569j663267j284242q00133m32253l34262l95537k36511
3039G19729960o1691k98798p21693r57787j022458j160026j342833j365602j296580
3057.4G11502492j069545n55337j0252L19839L96490L07202K55764L44574N04792N32389
$$ plain form
3077.8 712528408 712869883 713097632 713382483 713682055 714049518 714494646 714753270 714785874 714805782 714793026
3098.2 714793026 714502037 713841617 712986708 712124705 711255670 710314631 709582388 709389925 709513605 709562242
3118.6 709562242 709376097 709019423 708677292 708412707 708153188 707780421 707223296 706594110 706076086 705592513
3139 705592513 704936087 704181552 703493834 702887297 702421069 702059329 701488435 700628757 699781358 699050248
3159.4 699050248 698339999 697670460 697065711 696439445 695752680 695064187 694381654 693677664 692945719 692187250
3179.8 692187250 691403568 690590084 689756930 688922524 688073456 687155247 686114132 684951305 683706284
3198.1 683706284 682401478 681058705 679722726 678400636 677041709 675625980 674167991 672662437
3214.4 672662437 671125054 669561744 667938650 666281581 664649248 663036764 661424577 659877717
$$ packed form
3077.8G12528408L41475K27749K84851K99572L67463M45128K58624L2604J9908j2756
3098.2G14793026k90989o60420q54909q62003q69035r41039p32243j92463J23680M8637
3118.6G09562242j86145l56674l42131k64585k59519l72767n57125o29186n18024m83573
3139G05592513o56426p54535o87718o06537m66228l61740n70894q59678q47399p31110
3159.4F99050248p10249o69539o04749o26266o86765o88493o82533p03990p31945p58469
3179.8F92187250p83682q13484q33154q34406q49068r18209j041115j162827j245021
3198.1F83706284j304806j342773j335979j322090j358927j415729j457989j505554
3214.4F72662437j537383j563310j623094j657069j632333j612484j612187j546860
$$ plain form
3230.7 659877717 658429742 656937778 655398488 654052198 653011262 652277529 651869714 651666164 651527047
3249.1 651527047 651579916 651992559 652670681 653450966 654350579 655402720 656544745 657755196 659084082
3267.5 659084082 660554886 662046731 663534760 665195346 667074025 669049740 670920551 672476292
3283.8 672476292 673659086 674526036 675114393 675340891 675128877 674542487 673660398 672665834 671813488
3302.1 671813488 671060681 670040131 668479681 666533947 664565563 662719369 660891116 659031928
3318.4 659031928 657197356 655413687 653572917 651467979 649131894 646809638 644594431 642490983
3334.8 642490983 640471697 638284028 635812700 633248568 630658269 628162861 625891507 623463631
3351.1 623463631 620613992 617720604 615066230 612520039 609916568 607330799 604950547 602664948
$$ packed form
3230.7F59877717j447975j491964j539290j346290j040936p33733m07815k03550j39117
3249.1F51527047N2869M12643O78122P80285Q99613J052141J142025J210451J328886
3267.5F59084082J470804J491845J488029J660586J878679J975715J870811J555741
3283.8F72476292J182794Q66950N88357K26498k12014n86390q82089r94564q52346
3302.1F71813488p52807j020550j560450j945734j968384j846194j828253j859188
3318.4F59031928j834572j783669j840770k104938k336085k322256k215207k103448
3334.8F42490983k019286k187669k471328k564132k590299k495408k271354k427876
3351.1F23463631k849639k893388k654374k546191k603471k585769k380252k285599
$$ plain form
3367.4 602664948 600119472 597211897 594350159 591900826 589710951 587559640 585433662 583386540
3383.7 583386540 581491411 579909980 578727722 577501357 575818598 574123085 572951436 572004497
3400 572004497 570617855 568842947 567316532 566191792 565191627 564158618 563048363 561956823 561066568
3418.4 561066568 560312748 559578717 559003174 558679521 558518112 558393776 558371842 558511972 558538258 558324695
3438.8 558324695 558205426 558465600 559033334 559628665 560089290 560585976 561264038 562071502 563032091 564152896
3459.2 564152896 565215111 566227615 567511559 568943441 569995642 570632458 571363330 572414279 573731244
3477.5 573731244 575109601 576184154 577095807 578232110 579447865 580540597 581677854 582968056
3493.8 582968056 584314048 585603178 586921275 588248193 589270294 590127110 591240108 592578173
$$ packed form
3367.4F02664948k545476k907575k861738k449333k189875k151311k125978k047122
3383.7E83386540j895129j581431j182258j226365j682759j695513j171649r46939
3400E72004497j386642j774908j526415j124740j000165j033009j110255j091540q90255
3418.4E61066568p53820p34031n75543l23653j61409j24336k1934J40130K6286k13563
3438.8E58324695j19269K60174N67734N95331M60625M96686O78062Q07464R60589J120805
3459.2E64152896J062215J012504J283944J431882J052201O36816P30872J050949J316965
3477.5E73731244J378357J074553R11653J136303J215755J092732J137257J290202
3493.8E82968056J345992J289130J318097J326918J022101Q56816J112998J338065
$$ plain form
3510.2 592578173 593987346 595355272 596573770 597784579 599238634 600939035 602490485 603708327
3526.5 603708327 604853332 606100202 607533932 609187245 610818923 612315297 614025354 616071880
3542.8 616071880 618003786 619416952 620640576 622106314 623670816 625255525 627068698 629120648
3559.1 629120648 631293595 633626163 636013389 638037205 639604628 641172051 643043280 645227730 647606134
3577.5 647606134 650107801 652847350 655963123 659063280 661427855 663405836 665816963 668554962
3593.8 668554962 671303153 674128532 676956713 679719687 682743073 686041415 689253211 692306101
3610.1 692306101 695359468 698466599 701629639 704583287 707081318 709602535 712839246 716528594
3626.4 716528594 719491065 721530676 723645568 725996852 728419363 730927467 733576417 736614704
$$ packed form
3510.2E92578173J409173J367926J218498J210809J454055J700401J551450J217842
3526.5F03708327J145005J246870J433730J653313J631678J496374J710057K046526
3542.8F16071880J931906J413166J223624J465738J564502J584709J813173K051950
3559.1F29120648K172947K332568K387226K023816J567423TJ871229K184450K378404
3577.5F47606134K501667K739549L115773L100157K364575J977981K411127K737999
3593.8F68554962K748191K825379K828181K762974L023386L298342L211796L052890
3610.1F92306101L053367L107131L163040K953648K498031K521217L236711L689348
3626.4G16528594K962471K039611K114892K351284K422511K508104K648950L038287
$$ plain form
3642.7 736614704 740281641 744070351 746608198 747617960 748691976 750228763 751733780 753194332
3659 753194332 754645944 756145298 758174598 760665417 762596309 763950825 765323997 765619755 764843822
3677.4 764843822 764521420 764828265 765812278 767472267 768914700 768887460 767889798 767333627 767413080 767796993
3697.8 767796993 768166721 768152356 768075049 768697500 769868433 770381153 769422412 768336415 768101513 768236220
3718.2 768236220 768411279 768539250 768373489 768013895 768226922 769183874 770168245 770224392 769208133 768671751
3738.6 768671751 769502521 770294428 769876540 769786298 770075381 769028246 767473459 767047048 767160356
3756.9 767160356 766807735 766285062 766246855 766445696 766493678 766065359 765253603 764775515 764950812 765370548
3777.3 765370548 765320063 764872313 764552653 764236212 763861001 763687313 763823390 764199674 764702559 765350223
$$ packed form
3642.7G36614704L666937L788710K537847J009762J074016J536787J505017J460552
3659G53194332J451612J499354K029300K490819J930892J354516J373172K95758p75933
3677.4G64843822l22402L06845R84013J659989J442433k7240r97662n56171P9453L83913
3697.8G67796993L69728j4365p7307O22451J170933N12720r58741j085997k34902J34707
3718.2G68236220J75059J27971j65761l59594K13027R56952R84371N6147j016259n36382
3738.6G68671751Q30770P91907m17888r0242K89083j047135j554787m26411J13308
3756.9G67160356l52621n22673l8207J98841M7982m28319q11756m78088J75297M19736
3777.3G65370548n0485m47750l19660l16441l75211j73688J36077L76284N02885O47664
$$ plain form
3797.7 765350223 765580654 764955640 764495254 764036655 762984276 762506425 763129532 763858914 764027834
3816.1 764027834 764312446 764161289 762953222 762114823 761922061 761947632 762208700 762714028 763362288 763432562
3836.5 763432562 762574852 761630297 760826528 760149121 760275841 761576295 763065636 762337565 759774625
3854.8 759774625 758828640 759218752 759751976 759830177 759621620 759741485 759603381 758882761 758214653 757860720
3875.2 757860720 758013606 758221805 758182883 758095503 757633984 757243812 757202625 756746352 756180227 756366849
3895.6 756366849 757069349 757517397 757185876 756083190 754913568 754311860 754156768 754303396 754670799
3914 754670799 754843831 754566908 754213214 754070818 753938794 753803313 753825426 753806591 753497183 753090560
3934.4 753090560 752905309 752976835 753064513 752954543 752826393 752804697 752694786 752484202 752337635 752260745
$$ packed form
3797.7G65350223K30431o25014m60386m58599j052379m77851O23107P29382J68920
3816.1G64027834K84612j51157j208067q38399j92762K5571K61068N05328O48260P0274
3836.5G63432562q57710r44555q03769o77407J26720J300454J489341p28071k562940
3854.8G59774625r45985L90112N33224P8201k08557J19865j38104p20620o68108l53933
3875.2G57860720J52886K08199l8922q7380m61519l90172m1187m56273n66125J86622
3895.6G56366849P02500M48048l31521j102686j169622o01708j55092J46628L67403
3914G54670799J73032k76923l53694j42396j32024j35481K2113j8835l09408m06623
3934.4G53090560j85251P1526Q7678j09970j28150k1696j09911k10584j46567p6890
$$ plain form
3954.8 752260745 752182245 752104104 752004385 751861036 751768887 751754105 751736879 751717150 751669526 751517594 751343191
3977.2 751343191 751282692 751295626 751247883 751132965 751032948 750941813 750820458 750712991 750658214 750604391
3997.6 750604391
$$ packed form
3954.8G52260745p8500p8141r9719j43349r2149j4782j7226j9729m7624j51932j74403
3977.2G51343191o0499J2934m7743j14918j00017r1135j21355j07467n4777n3823
3997.6G50604391
##END=$$ End of the data block
