##TITLE=G4 - AA Schiff - Filme sobre cela de ZnSe $$ Begin of the data block
##JCAMP-DX=5.00 $$ ACD/SpecManager v 10.08
##SPECTROMETER/DATA SYSTEM=Alpha
##DATE=09 Oct 2013 09:28:52
##DATA TYPE=INFRARED SPECTRUM
##DATA CLASS=XYDATA
##ORIGIN=
##OWNER=
##NPOINTS=3334
##FIRSTX=599.63525391
##LASTX=3998.58886719
##MAXX=3998.58886719
##MINX=599.63525391
##MAXY=1.10077190
##MINY=0.00922314
##XFACTOR=1.0000000000
##YFACTOR=0.000000010000000
##FIRSTY=0.55407077
##DELTAX=1.01978803
##XUNITS=1/CM
##YUNITS=ARBITRARY UNITS
##XYDATA=(X++(Y..Y))
599.6E5407077L3891K6739R805j7971j0145K4504M5794M8483M4626N6058P2759N2667
611.9E5794287k337l2669k5570l8642p7558r9510j01924r1833p3647o5023o6268o1762
624.1E5057544m8715l4166k569N4181J04636J12289Q8048O4147L8832J4245m428k4945
636.3E5419099k7382N305K8544K5136K9492L2681K3288L677k2572k8330j7297k1732
648.6E5449909l3397l8504m4561l9058p678L5310N1785M5860N4305P1580Q8310J03760
660.8E5737621J09595J00332P1526L4255l875Q8257N40441K94781j99086j11919K7775
672E6689703J12421J41126J25473J12600J05822Q5824R1875J17904J11765J02752J17987
683.3E7915252J19824J11365J08731J00970R6744Q6505P7706P7987P6145Q9711J07020
$$ plain form
599.6 55407077 55440968 55467707 55477512 55459541 55449396 55473900 55519694 55568177 55612803 55668861 55741620 55794287
611.9 55794287 55791950 55759281 55733711 55695069 55617511 55518001 55416077 55324244 55250597 55185574 55119306 55057544
624.1 55057544 55008829 54974663 54972094 55026275 55130911 55243200 55331248 55395395 55434227 55448472 55444044 55419099
636.3 55419099 55391717 55397022 55425566 55450702 55480194 55512875 55536163 55539840 55517268 55488938 55471641 55449909
648.6 55449909 55416512 55378008 55333447 55294389 55286711 55322021 55373806 55419666 55473971 55545551 55633861 55737621
660.8 55737621 55847216 55947548 56019074 56053329 56049454 56137711 56678152 56972933 56773847 56661928 56689703
672 56689703 56802124 56943250 57068723 57181323 57287145 57372969 57464844 57582748 57694513 57797265 57915252
683.3 57915252 58035076 58146441 58255172 58356142 58452886 58539391 58617097 58695084 58771229 58860940 58967960
694.5E8967960J13791J39278J77682J96689K00510J88393J81084K00266K14434K17282
704.7F0797369K13898J89048J64032J67972J73360J51068J19286R2531O3884L9566
714.9F2172014K3388M018j2636j6815n1063j41138k18093k73413l67993n22906p32910
726.1E9862453r91297j318526j730269k192683k636194k970311l109050k999132k642045
735.3C9272946k077567j382211o67057p432N54496R67994J184830J183036R53141M94686
745.5D0476862j48392q80584j566461k069455k313310k305129k098021j762596j382676
754.6B5950238j005515o35508k88302K0750K91333N38547P68989R62276J127129J272044
764.8B9001981J383907J477268J555821J591936J574618J507285J379880J212534J053536
$$ plain form
694.5 58967960 59081751 59221029 59398711 59595400 59795910 59984303 60165387 60365653 60580087 60797369
704.7 60797369 61011267 61200315 61364347 61532319 61705679 61856747 61976033 62068564 62132448 62172014
714.9 62172014 62195402 62199420 62186784 62169969 62118906 61977768 61759675 61486262 61118269 60595363 59862453
726.1 59862453 58871156 57552630 55822361 53629678 50993484 48023173 44914123 41914991 39272946
735.3 39272946 37195379 35813168 35146111 35138679 35693175 36661169 37845999 39029035 39982176 40476862
745.5 40476862 40328470 39447886 37881425 35811970 33498660 31193531 29095510 27332914 25950238
754.6 25950238 24944723 24309215 24020913 24041663 24332996 24871543 25640532 26602808 27729937 29001981
764.8 29001981 30385888 31863156 33418977 35010913 36585531 38092816 39472696 40685230 41738766
774D1738766Q90565P17980O02752N71609O22943P74768R94205J215568J397845J513303
784.2E1040304J554984J536303J460135J339162J198888J056420R17656P88044O80519
793.4F1572415N89859N07409M33754L77340L50916L32493K99263K70855K65920K72364
803.6F5272588K76076K76238K71463K62863K62338K74551K67118K26653J96939J96231
813.8F7783058J95211J72633J32495R1714O0546K1321k6954n2005m3374k6536k6745
825F8281364k8246k4277l4225m5961m5252m3887m5520o1500r9331j30511j44571j66505
837.2F7411578k15352k84666l56304m32247n21213o08629o78533p27410p44920p23345
847.4F2118959o77907o07532m99261l77577k52170j23536j8686O3610J35690J86145
$$ plain form
774 41738766 42629331 43347311 43950063 44521672 45144615 45919383 46913588 48129156 49527001 51040304
784.2 51040304 52595288 54131591 55591726 56930888 58129776 59186196 60103852 60891896 61572415
793.4 61572415 62162274 62669683 63103437 63480777 63831693 64164186 64463449 64734304 65000224 65272588
803.6 65272588 65548664 65824902 66096365 66359228 66621566 66896117 67163235 67389888 67586827 67783058
813.8 67783058 67978269 68150902 68283397 68375111 68435657 68456978 68430024 68378019 68334645 68308109 68281364
825 68281364 68253118 68228841 68194616 68148655 68103403 68059516 68013996 67952496 67853165 67722654 67578083 67411578
837.2 67411578 67196226 66911560 66555256 66123009 65601796 64993167 64314634 63587224 62842304 62118959
847.4 62118959 61441052 60833520 60334259 59956682 59704512 59580976 59562290 59625900 59761590 59947735
857.6E9947735K16782K30432K31999K46084K66856K85124L16024L54225L81374M05461
867.8F2882096M29058M22489L96157L77112L46077K93320K30962J67346J18357P5591
878F5738565K6196k325P81L368q530j8280l4321p1805j24139j83010k49785l36945
890.3F4739770m32211n02921n39159n62597o12592p15781q89635j103687j241946j214522
900.5E6924719j014883o66755k18129K42060O26445Q93050J029915J042730R59682
909.6E9818834Q22634O56819M85033L49265K71195K47735K73931L36331M23283N32972
919.8F4218032O45990P45755Q42196R23454R62466R64505R47237R13125Q67361Q19004
930G2849125P54761O73741O00255N38772M79335M20147L76171L50964L32302L18813
$$ plain form
857.6 59947735 60164517 60394949 60626948 60873032 61139888 61425012 61741036 62095261 62476635 62882096
867.8 62882096 63311154 63733643 64129800 64506912 64852989 65146309 65377271 65544617 65662974 65738565
878 65738565 65764761 65762436 65763217 65766585 65758055 65739775 65705454 65633649 65509510 65326500 65076715 64739770
890.3 64739770 64307559 63804638 63265479 62702882 62090290 61374509 60484874 59381187 58139241 56924719
900.5 56924719 55909836 55243081 55024952 55267012 55893457 56786507 57816422 58859152 59818834
909.6 59818834 60641468 61298287 61783320 62132585 62403780 62651515 62925446 63261777 63685060 64218032
919.8 64218032 64864022 65609777 66451973 67375427 68337893 69302398 70249635 71162760 72030121 72849125
930 72849125 73603886 74277627 74877882 75416654 75895989 76316136 76692307 77043271 77375573 77694386
940.2G7694386L09897L07005L10088L26407L53562L66229L74568L88080L86971L69173
950.4H1186366L38477L02875K60592K13074J77610J45400J11592Q5568O2513M4078
960.6H2928145K4837j1265n8985j19972j93757k57027l08043l56501l92950m00549
970.8H0853933l85672l71873l44765k90376k30539j72550j14292n5998L6N0312Q9699
982.1G9027915J10692J21158J26773J25295J15872R4175O4284L5440P153k1338n5319
993.3G9752100j01358j48422j83010k08980k37542k69300k99030l30597l78293m35078
1003.5G7160490m88615n43392o00195o69593p49171q26138r12374j015395j125294
1012.6G0230323j223487j290321j307225j247674j096988q64291n72080k53010N3233
$$ plain form
940.2 77694386 78004283 78311288 78621376 78947783 79301345 79667574 80042142 80430222 80817193 81186366
950.4 81186366 81524843 81827718 82088310 82301384 82478994 82624394 82735986 82821554 82884067 82928145
960.6 82928145 82952982 82941717 82882732 82762760 82569003 82311976 82003933 81647432 81254482 80853933
970.8 80853933 80468261 80096388 79751623 79461247 79230708 79058158 78943866 78887868 78887904 78938216 79027915
982.1 79027915 79138607 79259765 79386538 79511833 79627705 79721880 79786164 79821604 79828757 79807419 79752100
993.3 79752100 79650742 79502320 79319310 79110330 78872788 78603488 78304458 77973861 77595568 77160490
1003.5 77160490 76671875 76128483 75528288 74858695 74109524 73283386 72371012 71355617 70230323
1012.6 70230323 69006836 67716515 66409290 65161616 64064628 63200337 62628257 62375247 62428480
1021.8F2428480L08162M67319N01448M36598L12185J56319J9056l3564K1833J30505
1032F4748341J98722J69325O3431o3253j56319j87677j71041j27352p2384j6659L4058
1043.2F4419192P5460J08677J37639J68472K17623K88868L56394M10366M64344N05984
1053.4F7153019N18566N18799N16736N04798M94033N03278N34755N72002N94884O00243
1063.6G2511113N83106N27763M24064K74956R9826o6299k04020l16829l82721l94088
1073.8G3056871l79342l40086k71255j97512j39207r3192n2958k7824k9313n3215r0838
1085G1382129j36727j84351k34503l02565l83746m52018n10538n81008o58911p34294
1095.2F7203468q13264r00614r92012j069075j113504j122731j107156j059121r61423
$$ plain form
1021.8 62428480 62736642 63203961 63705409 64142007 64454192 64610511 64629567 64596003 64617836 64748341
1032 64748341 64947063 65116388 65179819 65116566 64960247 64772570 64601529 64474177 64401793 64385134 64419192
1043.2 64419192 64494652 64603329 64740968 64909440 65127063 65415931 65772325 66182691 66647035 67153019
1053.4 67153019 67671585 68190384 68707120 69211918 69705951 70209229 70743984 71315986 71910870 72511113
1063.6 72511113 73094219 73621982 74046046 74321002 74420828 74354529 74150509 73833680 73450959 73056871
1073.8 73056871 72677529 72337443 72066188 71868676 71729469 71636277 71583319 71555495 71526182 71472967 71382129
1085 71382129 71245402 71061051 70826548 70523983 70140237 69688219 69177681 68596673 67937762 67203468
1095.2 67203468 66390204 65489590 64497578 63428503 62314999 61192268 60085112 59025991 58064568
1104.4E8064568q24392o72322n24611l88938k66266j66517r6613m0579R531M7141P4083
1115.6E5215085R4109R7406O5965j020p5125j19090j12701n7596L0685J36476K18237
1126.9E5492431K41595K27076J92452J38122R0235P0804N7811L7044J8472J0204L755
1138.1E6580001j4871m3649r8240k10613m04298p01851j093823j499373j796865j879749
1148.3D8836669j690900j249269o52429j0461O16747J199636J705006K116171K434378
1157.5E3305548K645702K726549K667164K479667K192956J854116J500141J157916
1165.6G0529759Q60917O18357M20892K66576J55652O6483j3608q0258j43450k14380
1175.8G2466940k87676l64447m49967n34624o21927p18617q16405r10717j015669j145578
$$ plain form
1104.4 58064568 57240176 56567854 56043243 55654305 55388039 55221522 55124909 55084330 55093861 55141002 55215085
1115.6 55215085 55309194 55406600 55472565 55471545 55396420 55277330 55164629 55107033 55137718 55274194 55492431
1126.9 55492431 55734026 55961102 56153554 56291676 56381911 56452715 56510526 56547570 56566042 56576246 56580001
1138.1 56580001 56565130 56521481 56423241 56212628 55808330 55106479 54012656 52513283 50716418 48836669
1148.3 48836669 47145769 45896500 45244071 45233610 45850357 47049993 48754999 50871170 53305548
1157.5 53305548 55951250 58677799 61344963 63824630 66017586 67871702 69371843 70529759
1165.6 70529759 71390676 72009033 72429925 72696501 72852153 72918636 72905028 72824770 72681320 72466940
1175.8 72466940 72179264 71814817 71364850 70830226 70208299 69489682 68673277 67762560 66746891 65601313
1186F5601313j295364j451492j607508j748633j838410j847714j774180j611406j356387
1195.2E1070219j048553p23877m04117j23763R7343K62017L62533L80322L26276K28256
1205.4E0426656J01548l9410j82080l22271m55889n81303o93867p87166q58715r04557
1215.6D5702946r16260q85523q12447p02721n69042m22234k65333j05190M6581J85570
1225.8D1256347L09548M15152N08741N90703O48829O85027P18004P52422P76237P88555
1236D7449565Q02720Q21507Q34983Q37624Q26860P93290P39395O75881N96887M99577
1246.2E4878289L84801K57129J18655k9445j83237l47721n26363p12109r00870j081813
1256.4E1857316j226991j319778j337093j261824j101554q81359o34709m00594k18340
$$ plain form
1186 65601313 64305949 62854457 61246949 59498316 57659906 55812192 54038012 52426606 51070219
1195.2 51070219 50021666 49297789 48893672 48769909 48867252 49129269 49491802 49872124 50198400 50426656
1205.4 50426656 50528204 50488794 50306714 49984443 49528554 48947251 48253384 47466218 46607503 45702946
1215.6 45702946 44786686 43901163 43088716 42385995 41816953 41394719 41129386 41024196 41070777 41256347
1225.8 41256347 41565895 41981047 42489788 43080491 43729320 44414347 45132351 45884773 46661010 47449565
1236 47449565 48252285 49073792 49908775 50746399 51573259 52366549 53105944 53781825 54378712 54878289
1246.2 54878289 55263090 55520219 55638874 55609429 55426192 55078471 54552108 53839999 52939129 51857316
1256.4 51857316 50630325 49310547 47973454 46711630 45610076 44728717 44094008 43693414 43475074
1265.5D3475074j10606q0722j22398k31404l87245n56743p12362q27676q71480q20952
1275.7C8753486o76993m46448j39930K04861N42477Q34980J048911J174140J212176
1284.9D2507660J173288J080626R50098P91917O33165M83969L26842J66079N177j60894
1295.1D7957927l30010m91554o33964p44682q23295q72049q80641q47998p80803o87525
1305.3D0865406n72818m45587l15088j95145r0331M575Q4751J42813J86503K47714
1315.5C9912793L42241M51484N59363O52719P14302P59250P90512Q00291P83115P43762
1325.7D6509832P01371O49327N89582N22530M48090L56528K54259J45733L2026p3695
1335.9E0135583j81941l03217m33067n75709p33620q54245r42936j037178j151225
$$ plain form
1265.5 43475074 43364468 43283746 43161348 42929944 42542699 41985956 41273594 40445918 39574438 38753486
1275.7 38753486 38076493 37630045 37490115 37694976 38237453 39072433 40121344 41295484 42507660
1284.9 42507660 43680948 44761574 45711672 46503589 47136754 47620723 47947565 48113644 48118821 47957927
1295.1 47957927 47627917 47136363 46502399 45757717 44934422 44062373 43181732 42333734 41552931 40865406
1305.3 40865406 40292588 39847001 39531913 39336768 39246437 39251012 39335763 39478576 39665079 39912793
1315.5 39912793 40255034 40706518 41265881 41918600 42632902 43392152 44182664 44982955 45766070 46509832
1325.7 46509832 47211203 47860530 48450112 48972642 49420732 49777260 50031519 50177252 50209278 50135583
1335.9 50135583 49953642 49650425 49217358 48641649 47908029 47053784 46110848 45073670 43922445
1345.1D3922445j270684j379270j478383j567980j641980j671505j656559j600611
1353.2C1655473j506353j369446j184968r49344o76635l98507j14933J38280L36125
1362.4B5929692M62562M60252M58640N27361N97990O61844O72692O21352N27483L93054
1372.6C1312922K25365o3586m14807o63212q20252r32956r75990r43873q62202p44113
1382.8B5117296o02783m59811l13801j47061m9393o2233l3787K2510J9969M738M4349
1394B3539993K3917j22436k21309k29911k38860l29012m06609m25326m32761m33752
1404.2B0723934m48697m87116m88150m46447m02750l55386k92688k03789r3416M2635
1414.4A7548130J98099L72065N34243Q73873J423732J410126J303245J647668K101299
$$ plain form
1345.1 43922445 42651761 41272491 39794108 38226128 36584148 34912643 33256084 31655473
1353.2 31655473 30149120 28779674 27594706 26645362 25968727 25570220 25455287 25593567 25929692
1362.4 25929692 26392254 26852506 27311146 27838507 28436497 29098341 29771033 30392385 30919868 31312922
1372.6 31312922 31538287 31474701 31059894 30396682 29576430 28643474 27667484 26723611 25861409 25117296
1382.8 25117296 24514513 24054702 23740901 23593840 23544447 23482214 23448427 23470937 23490906 23495644 23539993
1394 23539993 23563910 23441474 23220165 22990254 22751394 22422382 22015773 21590447 21157686 20723934
1404.2 20723934 20275237 19788121 19299971 18853524 18450774 18095388 17802700 17598911 17505495 17548130
1414.4 17548130 17746229 18118294 18652537 19526410 20950142 22360268 23663513 25311181 27412480
1423.6B7412480K287886K195969K164259K126903K024621J954466J672732J238809
1431.8D3078125R75403P21609M19656K91490Q9565m50563p90233r58150j190770j431903
1442D0754229j656464j838976j961258j995105k008581k103212k045384j860872j738958
1451.1B3545419j625789j413798j119314p98671l68528P7781K21668K67196L32504
1460.3A9118468L55761L30708K92681M31193N76261N00221N34404O20717N34023L66148
1470.5B3660585K89044J81796j40624m01466m43069m70074n53036n71666n42861n19213
1480.7B0489416n12116n00985m69821m19693l33940j99627q1605M7174L18994N22261
1490.9A8860058N04959N51447O49494P76017J097031J115462R15909J045683R85178
$$ plain form
1423.6 27412480 29700366 31896335 34060594 36187497 38212118 40166584 41839316 43078125
1431.8 43078125 44053528 44775137 45194793 45486283 45575848 45125285 44335052 43376902 42186132 40754229
1442 40754229 39097765 37258789 35297531 33302426 31293845 29190633 27145249 25284377 23545419
1451.1 23545419 21919630 20505832 19386518 18587847 18219319 18297100 18518768 18785964 19118468
1460.3 19118468 19474229 19804937 20097618 20528811 21105072 21605293 22139697 22760414 23294437 23660585
1470.5 23660585 23949629 24131425 23990801 23589335 23146266 22676192 22123156 21551490 21008629 20489416
1480.7 20489416 19977300 19476315 19006494 18586801 18252861 18053234 17971629 18018803 18337797 18860058
1490.9 18860058 19365017 19916464 20565958 21341975 22439006 23554468 24470377 25516060 26501238
1500.1B6501238Q64789Q94252P74783O12220O95738R32229N75050q5759l69444m96421
1510.3C0898675o13999p78708r64090j065683j118282j201653j379541j398815j236810
1519.5B1141094j193765j257579j165762r47541o91793m32114j86993J18597M74149
1528.7A5858293P55871J044313J392740J908449K559509K397839J875780J654124J535201
1537.8C0982119J821902J876512R12905M42025K02754n0857j23510k67199m47434m83680
1548C4865537m75949n47853o85447p51493p08750p21529q48296q60229p43228p16389
1558.2B7806374r17786j171616j179433j057881j000350r90758j033051j041083r96727
1567.4A8417689r43704r61029j010764r58887r02868q63757q05880p47545p58154p27641
$$ plain form
1500.1 26501238 27366027 28260279 29035062 29647282 30343020 31275249 31850299 31764540 31395096 30898675
1510.3 30898675 30284676 29505968 28541878 27476195 26357913 25156260 23776719 22377904 21141094
1519.5 21141094 19947329 18689750 17523988 16576447 15884654 15452540 15265547 15384144 15858293
1528.7 15858293 16614164 17658477 19051217 20959666 23519175 25917014 27792794 29446918 30982119
1537.8 30982119 32804021 34680533 35593438 36035463 36238217 36187360 36063850 35796651 35349217 34865537
1548 34865537 34389588 33841735 33156288 32404795 31696045 30974516 30126220 29265991 28522763 27806374
1558.2 27806374 26888588 25716972 24537539 23479658 22479308 21488550 20455499 19414416 18417689
1567.4 18417689 17473985 16512956 15502192 14543305 13640437 12776680 11970800 11223255 10465101 9737460
1577.6I737460o64828o19751n72736n18674m60646m09609l61691l25252k96148k74712
1587.8E233413k36734k06655j90506j77605j61241j44793j33634j26178j29520j30387
1598C596160j33440j31405j41116j57306j70781j73680j71609j70599j60246j41620
1608.2B044358j06334o1192j0942L0326O1818N7017N2800J44062J96783P6296R235
1619.4B494227j1597n4602p9741q8424j20334j64516j70179j53531j37267j26070j14568
1630.6A273398r4976q9076r4075p2957R267K9526J8375K2917L2486N8716R5257J24714
1642.9A313572J25720J70404L20431M75525N35308N64855N17133M71943P76209J834024
1653.1G105124J909798J179368J135025J361107J564988J622689J599954J568628J793499
$$ plain form
1577.6 9737460 9072632 8452881 7880145 7361471 6900825 6491216 6129525 5804273 5508125 5233413
1587.8 5233413 4996679 4790024 4599518 4421913 4260672 4115879 3982245 3856067 3726547 3596160
1598 3596160 3462720 3331315 3190199 3032893 2862112 2688432 2516823 2346224 2185978 2044358
1608.2 2044358 1938024 1876832 1865890 1896216 1958034 2015051 2067851 2211913 2408696 2484992 2494227
1619.4 2494227 2482630 2428028 2348287 2259863 2139529 1975013 1804834 1651303 1514036 1387966 1273398
1630.6 1273398 1178422 1089346 995271 922314 931581 961107 979482 1002399 1034885 1093601 1188858 1313572
1642.9 1313572 1439292 1609696 1930127 2405652 2940960 3505815 4022948 4494891 5271100 7105124
1653.1 7105124 9014922 10194290 11329315 12690422 14255410 15878099 17478053 19046681 20840180
1662.2B0840180J946694J594136J376201J393852J341081J498115J810017J552290
1670.4C3352566J274845J199513J041091J292130J773167J334974R19968J053134J255202
1679.6D4496590J268890J066906J058733J546243J936299J136750O39706Q65335J109779
1688.8E5125231J104569J019454R34577Q87138Q39382J052368J508444J006675M18013
1697.9F3895851O38640J462514J326406K83879L42088P63512R27371Q70293P53033
1707.1G1263587O39344P04241Q11266P78741P39557Q07362R29833Q79967P47907R08131
1717.3G9209936Q83066L95608K75404M35704N60432N82695N23186M77618M74954M75508
1727.5H4294111M99439N42110M59331L71045N19967P67219M88276j4240K2358K39235
$$ plain form
1662.2 20840180 22786874 24381010 25757211 27151063 28492144 29990259 31800276 33352566
1670.4 33352566 34627411 35826924 36868015 38160145 39933312 41268286 42188254 43241388 44496590
1679.6 44496590 45765480 46832386 47891119 49437362 51373661 52510411 53150117 54015452 55125231
1688.8 55125231 56229800 57249254 58183831 59070969 59910351 60962719 62471163 63477838 63895851
1697.9 63895851 64534491 65997005 67323411 67607290 67949378 68712890 69640261 70510554 71263587
1707.1 71263587 71902931 72607172 73418438 74197179 74936736 75744098 76673931 77553898 78301805 79209936
1717.3 79209936 80093002 80488610 80764014 81199718 81760150 82342845 82866031 83343649 83818603 84294111
1727.5 84294111 84793550 85335660 85794991 86166036 86686003 87453222 87941498 87927258 87949616 88188851
1737.7H8188851M10390M32902K29055J49071K62881K65872J87057K15954K91514L16567
1747.9I0950114K51662K06977K12330P4947l2657N8972J77956K52604K00230N7298
1758.1I2410433N5391J68878K58982J56760k6059k1774P0453J41555J96088J41572
1768.3I3552279L4649J24281K63363J42587j31744j54126n0616l0822l2842J4722N7787
1779.5I3789518L3414m9591o8617K241L2866l0660p1138l1376K7066Q9431J50216J50072
1791.8I4023442J8412j30200q8793Q839K7424N8645J36733J40459P9202N1660K8950
1803I4354773L1220P1061R7823J02663R7102J09744J34880R1576J4878Q10J6988L7568
1815.2I5161086N7870N2298J5461l564R352K3174M0942Q2904J31250O1470p3975l2759
$$ plain form
1737.7 88188851 88599241 89032143 89261198 89410269 89673150 89939022 90126079 90342033 90633547 90950114
1747.9 90950114 91201776 91408753 91621083 91696030 91663373 91722345 91900301 92152905 92353135 92410433
1758.1 92410433 92465824 92634702 92893684 93050444 93024385 93002611 93073064 93214619 93410707 93552279
1768.3 93552279 93586928 93711209 93974572 94117159 93985415 93831289 93780673 93749851 93717009 93731731 93789518
1779.5 93789518 93822932 93773341 93704724 93706965 93739831 93709171 93638033 93606657 93633723 93723154 93873370 94023442
1791.8 94023442 94041854 93911654 93822861 93831700 93859124 93917769 94054502 94194961 94274163 94325823 94354773
1803 94354773 94385993 94457054 94554877 94657540 94754642 94864386 94999266 95090842 95105720 95106530 95123518 95161086
1815.2 95161086 95218956 95271254 95286715 95283151 95292503 95315677 95356619 95439523 95570773 95632243 95558268 95525509
1827.4I5525509J27095J67960j1432j42568p7153N877K3282L2943M7076L4922J3298
1838.7I5746809J8960M3422Q2344J55080J92213J9037j47640q3608o151j9663l4470
1849.9I5966333j1325J0217P921n382r036P03N871l630j8722j6314m816j2219k6673
1863.1I5882928j7869J1241M4149P0870O8182j2070j35177j55467q4007k6464j0300
1874.4I5636016j1480j3184j2076q792j0151j4132j0633j914N120L046p546j3536Q673
1887.6I5549411N2875L5071n6165q4853l7700L117K950l6251o1160m4877k8151l0071
1899.8I5264196l2889l1990l1764l0952l0589k4063j1873J144Q381p761l7849m0346
1912.1I4993645j9556l374J0204L9262Q2564M9007n3143n5009K4592O2162J5313m8715
$$ plain form
1827.4 95525509 95652604 95820564 95809132 95666564 95589411 95595288 95618570 95651513 95698589 95733511 95746809
1838.7 95746809 95765769 95809191 95891535 96046615 96238828 96257865 96110225 96026617 96020466 96000803 95966333
1849.9 95966333 95955008 95965225 95973146 95967764 95958728 95959431 95965302 95961672 95942950 95926636 95921820 95909601 95882928
1863.1 95882928 95865059 95876300 95920449 95991319 96059501 96047431 95912254 95756787 95672780 95646316 95636016
1874.4 95636016 95624536 95611352 95599276 95590484 95580333 95566201 95555568 95553654 95558774 95561820 95554274 95540738 95549411
1887.6 95549411 95602286 95637357 95581192 95496339 95458639 95461756 95464706 95428455 95367295 95322418 95294267 95264196
1899.8 95264196 95231307 95199317 95167553 95136601 95106012 95081949 95070076 95071220 95079601 95071840 95033991 94993645
1912.1 94993645 94974089 94970715 94980919 95020181 95102745 95151752 95098609 95043600 95068192 95130354 95145667 95096952
1924.3I5096952m7595j6498j776L343o097k0546k1100j4979j6659k1952k5040k6405
1936.6I4881648k9826l0303j3972J6606M6891J5742o2025o6703k3574j1283j1206O08
1948.8I4712603J3560K0242K3091K9975L8755M2349M3243M9567N5731N5289N2822N0485
1961I5187712M7856M8960N7899O9279P8076O6686L1483J2851K4068L5811L9142M4715
1973.3I5744538M7148L7854K9099K9046K8968L2061L3963K7591K1702J7613J4627J7005
1985.5I6081215K1267J9264J1450J1957L2848M2147N197l2651k7395o979O32l94k175
1998.8I6156383n001r322r418o038k444q52n609j1533j1367j0240j2827j2529j2737
2012I6046466j6582j2249M23Q601m733k8550l1620j8150o527j1027k7334k8974j7321
$$ plain form
1924.3 95096952 95049357 95032859 95031083 95034426 95028329 95007783 94986683 94971704 94955045 94933093 94908053 94881648
1936.6 94881648 94851822 94821519 94807547 94824153 94871044 94886786 94824761 94758058 94734484 94723201 94711995 94712603
1948.8 94712603 94726163 94746405 94769496 94799471 94838226 94880575 94923818 94973385 95029116 95084405 95137227 95187712
1961 95187712 95235568 95284528 95342427 95411706 95489782 95556468 95587951 95600802 95624870 95660681 95699823 95744538
1973.3 95744538 95791686 95829540 95858639 95887685 95916653 95948714 95982677 96010268 96031970 96049583 96064210 96081215
1985.5 96081215 96102482 96121746 96133196 96145153 96178001 96220148 96225345 96192694 96165299 96158320 96158952 96158558 96156383
1998.8 96156383 96151382 96142060 96132642 96126604 96124160 96123308 96117699 96106166 96094799 96084559 96071732 96059203 96046466
2012 96046466 96029884 96017635 96018058 96026659 96021926 95993376 95961756 95943606 95937079 95926052 95898718 95869744 95852423
2025.3I5852423j2988j5676j7786k0254j8614j4991j9175k2828k0278j8573j5407j1385
2037.5I5644468q994k557K908o073j6940j1653o449r221p271k695o282j0097o860q220
2051.8I5544064j1533j0246j2208j4954r758m577p117j5676j7536p587j193K295k92
2065.1I5433682j7524k7352j7309q434r829j0354o866q053j4722j5414j2868j7155
2077.3I5267802k5224l0565l0643k7967k6434k5523k7889l4291l6156k9993k9379l8511
2089.5I4905227l9839l0774k4611k8610l2872k8694k3627k4569k8086k8276k6530k5243
2101.8I4563496k5231k3281k0039j7965j5283j5151j8561j9682j8876k1261k4414k3091
2114I4320661j8770j8614k1649k1815j7828j4251j3012j0508j1224j7541k1267j7745
$$ plain form
2025.3 95852423 95839435 95823759 95805973 95785719 95767105 95752114 95732939 95710111 95689833 95671260 95655853 95644468
2037.5 95644468 95635474 95632917 95635825 95629752 95612812 95601159 95594710 95585489 95578218 95575523 95569241 95559144 95552284 95544064
2051.8 95544064 95532531 95522285 95510077 95495123 95485365 95480788 95473671 95457995 95440459 95432872 95431679 95433974 95433682
2065.1 95433682 95416158 95388806 95371497 95363063 95353234 95342880 95336014 95327961 95313239 95297825 95284957 95267802
2077.3 95267802 95242578 95212013 95181370 95153403 95126969 95101446 95073557 95039266 95003110 94973117 94943738 94905227
2089.5 94905227 94865388 94834614 94810003 94781393 94748521 94719827 94696200 94671631 94643545 94615269 94588739 94563496
2101.8 94563496 94538265 94514984 94494945 94476980 94461697 94446546 94427985 94408303 94389427 94368166 94343752 94320661
2114 94320661 94301891 94283277 94261628 94239813 94221985 94207734 94194722 94184214 94172990 94155449 94134182 94116437
2126.2I4116437j5026j9795k5951k3717j4824j3542k1505k3014j8632k2292k4802j4972
2138.5I3878365m119o670j7881k0981j7089j4585j0663p695j0443j7518j9175j2415
2150.7I3719131q911n728m864j1486j1521q595j3393j6141j8299k2686j9931j5992
2163I3561584j7196k1929k7406k3574j6939j9616k2054k1261k4396k3293j5170j1855
2175.2I3316895j4985k3424k9839k4581j5944j2535j5246j7357j1736n550p659j0913
2187.4I3127126j0741j4138j6863j5473j3202j4031j6845j6653k0641k6155k2822j7053
2199.7I2922509j6207k2095l0017k9582k3073k2614k9087l1924l0822k7233k0689k2995
2211.9I2616171l0429k9450l1555l6633l1823k7913l0529l3295l2628l4517m2248m2420
$$ plain form
2126.2 94116437 94101411 94081616 94055665 94031948 94017124 94003582 93982077 93959063 93940431 93918139 93893337 93878365
2138.5 93878365 93874246 93867576 93849695 93828714 93811625 93797040 93786377 93778682 93768239 93750721 93731546 93719131
2150.7 93719131 93710220 93704492 93699628 93688142 93676621 93668026 93654633 93638492 93620193 93597507 93577576 93561584
2163 93561584 93544388 93522459 93495053 93471479 93454540 93434924 93412870 93391609 93367213 93343920 93328750 93316895
2175.2 93316895 93301910 93278486 93248647 93224066 93208122 93195587 93180341 93162984 93151248 93145698 93138039 93127126
2187.4 93127126 93116385 93102247 93085384 93069911 93056709 93042678 93025833 93009180 92988539 92962384 92939562 92922509
2199.7 92922509 92906302 92884207 92854190 92824608 92801535 92778921 92749834 92717910 92687088 92659855 92639166 92616171
2211.9 92616171 92585742 92556292 92524737 92488104 92456281 92428368 92397839 92364544 92331916 92297399 92255151 92212731
2224.1I2212731l0733k5796l2771m0799n2435n5682m6593m1211l8165l6108l7033l5232
2236.4I1740173l2383l3563k9725k1899k1982k5648k4420j9998j2564o598q536j4591
2248.6I1488266k0850j7857p195m249r424j4174j7434j8525j5974j6261k3967k9468
2260.8I1292888k2507j0991r978k1439k7323j8060j0747j2255j0133j1468j8078j8805
2273.1I1101104j4561o551n078r901j5026k2000k3329j6940j3566j2201o878l684l147
2286.3I0948242p916j3876j3709j1485j5194j8739j1129l027o080j6844k1166j9896
2298.6I0789181j7869k1834l1763k8974k0921k5243k5671n532O777k539j1831q971
2310.8I0594810j871p731k1339k3347j5121k712K3603L8695L6145M5085M1920J6558
$$ plain form
2224.1 92212731 92181998 92156202 92123431 92082632 92030197 91974515 91927922 91886711 91848546 91812438 91775405 91740173
2236.4 91740173 91707790 91674227 91644502 91622603 91600621 91574973 91550553 91530555 91517991 91511393 91502857 91488266
2248.6 91488266 91467416 91449559 91442364 91438115 91428691 91414517 91397083 91378558 91362584 91346323 91322356 91292888
2260.8 91292888 91270381 91259390 91249412 91227973 91200650 91182590 91171843 91159588 91149455 91137987 91119909 91101104
2273.1 91101104 91086543 91079992 91074914 91065013 91049987 91027987 91004658 90987718 90974152 90961951 90955073 90951389 90948242
2286.3 90948242 90940326 90926450 90912741 90901256 90886062 90867323 90856194 90853167 90847087 90830243 90809077 90789181
2298.6 90789181 90771312 90749478 90717715 90688741 90667820 90642577 90616906 90611374 90618151 90615612 90603781 90594810
2310.8 90594810 90592939 90585208 90563869 90540522 90525401 90522689 90546292 90584987 90621132 90666217 90708137 90724695
2323.1I0724695l779j0872m965Q070J5742K3603L2932K6536q23k4181k8670j4901L576
2336.3I0746963m202j2714n853m595k2483n3019o6399p4369j04547j50716k03270k09122
2348.6H9835674j02818N8370J40900J24228J01208J03659R2035P3088P0244L2985j7303
2359.8I0512270l3886n0187o3896o3032q0347j01727j07509j15222j20741j20371j39374
2371H9515978j56045j39743j23310j20932j16587j08403j04856j15961j24484j07634
2381.2H8298023q4311p1704o6406o4993n3984l7813k9355k2477j6862j4043j2326j3853
2393.4H7809896j6629j9354j8072j4269j6195k0611k4063k6333k8896l4881l7414l4356
2405.7H7518823l6555m2516m2647l9995l6752l1478k7698l2949m3291m2087l5566l3540
$$ plain form
2323.1 90724695 90720916 90710044 90705079 90713149 90728891 90752494 90785426 90811962 90811139 90786958 90758288 90743387 90746963
2336.3 90746963 90742761 90730047 90724194 90719599 90697116 90644097 90577698 90503329 90398782 90248066 90044796 89835674
2348.6 89835674 89732856 89791226 89932126 90056354 90157562 90261221 90353256 90426344 90496588 90529573 90512270
2359.8 90512270 90478384 90428197 90364301 90301269 90220922 90119195 90011686 89896464 89775723 89655352 89515978
2371 89515978 89359933 89220190 89096880 88975948 88859361 88750958 88646102 88530141 88405657 88298023
2381.2 88298023 88213712 88142008 88075602 88010609 87956625 87918812 87889457 87866980 87850118 87836075 87823749 87809896
2393.4 87809896 87793267 87773913 87755841 87741572 87725377 87704766 87680703 87654370 87625474 87590593 87553179 87518823
2405.7 87518823 87482268 87439752 87397105 87357110 87320358 87288880 87261182 87228233 87184942 87142855 87107289 87073749
2417.9H7073749l2085l4428l6919l5983l9911m4489l7283k7561l2032m5883n1600m6653
2430.1H6608922m5901m7624m4811m5806m9251m7845m6438n0157n4759n4330m8542m3464
2442.4H6029994m6283n4550n6225n6052o1363o0755n5855n5778n8812o1465o4563o7533
2454.6H5330760o8390o7228o1572n7363o2400p1526p3051o3640n6136n9747o7330p2932
2466.8H4549445p7808p7194o9195o7449p0661o7884o7454p2205p6384p4154o9976p5525
2479.1H3683556p9137p4512p3057p2116o6822o3724o4629o5160o6566o7014o3801o5839
2491.3H2861179p0697p0983p1311o8677o5285p1352q1849q1462p1353o7299p1288p9464
2503.6H1990159q7363q3649o8659n8591o2895o7359o3437o1399n7072n1611n9325o8676
$$ plain form
2417.9 87073749 87041664 87007236 86970317 86934334 86894423 86849934 86812651 86785090 86753058 86707175 86655575 86608922
2430.1 86608922 86563021 86515397 86470586 86424780 86375529 86327684 86281246 86231089 86176330 86122000 86073458 86029994
2442.4 86029994 85983711 85929161 85872936 85816884 85755521 85694766 85638911 85583133 85524321 85462856 85398293 85330760
2454.6 85330760 85262370 85195142 85133570 85076207 85013807 84942281 84869230 84805590 84749454 84689707 84622377 84549445
2466.8 84549445 84471637 84394443 84325248 84257799 84187138 84119254 84051800 83979595 83903211 83829057 83759081 83683556
2479.1 83683556 83604419 83529907 83456850 83384734 83317912 83254188 83189559 83124399 83057833 82990819 82927018 82861179
2491.3 82861179 82790482 82719499 82648188 82579511 82514226 82442874 82361025 82279563 82208210 82140911 82069623 81990159
2503.6 81990159 81902796 81819147 81750488 81691897 81629002 81561643 81498206 81436807 81379735 81328124 81268799 81200123
2515.8H1200123o1929n1666n1278n4818n9772o2280o2269o4814o9470p2097p0084p0935
2528H0448711p6228q2291q3118p3511o9558p3725p0632o5654o5375o1148n6213n6613
2540.3G9614645n4300m8309m2331l8857l7950l4785l0029k9874m0161m8703m1116l3164
2552.5G9135066l7652l9071l6728m6116n3156m7731m7982n0753m5306m2844m5836m9603
2564.7G8592288n1844n4675o1631o5035o7866p5686p6127o6411o5458p4416p2891o4552
2577G7795696o3306o5917o7848o6739o3503o5636p2092p0727o1756n5755n5146n8359
2589.2G7028912n8180n1427m6992m6819m6856m5520l9214l1900l0220l0463l0250l2961
2601.5G6538110l4613k8544k1625k0313k3312k9093l2556k9784k2012j3107o515o866
$$ plain form
2515.8 81200123 81138194 81086528 81035250 80980432 80920660 80858380 80796111 80731297 80661827 80589730 80519646 80448711
2528 80448711 80372483 80290192 80207074 80133563 80064005 79990280 79919648 79853994 79788619 79727471 79671258 79614645
2540.3 79614645 79560345 79512036 79469705 79430848 79392898 79358113 79328084 79298210 79258049 79209346 79168230 79135066
2552.5 79135066 79097414 79058343 79021615 78975499 78922343 78874612 78826630 78775877 78730571 78687727 78641891 78592288
2564.7 78592288 78540444 78485769 78424138 78359103 78291237 78215551 78139424 78073013 78007555 77933139 77860248 77795696
2577 77795696 77732390 77666473 77598625 77531886 77468383 77402747 77330655 77259928 77198172 77142417 77087271 77028912
2589.2 77028912 76970732 76919305 76872313 76825494 76778638 76733118 76693904 76662004 76631784 76601321 76571071 76538110
2601.5 76538110 76503497 76474953 76453328 76433015 76409703 76380610 76348054 76318270 76296258 76283151 76276636 76269770
2613.7G6269770j5384j8269j0097n675q171j0556p022L332L338q708r346j389P75K450
2628G6185048N322O551P772O527j520l362J0074J7088Q071L981J7256K9582K8455K3484
2642.2G6344329K0075J9711J7804J1838J1170J4936J4145J1235Q607K915n073j0049
2654.5G6461643p105j895o259j2737j0342q374q786r519j3506k1094k6453k2560k2870
2667.7G6290143l2759l7646l9554n0545o2656n7221m5305n4813p7295q4025p3576p1555
2680G5603193p5340o4796n9462p1222q6021r2977q8120q5729r3013r9164j00470r8300
2692.2G4588579r8068j08087j17302j16044j15138j22315j25736j16002j12677j24157
2702.4G3433053j31380j26439j17761j16325j23352j24454j12152r9141r9515j07247
$$ plain form
2613.7 76269770 76254386 76236117 76226020 76220345 76212174 76201618 76194596 76197928 76201266 76192558 76183212 76181823 76182598 76185048
2628 76185048 76190370 76196921 76204693 76211220 76209700 76206338 76216412 76233500 76241571 76245552 76262808 76292390 76320845 76344329
2642.2 76344329 76364404 76384115 76401919 76413757 76424927 76439863 76454008 76465243 76473850 76476765 76471692 76461643
2654.5 76461643 76454538 76452643 76446384 76433647 76423305 76414931 76406145 76396626 76383120 76362026 76335573 76313013 76290143
2667.7 76290143 76257384 76219738 76180184 76129639 76066983 76009762 75964457 75909644 75832349 75748324 75674748 75603193
2680 75603193 75527853 75463057 75403595 75332373 75246352 75153375 75065255 74979526 74886513 74787349 74686879 74588579
2692.2 74588579 74490511 74382424 74265122 74149078 74033940 73911625 73785889 73669887 73557210 73433053
2702.4 73433053 73301673 73175234 73057473 72941148 72817796 72693342 72581190 72482049 72382534 72275287
2712.6G2275287j06895j00458r5540r1910q8638q6636q7863j02055j15186q7619n5951
2723.8G1256536p9256j02872n9294m59M083j7423k3281j9205j7405j5860j2255j4508
2736.1G0898801j2523M697K3031L0077K4849J4657J2403J7149J6302j848j6374J2708
2748.3G1023929M4435M0824M3070M5574K6279P159j955J371J4317J5175L374J61N728
2761.6G1269441M422p832j5139r799o074r126j0436j1504k0921l5614m8280o6250p2527
2774.8G0960361k2990K7287P952k7580m2545n2125n1397m1163l8510m6128n4753p6008
2787.1G0542401j10632r6923l3587j7453l0863k2578l8970p2014p9346r3943j07842
2798.3F9838250n3746l0k5212o3217p1192p8803q8597q3452p9530j01710j28788r8788
$$ plain form
2712.6 72275287 72168392 72067934 71972394 71880484 71791846 71705210 71617347 71515292 71400106 71312487 71256536
2723.8 71256536 71177280 71074408 71015114 71014655 71018738 71001315 70978034 70958829 70941424 70925564 70913309 70898801
2736.1 70898801 70886278 70890975 70914006 70944083 70968932 70983589 70995992 71013141 71029443 71027595 71011221 71023929
2748.3 71023929 71068364 71109188 71152258 71197832 71224111 71231270 71229315 71230686 71245003 71260178 71263552 71263713 71269441
2761.6 71269441 71273863 71266031 71250892 71241093 71235019 71225893 71215457 71203953 71183032 71147418 71099138 71032888 70960361
2774.8 70960361 70937371 70964658 70972610 70945030 70902485 70850360 70798963 70757800 70719290 70673162 70618409 70542401
2787.1 70542401 70431769 70334846 70301259 70283806 70252943 70230365 70191395 70119381 70040035 69946092 69838250
2798.3 69838250 69784504 69784474 69759262 69696045 69624853 69546050 69457453 69374001 69294471 69192761 69063973 68965185
2810.5F8965185m2987m1974o6405p4035q0449q5801q1980q7470r7554r3633r1398j02818
2822.7F8018681j08314r5635q7363r8693j13589j18130j17648j16295j15430j25998
2832.9F6921586j51837j56009j29867j56039k19321j78671o0201k5952q6110j38671
2843.1F5618908j51646j55234j78224k06721j90693j44637j41161j72115j87891j92911
2853.3F3897675k00492k04086k04158k14201k42138k63566k36606j95861k04385k33227
2863.5F1698955k44498k52426k60305k56646k49636k51818k58511k68906k76876k28703
2873.7E9150630j24335o3819o7365p1764n8204l5286j3011J519J0759J7703K2357K3568
2886E8792752K3103K0033J0598j121j2076k2501l0118m8250p7122o4814j1516j317
$$ plain form
2810.5 68965185 68922198 68880224 68813819 68739784 68659335 68573534 68491554 68404084 68306530 68212897 68121499 68018681
2822.7 68018681 67910367 67814732 67727369 67628676 67515087 67396957 67279309 67163014 67047584 66921586
2832.9 66921586 66769749 66613740 66483873 66327834 66108513 65929842 65869641 65843689 65757579 65618908
2843.1 65618908 65467262 65312028 65133804 64927083 64736390 64591753 64450592 64278477 64090586 63897675
2853.3 63897675 63697183 63493097 63288939 63074738 62832600 62569034 62332428 62136567 61932182 61698955
2863.5 61698955 61454457 61202031 60941726 60685080 60435444 60183626 59925115 59656209 59379333 59150630
2873.7 59150630 59026295 58962476 58895111 58823347 58765143 58729857 58716846 58718365 58729124 58746827 58769184 58792752
2886 58792752 58815855 58835888 58846486 58845365 58833289 58810788 58780670 58732420 58655298 58590484 58578968 58577651
2898.2E8577651l9870o3801o5648p4887r8259j04493q1169p2104r6583j23799j41710
2909.4E7615328j54060j68646k10768k28619j56141j10197j53130j74433j70171j86908
2919.6E5902255k22981k72561l11797l45302l82310m09168m31019m58312m83501m56143
2929.8E2129161l49885k51913k13063j78998j24199o4361q851L8308P5847J07282J26565
2941E1285893J16932Q6767R2846J41865J47968J21576J37043J43301Q3554p111n9122
2952.3E2291512l2466j913m7333j25670j84381k35236k90876l42584l92330m38028
2962.5E0200695m58849m66019m84395n01290n02744m91896m71255m39179l98296l59425
2972.7D5627347l29438k79525j85213j14932j15091j13556o7335j8701J7378O1640
$$ plain form
2898.2 58577651 58537781 58473980 58408332 58333445 58235186 58130693 58049524 57977420 57880837 57757038 57615328
2909.4 57615328 57461268 57292622 57081854 56853235 56697094 56586897 56433767 56259334 56089163 55902255
2919.6 55902255 55679274 55406713 55094916 54749614 54367304 53958136 53527117 53068805 52585304 52129161
2929.8 52129161 51779276 51527363 51314300 51135302 51011103 50946742 50937891 50976199 51052046 51159328 51285893
2941 51285893 51402825 51489592 51582438 51724303 51872271 51993847 52130890 52274191 52357745 52350634 52291512
2952.3 52291512 52259046 52257133 52209800 52084130 51899749 51664513 51373637 51031053 50638723 50200695
2962.5 50200695 49741846 49275827 48791432 48290142 47787398 47295502 46824247 46385068 45986772 45627347
2972.7 45627347 45297909 45018384 44833171 44718239 44603148 44489592 44422257 44403556 44420934 44482574
2982.9D4482574Q8000P6464O3604O8840P6440P6461O7747M7097L5050P5516J41326
2994.1D5299119J48752R6163N1585P3057J28508J25679Q2705N3981L5816L4285L8269
3005.3D6167919K9656J4061r713l9610o6212o2680k6139j5116j7211J4600K9326J5121
3017.5D6034002M193j2889j1000N755j5336o4099p9695m3297k3061n7268r8499j12072
3029.8D5526734j04013j15320j55872j74564j56680j17669r8717j38637j97929k32020
3040D4035313k34035k24227j96794j57377j58512j60277j37615j48481j91838k21416
3050.2D2204741j91898j17516r2134j23274j16295q1435p0664n1847k4384k4155l8734
3061.4D1272405m7514l5363j0878j4431j7318K6167Q8471J15159R7573Q9353R8875
$$ plain form
2982.9 44482574 44570574 44647038 44710642 44779482 44855922 44932383 45000130 45047227 45082277 45157793 45299119
2994.1 45299119 45447871 45544034 45595619 45668676 45797184 45922863 46005568 46059549 46095365 46129650 46167919
3005.3 46167919 46197575 46211636 46201923 46162313 46096101 46033421 46007282 45992166 45974955 45989555 46018881 46034002
3017.5 46034002 46038195 46025306 46014306 46020061 46004725 45940626 45860931 45817634 45794573 45737305 45638806 45526734
3029.8 45526734 45422721 45307401 45151529 44976965 44820285 44702616 44603899 44465262 44267333 44035313
3040 44035313 43801278 43577051 43380257 43222880 43064368 42904091 42766476 42617995 42426157 42204741
3050.2 42204741 42012843 41895327 41803193 41679919 41563624 41482189 41411525 41359678 41335294 41311139 41272405
3061.4 41272405 41224891 41189528 41178650 41164219 41146901 41173068 41261539 41376698 41474271 41563624 41662499
3072.6D1662499R1470P6860O1497L0166J0773L3674N6654N1454N2670M1839K638R521
3084.8D2181715N1195M6095J7315j257j3644M047L2199K6553M080p432j4022l1358
3097.1D2295486n2175o1774n7179l7691j9971k3955m5347p1323r2107j07315j10251
3108.3D1616398p1752k3335l3021p3368j03071j26943j29276j14894r7409q0469q8743
3119.5D0674117r0876m4903j1933l8481p4819q6939r3648j12357j33020j25346r1216
3130.7C9770579p1722p8839r5275j11982j28436j42917j43671j32731j04639n6398
3140.9C8703969l6806n8660q2555q9073q4493r2026j12197j22282j29449j56367j59613
3152.1C7580448r2467k5338k9636o4277q0693q5953r2786j00023r7796q9211q7729
$$ plain form
3072.6 41662499 41753969 41830829 41892326 41922492 41933265 41966939 42023593 42075047 42127717 42169556 42172194 42181715
3084.8 42181715 42232910 42279005 42296320 42295063 42281419 42285466 42317665 42344218 42348298 42340866 42326844 42295486
3097.1 42295486 42243311 42181537 42124358 42086667 42066696 42042741 41997394 41926071 41833964 41726649 41616398
3108.3 41616398 41544646 41521311 41488290 41414922 41311851 41184908 41055632 40940738 40843329 40762860 40674117
3119.5 40674117 40583241 40538338 40526405 40487924 40413105 40326166 40232518 40120161 39987141 39861795 39770579
3130.7 39770579 39698857 39620018 39524743 39412761 39284325 39141408 38997737 38865006 38760367 38703969
3140.9 38703969 38667163 38608503 38525948 38436875 38352382 38260356 38148159 38025877 37896428 37740061 37580448
3152.1 37580448 37487981 37462643 37433007 37368730 37288037 37202084 37109298 37009275 36911479 36822268 36734539
3163.4C6734539r0965q9115q5959q8206q8468q8826r3451r4179q8477q4230q8024r1294
3175.6C5663345q4969p7477q6248j01739r4071p5734p7486q6114q2191p9310q7393
3186.8C4730613r4348r4363q9160q0672p7167p5677p5081p7316p5689p4664q1262r2774
3199C3742440r5198q7708q5741q3322p8427q7315r0024p1386o8393q2031q3151p9620
3211.3C2750124q4645q9195q0902o7284p0426r4733j04826p7540m7681m9767o4879
3222.5C1918246o7974p0378p5638p2515o7818o7365p1165q7884j19397j46464j15430
3233.7C0956218k7335J7452j0139m5758n6636n6598o2862o5905o5082p3636q9895j09551
3246C0310273j08942o0803r420j4499m4903n4518n7259p6443j00613p8711k1129o935
$$ plain form
3163.4 36734539 36643574 36554459 36468500 36380294 36291826 36203000 36109549 36015370 35926893 35842663 35754639 35663345
3175.6 35663345 35578376 35500899 35414651 35312912 35218841 35143107 35065621 34979507 34897316 34818006 34730613
3186.8 34730613 34636265 34541902 34452742 34372070 34294903 34219226 34144145 34066829 33991140 33916476 33835214 33742440
3199 33742440 33647242 33559534 33473793 33390471 33312044 33224729 33134705 33063319 32994926 32912895 32829744 32750124
3211.3 32750124 32665479 32576284 32495382 32428098 32357672 32262939 32158113 32080573 32032892 31983125 31918246
3222.5 31918246 31850272 31779894 31704256 31631741 31563923 31496558 31425393 31337509 31218112 31071648 30956218
3233.7 30956218 30928883 30946335 30936196 30890438 30833802 30777204 30714342 30648437 30583355 30509719 30419824 30310273
3246 30310273 30201331 30140528 30131108 30116609 30071706 30017188 29959929 29883486 29782873 29704162 29683033 29676098
3258.2B9676098l2434m6727n1868o2084o2681n4887n9256o1631n9727q0138j21263
3269.4B8983402j33440q2165q073J4105k8404m9037k0319j4428l8421n2702n5361n1364
3281.6B8463793m5440m7084n1165m8909m7779n3075n9664p5680j06350j06206m5476
3292.9B7776965o106l1865n1230k9012M291N984j7860l8523n7309q3492j15108j10507
3305.1B7246228o6388k6044k319O357J4776J4636j0320l0229l5894m3324m7370m6337
3317.3B6973772m2415l3968l5280n4252o3950n8812o9645p8318n6633l9822m2301m3661
3329.6B6354715n2014o3517o5566o2748n6529n8261o5738o7842o7520o1131n5211o0374
3341.8B5618264o6870n9194m8640n3200n6035m7615m7350n7521o3104o4960o4663n5462
$$ plain form
3258.2 29676098 29643664 29596937 29545069 29482985 29420304 29365417 29306161 29244530 29184803 29104665 28983402
3269.4 28983402 28849962 28767797 28759724 28773829 28745425 28696388 28676069 28661641 28623220 28570518 28515157 28463793
3281.6 28463793 28418353 28371269 28320104 28271195 28223416 28170341 28110677 28034997 27928647 27822441 27776965
3292.9 27776965 27770859 27738994 27687764 27658752 27663043 27669027 27651167 27612644 27555335 27471843 27356735 27246228
3305.1 27246228 27179840 27153796 27151477 27157834 27172610 27187246 27176926 27146697 27110803 27067479 27020109 26973772
3317.3 26973772 26931357 26897389 26862109 26807857 26743907 26685095 26615450 26537132 26480499 26440677 26398376 26354715
3329.6 26354715 26302701 26239184 26173618 26110870 26054341 25996080 25930342 25862500 25794980 25733849 25678638 25618264
3341.8 25618264 25551394 25492200 25443560 25390360 25334325 25286710 25239360 25181839 25118735 25053775 24989112 24933650
3354B4933650m4637m2085m5148m4641l7296l3986m0603m4037m1902m1384k9924p393
3366.3B4480614J216k760j1307l5187o1445o6291m6773j9543j1k0k1413k3789J735
3379.5B4195026K023k2411k6746j5458p880m752l551N567K5934N2118O9587N0500q206
3392.8B4311751n1977l9681J174K8148L9776O3671Q0274N4736l495n5497m9494K192
3405B4381578K5019J8092L4743N3261L8816L5094N6514M5203R088J493J5839L7697
3417.3B4752437O4802P8106O8605M4806K6169K9019M4018O5359R1052J06669J02520
3428.5B5473562R6765R1472N1135L3477J03840J70026J40637P4532K8324r080Q869
3439.7B6263559O6185Q2379P5853Q5417R9352J15287J39979J24752P8488P3444R7332
$$ plain form
3354 24933650 24889013 24846928 24801780 24757139 24719843 24685857 24645254 24601217 24559315 24517931 24488007 24480614
3366.3 24480614 24481830 24479070 24467763 24432576 24371131 24304840 24258067 24238524 24238513 24238493 24217080 24193291 24195026
3379.5 24195026 24197049 24174638 24147892 24132434 24124554 24119802 24116251 24121818 24147752 24199870 24269457 24319957 24311751
3392.8 24311751 24259774 24220093 24221267 24249415 24289191 24352862 24433136 24487872 24484377 24428880 24379386 24381578
3405 24381578 24406597 24424689 24459432 24512693 24551509 24586603 24643117 24688320 24697408 24698901 24714740 24752437
3417.3 24752437 24817239 24895345 24963950 25008756 25034925 25063944 25107962 25173321 25264373 25371042 25473562
3428.5 25473562 25570327 25661799 25712934 25746411 25850251 26020277 26160914 26235446 26263770 26254690 26263559
3439.7 26263559 26329744 26412123 26487976 26573393 26672745 26788032 26928011 27052763 27131251 27204695 27302027
3450.9B7302027J21119J24732R6127Q6397J20411J60554J70389J52576J36402J18765
3461.1B8589499J03307J16738J47182J85719K27988K27681K01082J60822O1536O196
3471.3C0027750P1293J42521J65763J69558J67027J83159K20180K28220J72770J15362
3481.5C1663603J19975J49607J79819K10950K16621K00274J79959J66922J90452K23100
3491.7C3501282K09901J98320K22846K45697K52086K36708K04652J91561K27797K93383
3501.9C5784233K99447K05377J40101J75768K17301K43213K76471K79563K60088K69359
3512.1C8150921L05114K91699K27344K17330K61563K88180K90647K74661K73767L35756
3522.3D0916982L83413L15568K33141K54052L04234L13986L18727L22231L04181K96423
$$ plain form
3450.9 27302027 27423146 27547878 27644005 27730402 27850813 28011367 28181756 28334332 28470734 28589499
3461.1 28589499 28692806 28809544 28956726 29142445 29370433 29598114 29799196 29960018 30021554 30027750
3471.3 30027750 30099043 30241564 30407327 30576885 30743912 30927071 31147251 31375471 31548241 31663603
3481.5 31663603 31783578 31933185 32113004 32323954 32540575 32740849 32920808 33087730 33278182 33501282
3491.7 33501282 33711183 33909503 34132349 34378046 34630132 34866840 35071492 35263053 35490850 35784233
3501.9 35784233 36083680 36289057 36429158 36604926 36822227 37065440 37341911 37621474 37881562 38150921
3512.1 38150921 38456035 38747734 38975078 39192408 39453971 39742151 40032798 40307459 40581226 40916982
3522.3 40916982 41300395 41615963 41849104 42103156 42407390 42721376 43040103 43362334 43666515 43962938
3532.5D3962938L15031L38086L80490L92168L13077K60746L07075L62530L80242L74606
3542.7D7386989L76150M11001M06882L39878K94456K83619L02127L56189M02981L91817
3552.9E0952089L51506L35485L39437L53396L56781L68547M08239M07612L64327L45719
3563.1E4583138L48956L93307M84979N23722M59957L21228K32476K71302L44861L88664
3573.3E8352590L96531L77781L69185L78245L80313L85112L84080L66354L67862L68566
3583.5F2126619L58224M10854N04196N01913M16946K95925K13498K74396L80862M21792
3593.7F5905225M17906M02856L48360L23444L64828L91943M05192L95173L57181L33255
3603.9F9645363L35062L87603M47464M50986M66776L91376K71565L93760N20682M14765
$$ plain form
3532.5 43962938 44277969 44616055 44996545 45388713 45701790 45962536 46269611 46632141 47012383 47386989
3542.7 47386989 47763139 48174140 48581022 48920900 49215356 49498975 49801102 50157291 50560272 50952089
3552.9 50952089 51303595 51639080 51978517 52331913 52688694 53057241 53465480 53873092 54237419 54583138
3563.1 54583138 54932094 55325401 55810380 56334102 56794059 57115287 57347763 57619065 57963926 58352590
3573.3 58352590 58749121 59126902 59496087 59874332 60254645 60639757 61023837 61390191 61758053 62126619
3583.5 62126619 62484843 62895697 63399893 63901806 64318752 64614677 64828175 65102571 65483433 65905225
3593.7 65905225 66323131 66725987 67074347 67397791 67762619 68154562 68559754 68954927 69312108 69645363
3603.9 69645363 69980425 70368028 70815492 71266478 71733254 72124630 72396195 72789955 73310637 73725402
3614.1G3725402L18152L21174L97777N08410N38754M50993L01439K55537L32486L99226
3624.3G7549350M28039M49765N49584P79027P67601L18640J02478K66195M73869M95833
3634.5H2180381M08757M19491M90344N08159M78309M70621M98175N07862M90838N02616
3644.7H6955553N89651P29305P64483O68818N94264M49693K60329K09994L22872N13416
3654.9I2058378O64270N72789L24619L03060M17465M79471N04858M98342M68523M62567
3665.1I6754342M82178N15378N94997O46102N69004L90423K30681L03555N98240P39097
3675.3A01823997L39270m7696K4784K07281K43521K02239K05326K30324K53796K95210
3685.5A03778052L35563L72409L49188K14899J43206Q9860k2853k9242N4706J21617
$$ plain form
3614.1 73725402 74043554 74364728 74762505 75270915 75809669 76260662 76562101 76817638 77150124 77549350
3624.3 77549350 77977389 78427154 78976738 79755765 80523366 80842006 80944484 81210679 81684548 82180381
3634.5 82180381 82589138 83008629 83498973 84007132 84485441 84956062 85454237 85962099 86452937 86955553
3644.7 86955553 87545204 88274509 89038992 89707810 90302074 90751767 91012096 91222090 91544962 92058378
3654.9 92058378 92722648 93295437 93620056 93923116 94340581 94820052 95324910 95823252 96291775 96754342
3665.1 96754342 97236520 97751898 98346895 98992997 99562001 99952424 100183105 100486660 101084900 101823997
3675.3 101823997 102163267 102115571 102140355 102347636 102591157 102793396 102998722 103229046 103482842 103778052
3685.5 103778052 104113615 104486024 104835212 105050111 105193317 105283177 105260324 105231082 105285788 105407405
3695.7A05407405J53446J52814J61195J83630J94860J58596K8324n2297J1122J04892
3705.9A06503987J61863K16126K76303K35451J18231M2963j10554j98508q7666K3925
3716.1A07182121O2812Q8536J05417Q7476R7156J25348O1214K444M1270N8234j1099
3727.3A07900929n3632K5594J52374K40183K10321Q8131P9310O7186j03533k31683
3737.5A08375180k10536p9942Q2267J75369K30753L69740L10075j97363l16179k1410
3747.7A08717954K47228K40112j1552j05858j70373k85841j91664r895P0119N3037
3757.9A08553267M6896r17j24097j19400k671P6557J01828N6613j4913J3577R6393
3769.1A08683133N4562j06513j50609p2980j0228L826J0371N0438Q6284N2774m9663
$$ plain form
3695.7 105407405 105560851 105713665 105874860 106058490 106253350 106411946 106440270 106387973 106399095 106503987
3705.9 106503987 106665850 106881976 107158279 107393730 107511961 107554924 107444370 107245862 107158196 107182121
3716.1 107182121 107244933 107333469 107438886 107526362 107623518 107748866 107810080 107812524 107853794 107912028 107900929
3727.3 107900929 107847297 107872891 108025265 108265448 108475769 108563900 108643210 108710396 108606863 108375180
3737.5 108375180 108164644 108084702 108166969 108342338 108573091 108942831 109252906 109055543 108739364 108717954
3747.7 108717954 108965182 109205294 109193742 109087884 108917511 108631670 108440006 108430111 108500230 108553267
3757.9 108553267 108600163 108599246 108475149 108355749 108353078 108429635 108531463 108588076 108573163 108586740 108683133
3769.1 108683133 108737695 108631182 108480573 108407593 108397365 108401191 108411562 108462000 108548284 108601058 108551395
3780.3A08551395r1887j6117N3358M9413l767n3525m3714r30J919k6500j1659L7241
3792.6A08445227O7151R6178J41954J11139j9586l2949J32155K57111Q9979k04885
3802.7A09083474k05410m2307R4008J20199p0798k25759j53148l6025L0410R5356J69384
3814A08859384K16997J46520p4411j22380O2072K25413J62995j58334l19242j71542
3824.2A08827472n84N5098J3423m2403j6522P3671J25349N0008l1817K5809N7161L9971
3836.4A09176636J47354J28258p5245j13023r9599j00291n8710q7917j40834q2839
3846.6A08693790L6002J19841J74045K72990L99267L50297L0958l55970m46463k37143
3856.8A09037614j01006q3864q511J00493J28281O8176M9412M9329n7030q6581O1845
$$ plain form
3780.3 108551395 108459508 108443391 108496749 108546162 108542395 108488870 108445156 108444226 108446145 108419645 108407986 108445227
3792.6 108445227 108512378 108608556 108750510 108861649 108842063 108809114 108941269 109198380 109288359 109083474
3802.7 109083474 108878064 108835757 108929765 109049964 108979166 108753407 108600259 108564234 108594644 108690000 108859384
3814 108859384 109076381 109222901 109148490 109026110 109088182 109313595 109476590 109318256 108999014 108827472
3824.2 108827472 108826888 108881986 108895409 108853006 108836484 108910155 109035504 109085512 109053695 109079504 109136665 109176636
3836.4 109176636 109323990 109452248 109377003 109263980 109164381 109064090 109005380 108917463 108776629 108693790
3846.6 108693790 108729792 108849633 109023678 109296668 109695935 110046232 110077190 109721220 109274757 109037614
3856.8 109037614 108936608 108852744 108844233 108944726 109073007 109141183 109190595 109239924 109182894 109096313 109158158
3868A09158158J91808Q4662j57690j73652k2626K7633r1314j48607m2486P3397J32418
3879.2A09031701J04392n2762j24109k0170O3204N2035m1556j21284o3395M8566J10995
3890.5A08987617M4871j12081j49107o9499q058M2486J20401J85585J38986J9050l111
3901.7A09197140j0240n4086j04928j85644j84512j04332m7338l2688k1934l302Q976
3912.9A08457112L2187O5291Q3279N8890k2125o6746m0805l7742k4593L0995L7348
3924.1A08573091j6415n4574l6192R811K9933K3747K3150J1850l8493p8976o8844l9243
3936.3A08338845j0205J1099K4748L7455M4906K8372l0541o8546l4236K7215N1510
3947.6A08420622J9300q332j2076k3246k4808j6617p117J0025K1387K0456K3532L3116
$$ plain form
3868 109158158 109349966 109434628 109276938 109103286 109080660 109108293 109016979 108868372 108825886 108899283 109031701
3879.2 109031701 109136093 109083331 108959222 108939052 109002256 109054291 109012735 108891451 108828056 108876622 108987617
3890.5 108987617 109032488 108920407 108771300 108701801 108693743 108736229 108856630 109042215 109181201 109200251 109197140
3901.7 109197140 109186900 109132814 109027886 108842242 108657730 108553398 108506060 108473372 108451438 108448136 108457112
3912.9 108457112 108489299 108554590 108637869 108696759 108674634 108607888 108567083 108529341 108504748 108535743 108573091
3924.1 108573091 108556676 108502102 108465910 108475721 108505654 108529401 108552551 108564401 108525908 108446932 108378088 108338845
3936.3 108338845 108328640 108339739 108364487 108401942 108446848 108475220 108444679 108376133 108341897 108369112 108420622
3947.6 108420622 108439922 108431590 108419514 108396268 108371460 108354843 108347726 108357751 108379138 108399594 108423126 108456242
3959.8A08456242L7277L2520L445j9920p534K611Q237K0850K4653K1171J9705J6916
3972A08616173J2803J1433R024M017J800J5903K7370J2994J478M590m292r179k15j132
3986.3A08702767Q345K5713K2376J3709J3160K098j3613j538J7476J2457K873K909
3998.5A08808732
$$ plain form
3959.8 108456242 108493519 108526039 108529484 108509564 108502030 108504641 108512878 108533728 108558381 108579552 108599257 108616173
3972 108616173 108628976 108640409 108649433 108653450 108655250 108671153 108698523 108711517 108712995 108717585 108713293 108704114 108703899 108702767
3986.3 108702767 108711112 108736825 108759201 108772910 108786070 108788168 108774555 108773017 108790493 108802950 108805823 108808732
3998.5 108808732
##END=$$ End of the data block
