##TITLE=G4 - AA Schiff - Filme sobre cela de ZnSe - Filme 02 $$ Begin of the data block
##JCAMP-DX=5.00 $$ ACD/SpecManager v 10.08
##SPECTROMETER/DATA SYSTEM=Alpha
##DATE=09 Oct 2013 09:47:52
##DATA TYPE=INFRARED SPECTRUM
##DATA CLASS=XYDATA
##ORIGIN=
##OWNER=
##NPOINTS=3334
##FIRSTX=599.63525391
##LASTX=3998.58886719
##MAXX=3998.58886719
##MINX=599.63525391
##MAXY=1.13092554
##MINY=0.19140920
##XFACTOR=1.0000000000
##YFACTOR=0.000000010000000
##FIRSTY=0.84889328
##DELTAX=1.01978803
##XUNITS=1/CM
##YUNITS=ARBITRARY UNITS
##XYDATA=(X++(Y..Y))
599.6H4889328J5516o026o277l648j490R555L2395L7259K3085L1650M3720K8080j282
612.9H5091865j6069n883J1336J3131p8261j82950j34718n6982m7970l4625k9713o1160
625.1H4468001p4684l3361L1888O7604P0608P9786P3380M2808L2574J5187k4003k8712
637.4H4721076n48J3209O562l28K1637N2547K1523k6321n382K8646J0466l2741n9259
650.6H4751087l9321J282P951J079P498K2364L5339L1054K5469L5966L9559K1792j2088
663.9H4929031k420J55002O16777J276326j24383q63951m25220o8319P6646R4390Q1545
675.1H5745424Q3435Q3613O1572M0602N7859P7927N8865L5775L8516N2202M1855K8109
687.3H6405754L5793K9009J7303K0278J5032P284J7005L7337N5956P3326R3186J10227
$$ plain form
599.6 84889328 84904844 84898818 84892541 84888893 84887403 84896958 84929353 84966612 84989697 85021347 85065067 85093147 85091865
612.9 85091865 85075796 85069913 85081249 85094380 85016119 84833169 84698451 84641469 84593499 84558874 84529161 84468001
625.1 84468001 84393317 84359956 84391844 84459448 84530056 84609842 84683222 84726030 84758604 84773791 84749788 84721076
637.4 84721076 84720528 84733737 84740299 84739971 84761608 84814155 84835678 84809357 84803975 84832621 84843087 84810346 84751087
650.6 84751087 84711766 84713048 84720999 84722078 84729576 84751940 84787279 84818333 84843802 84879768 84919327 84941119 84929031
663.9 84929031 84926611 85081613 85698390 86974716 86850333 85986382 85561162 85492843 85569489 85663879 85745424
675.1 85745424 85828859 85912472 85974044 86014646 86072505 86150432 86209297 86245072 86283588 86335790 86377645 86405754
687.3 86405754 86441547 86470556 86487859 86508137 86523169 86530453 86547458 86584795 86640751 86714077 86807263 86917490
699.6H6917490J07348J09112J36739J40488J12218R6321R0343P0887P6437J06866Q8441
710.8H8052690N6917N7899M0305Q178m017j4294o449M8894L0225j31327k35009k25675
723H7678337k59417l64244n00155o85292r28688j217663j541693j874834k147758k282625
733.2G5875968k233100j986534j564502j017511m44490O9475N00256Q17049R73147
742.4G0989758R42087P14344L09199k14338p83706j322609j744187j973188k002400
751.6F4914960j866120j590532j246560r02134n51349j99247J11133L72225O11240
760.8E9653616Q15296R64350J085943J194614J275772J320028J329386J309854J261210
769.9G0210069J178897J058042Q97491P33709O01471M91380M12584L85022M32646N63526
$$ plain form
699.6 86917490 87024838 87133950 87270689 87411177 87523395 87619716 87710059 87780946 87857383 87964249 88052690
710.8 88052690 88109607 88167506 88207811 88215989 88211972 88197678 88191229 88240123 88270348 88139021 87904012 87678337
723 87678337 87418920 87054676 86554521 85869229 84940541 83722878 82181185 80306351 78158593 75875968
733.2 75875968 73642868 71656334 70091832 69074321 68629831 68699306 69199562 70016611 70989758
742.4 70989758 71931845 72646189 72955388 72741050 71957344 70634735 68890548 66917360 64914960
751.6 64914960 63048840 61458308 60211748 59309614 58758265 58559018 58670151 59042376 59653616
760.8 59653616 60468912 61433262 62519205 63713819 64989591 66309619 67639005 68948859 70210069
769.9 70210069 71388966 72447008 73344499 74078208 74679679 75171059 75583643 75968665 76401311 76964837
780.1G6964837P26223Q69149R70924J019019J018071R93741R46754Q66032P72053O82276
790.3H5829079N79000M70787M00239L48300K90853K54774K36910K09582J83451J73897
800.5H8976872J61129J41919J43343J67388J77765J59084J42396J51277J65176J62047
810.7I0548396J43105J14971R9725R6232P1668M3577M4507L9071R65l1507m0501l6997
823I1093212k5844k1017k0963k2083l2944m4912n3251n5647m9173m8578o8122r9242
835.2I0551436j10126j05929j34659j89560k32196k75177l28213l82251m42171m87458
845.4H7863696m94987m74531m43595l87585l00485k24102j55967p0930M369N1785R1850
856.6H5459518J32227J52469J45423J35261J46401J68985J82718J92637K08014K24477
$$ plain form
780.1 76964837 77691060 78560209 79531133 80550152 81568223 82561964 83508718 84374750 85146803 85829079
790.3 85829079 86408079 86878866 87279105 87627405 87918258 88173032 88409942 88619524 88802975 88976872
800.5 88976872 89138001 89279920 89423263 89590651 89768416 89927500 90069896 90221173 90386349 90548396
810.7 90548396 90691501 90806472 90906197 91002429 91074097 91117674 91162181 91201252 91202217 91170710 91130209 91093212
823 91093212 91067368 91046351 91025388 91003305 90970361 90925449 90872198 90816551 90767378 90718800 90650678 90551436
835.2 90551436 90441310 90335381 90200722 90011162 89778966 89503789 89175576 88793325 88351154 87863696
845.4 87863696 87368709 86894178 86450583 86062998 85762513 85538411 85382444 85311514 85315883 85367668 85459518
856.6 85459518 85591745 85744214 85889637 86024898 86171299 86340284 86523002 86715639 86923653 87148130
866.8H7148130K47180K67345K63173K52610K40177K05016J67489J44947J19054P8762
877H9133883K9230k545M369J2308j1504k6554j4835k2716n4740q6266j23167j65284
889.3H8672179k10035k70420l26252l45934l51798l87883m63009n69982p04330q01962
899.4H4240574p85178o51366m24254j38175J50025L95447N67901O52820O60330O08283
909.6H5276407N24706M27353L16000K20466J73360J65027J74570K02775K56694L25971
919.8H8063329L88802M35072M81492N35011N67353N58174N28156N03779M81033M54641
930I2996842M23568L81816L38506K96647K56794K30223K10589J88649J73134J68669
940.2I5665437J69486J75059J76674J76394J85632J88441J88618K03598K16734K01989
$$ plain form
866.8 87148130 87395310 87662655 87925828 88178438 88418615 88623631 88791120 88936067 89055121 89133883
877 89133883 89163113 89160568 89164937 89177245 89165741 89139187 89124352 89101636 89046896 88960630 88837463 88672179
889.3 88672179 88462144 88191724 87865472 87519538 87167740 86779857 86316848 85746866 85042536 84240574
899.4 84240574 83455396 82804030 82379776 82241601 82391626 82787073 83354974 84007794 84668124 85276407
909.6 85276407 85801113 86228466 86544466 86764932 86938292 87103319 87277889 87480664 87737358 88063329
919.8 88063329 88452131 88887203 89368695 89903706 90471059 91029233 91557389 92061168 92542201 92996842
930 92996842 93420410 93802226 94140732 94437379 94694173 94924396 95134985 95323634 95496768 95665437
940.2 95665437 95834923 96009982 96186656 96363050 96548682 96737123 96925741 97129339 97346073 97548062
950.4I7548062J68126J48350J34528J11675Q9467P0870N9956M3142J2815M89j484k3926
962.7I8362070n2237q1909j14101j38676j66643j99550k23136k32214k23273k03145
972.9I6727186j87444j68842j33294r1487o0124l2776L16K8169M5168O0684P2884P2617
985.1I6333057O6137O0189M6867K5844Q727r90j3494m0371p0357r2578j10125j19138
997.3I6093768j26588j44661j70827j94216k20251k53176k81763l09051l42661l87126
1007.5I3663448m36276m80515n31852n94610o53994p03645p44843p61968p26968o30105
1017.7H7398672m80056k99900j16742N4818J99414K88432K98471K49302J73509Q6403
1027.9H7852323J4877j3911J1027O8694J04284Q4543K0028n1445r5719j11562j06669
$$ plain form
950.4 97548062 97716188 97864538 97999066 98110741 98200208 98271078 98331034 98374176 98386991 98387480 98385996 98362070
962.7 98362070 98309833 98227924 98113823 97975147 97808504 97608954 97385818 97153604 96930331 96727186
972.9 96727186 96539742 96370900 96237606 96146119 96085995 96053219 96053535 96081704 96126872 96187556 96260440 96333057
985.1 96333057 96399194 96459383 96506250 96532094 96540821 96539831 96526337 96485966 96415609 96323031 96212906 96093768
997.3 96093768 95967180 95822519 95651692 95457476 95237225 94984049 94702286 94393235 94050574 93663448
1007.5 93663448 93227172 92746657 92214805 91620195 90966201 90262556 89517713 88755745 88028777 87398672
1017.7 87398672 86918616 86618716 86501974 86556792 86756206 87044638 87343109 87592411 87765920 87852323
1027.9 87852323 87867200 87853289 87864316 87933010 88037294 88121837 88141865 88090420 87994701 87883139 87776470
1039.2H7776470q4758m9156q732J7315L5048N6720P7420J02163J35499J71274J99985
1050.4H8429248K24585K56663K91372L09652L03048K90381K85095K84529K89113L03381
1060.6I1267067L22002L27641L24458L16316K90370K36684J56301O0529l6693j22207
1070.8I3142468j85848k15411k17193k09719j96946j63626j09619p1287n9355m5955
1081I1667509k7740k5260l8159n7298q5062j16009j45334j83081k27696k68364l02720
1092.2I0190786l37720l77399m22543m75561n32824n89478o32340o60396o76804o72776
1102.4H4812945o44147n88417n14645m32980l40038k42567j65064j13123p0673l2926
1112.6H1668365o622J6993M2200N2929N1242L6180l266m9400q0860q1229m4906P659
$$ plain form
1039.2 87776470 87691712 87642556 87633824 87651139 87686187 87742907 87820327 87922490 88057989 88229263 88429248
1050.4 88429248 88653833 88910496 89201868 89511520 89814568 90104949 90390044 90674573 90963686 91267067
1060.6 91267067 91589069 91916710 92241168 92557484 92847854 93084538 93240839 93301368 93264675 93142468
1070.8 93142468 92956620 92741209 92524016 92314297 92117351 91953725 91844106 91772819 91713464 91667509
1081 91667509 91639769 91614509 91576350 91519052 91433990 91317981 91172647 90989566 90761870 90493506 90190786
1092.2 90190786 89853066 89475667 89053124 88577563 88044739 87455261 86822921 86162525 85485721 84812945
1102.4 84812945 84168798 83580381 83065736 82632756 82292718 82050151 81885087 81771964 81701291 81668365
1112.6 81668365 81661743 81678736 81720936 81773865 81825107 81861287 81858021 81808621 81727761 81646532 81601626 81609285
1124.8H1609285P1519J31059J49161J28025R7847P3629N3871M1389L2974K5695K2030
1136H2436484J3852k926j7631k8861o0815j42502k86478m83710p27242r90438j188958
1147.3G8520775j238251j104003p97498l77602P3833N00285Q74549J186073J423162
1156.4G9061323J576782J661199J673424J595265J443446J253354J046747Q33029O30581
1165.6I0775150M61847L28016K16448J26636O3414J5551k5303o0087r8294j41579j78886
1176.8I1482913k19631k69103l18807l72666m25053m72832n28431n98925o83933p81060
1187H6812472q78501r73838j066643j129139j138353j098675j005280q46904o46341
1196.2G8028798m39745k45172o8015P9704J85293K38925K37900J99258J35261N0926
$$ plain form
1124.8 81609285 81680804 81811863 81961024 82089049 82186896 82260525 82314396 82355785 82388759 82414454 82436484
1136 82436484 82450336 82447410 82429779 82400918 82340103 82197601 81911123 81427413 80700171 79709733 78520775
1147.3 78520775 77282524 76178521 75381023 75003421 75077254 75577539 76452088 77638161 79061323
1156.4 79061323 80638105 82299304 83972728 85567993 87011439 88264793 89311540 90144569 90775150
1165.6 90775150 91236997 91565013 91781461 91908097 91971511 91987062 91961759 91901672 91803378 91661799 91482913
1176.8 91482913 91263282 90994179 90675372 90302706 89877653 89404821 88876390 88277465 87593532 86812472
1187 86812472 85933971 84960133 83893490 82764351 81625998 80527323 79522043 78675139 78028798
1196.2 78028798 77589053 77343881 77275866 77355570 77540863 77779788 78017688 78216946 78352207 78403133
1206.4G8403133m0138j32870k31713l22086l97158m72593n40823n88953o24299o37061
1216.6G4415439o12431n59557m84925l93552k93100j80262o0231M7720J38950K27279
1226.8G2245330L11762L74853M19587M57144M82130M96286N10228N22870N29223N34904
1237G6884317N42760N48220N43779N27668N03016M67366M21857L67803L04317K30074
1247.2H1341177J46651N8532l0535j24705k27529l38435m58920n85860p08073q06171
1257.4G8266132q65090q74901q36164p42083n96989m29862k69056j42437p0071n2399
1267.6G3387080q4406j66481k78414m02838n24580o11508o48356o20466n11515l29131
1277.8F9209385r6297J61492M15457O32059P86656Q70872Q88532Q55363P85953O80881
$$ plain form
1206.4 78403133 78362995 78230125 77998412 77676326 77279168 76806575 76265752 75676799 75052500 74415439
1216.6 74415439 73803008 73243451 72758526 72364974 72071874 71891612 71831381 71879101 72018051 72245330
1226.8 72245330 72557092 72931945 73351532 73808676 74290806 74787092 75297320 75820190 76349413 76884317
1237 76884317 77427077 77975297 78519076 79046744 79549760 80017126 80438983 80806786 81111103 81341177
1247.2 81341177 81487828 81546360 81515825 81391120 81163591 80825156 80366236 79780376 79072303 78266132
1257.4 78266132 77401042 76526141 75689977 74947894 74350905 73921043 73651987 73509550 73439479 73387080
1267.6 73387080 73302674 73136193 72857779 72454941 71930361 71318853 70670497 70050031 69538516 69209385
1277.8 69209385 69113088 69274580 69690037 70322096 71108752 71979624 72868156 73723519 74509472 75190353
1288G5190353N52327M33910L32498K31278J25760J5795r4282k07085l27110m36783
1298.2G5816661n12093n62889n99950o11222n98061n63926n01787m16118l25191k36434
1308.4G0888990j50740o6060J0657O2615R1332J28222J91319K68370L48902M15557
1318.6G2189164M54497M84199N26577N54210N50240N28562M99946M68576M29338L85708
1328.8G7071017L33834K76261K10703J45310Q8382L9172j2553p8934j47277k34461
1339G7691454l83562n42909o10912o38109o95783p80326q70246r59033j049733j146406
1349.2G0014435j235932j288128j305211j285618j243651j174271j035780q33404n97453
1358.3F0014987l26490m6748J87283L34692L59488L30245L74705M58652N16718N35876
$$ plain form
1288 75190353 75742680 76176590 76509088 76740366 76866126 76881921 76787639 76580554 76253444 75816661
1298.2 75816661 75304568 74741679 74141729 73530507 72932446 72368520 71866733 71450615 71125424 70888990
1308.4 70888990 70738250 70672190 70682847 70745462 70836794 70965016 71156335 71424705 71773607 72189164
1318.6 72189164 72643661 73127860 73654437 74208647 74758887 75287449 75787395 76255971 76685309 77071017
1328.8 77071017 77404851 77681112 77891815 78037125 78125507 78164679 78152126 78073192 77925915 77691454
1339 77691454 77307892 76764983 76154071 75515962 74820179 74039853 73169607 72210574 71160841 70014435
1349.2 70014435 68778503 67490375 66185164 64899546 63655895 62481624 61445844 60612440 60014987
1358.3 60014987 59688497 59641749 59829032 60163724 60523212 60853457 61228162 61686814 62203532 62739408
1368.5F2739408N04941M66525M40955L82001K07376j22875m30888n90110o94793p99418
1378.7F2103122q53258q38345p71719o71322n47504l87108k04325j13356j57184j51711
1388.9E7407290n3513J6039N6070J16045J22463l2323j87779j82634j60742k86812
1399.1E6814104m48709m62300m25321l92914m10223n27745n96488n50753m98247m63730
1409.3E2037674m17495l57806k74176j52748J2004K12180M45295O85888R55910J195466
1419.5E4342192J144576J222021J590663J911277J937544J815480J798362J776200
1427.7F7538315J696789J563889J240754R06188P41016N97930N16814M76987J2213
1436.9G5290895o01691p00480p22206q74150j059979j248085j407302j512247j518732
$$ plain form
1368.5 62739408 63244349 63710874 64151829 64533830 64741206 64618331 64187443 63597333 62902540 62103122
1378.7 62103122 61249864 60411519 59639800 58968478 58420974 58033866 57829541 57716185 57559001 57407290
1388.9 57407290 57353777 57369816 57425886 57541931 57664394 57632071 57444292 57261658 57100916 56814104
1399.1 56814104 56365395 55903095 55477774 55084860 54674637 54146892 53550404 52999651 52501404 52037674
1409.3 52037674 51620179 51262373 50988197 50835449 50847453 51059633 51504928 52190816 53146726 54342192
1419.5 54342192 55486768 56708789 58299452 60210729 62148273 63963753 65762115 67538315
1427.7 67538315 69235104 70798993 72039747 72945935 73686951 74284881 74801695 75278682 75290895
1436.9 75290895 74689204 73988724 73266518 72392368 71332389 70084304 68677002 67164755 65646023
1446F5646023j565755j813501j877743j693815j599222j558042j355386r56946n21660
1455.2E2703953k03943p7814J3256J36858K60586L61883M23563M73261N20062M71437
1465.4E5083102M27717N54454O71488O69092O34694N67955K27904k79444l98403l60293
1475.6E7798266n17904o37067n77694n15616n19883n75150n86521n34201m36514k98977
1485.8E2598739j96272r8098R6083K74956K88129L21060N13745P39890R24921J077998
1496E6541151R87261Q40599Q58265P79241P51931Q02236P94048Q60035J074249J051151
1506.2F5340167K35457l91430n03087n07689n24962o98232q59094q39263q11309r81694
1516.4E9458864j407326j393532j017058j052022j491678j503307j063519o87093m71827
$$ plain form
1446 65646023 64080268 62266767 60389024 58695209 57095987 55537945 54182559 53225613 52703953
1455.2 52703953 52500010 52422196 52435452 52572310 52832896 53194779 53618342 54091603 54611665 55083102
1465.4 55083102 55510819 56065273 56736761 57405853 58040547 58608502 58836406 58556962 58158559 57798266
1475.6 57798266 57280362 56643295 56065601 55549985 55030102 54454952 53868431 53334230 52897716 52598739
1485.8 52598739 52402467 52304369 52400452 52675408 52963537 53284597 53798342 54538232 55463153 56541151
1496 56541151 57528412 58369011 59227276 60006517 60758448 61560684 62354732 63214767 64289016 65340167
1506.2 65340167 65575624 65184194 64681107 64173418 63648456 62950224 62091130 61251867 60440558 59458864
1516.4 59458864 58051538 56658006 55640948 54588926 53097248 51593941 50530422 49843329 49371502
1525.6D9371502j98192J88482N62158R23664J339084J780206K204048K479887K099407
1534.8F0750246J684755J655877J736414J924318J549882N67949J60938j6141p9333
1543.9F9934905j78343l90178m19510k82204k25234m11087o11645n25272l69823n30464
1554.1F5991145p29227m50408j08141k15781j076114j801997j504600j050622r12415
1563.3E8141840r76265j153970j163518r85056r00728j222306j528669j331177j175436
1572.5D7704715j072512r17071j087403j557308j369846j095513j067933j026055r63945
1581.7C7547129q98331q34131p60526p03555o52063o07285n54740n19517m83257m42344
1591.9C1091380m10691l87618l82840l74514l68226l61502l73203l87516m19891m61432
$$ plain form
1525.6 49371502 49173310 49361792 49923950 50847614 52186698 53966904 56170952 58650839 60750246
1534.8 60750246 62435001 64090878 65827292 67751610 69301492 69869441 70030379 70014238 69934905
1543.9 69934905 69756562 69366384 68946874 68664670 68439436 68028349 67416704 66891432 66521609 65991145
1554.1 65991145 65261918 64811510 64703369 64487588 63411474 61609477 60104877 59054255 58141840
1563.3 58141840 57165575 56011605 54848087 53863031 52962303 51739997 50211328 48880151 47704715
1572.5 47704715 46632203 45715132 44627729 43070421 41700575 40605062 39537129 38511074 37547129
1581.7 37547129 36648798 35814667 35054141 34350586 33698523 33091238 32536498 32016981 31533724 31091380
1591.9 31091380 30680689 30293071 29910231 29535717 29167491 28805989 28432786 28045270 27625379 27163947
1602.1B7163947n11548n60990n88849o02960n89101n31770m29828k90966j06274P3153
1612.3B3024814K30697L49184M02201M30901L88603K11926Q6039K3779n3367j85863
1622.5B4908914m15010n55393n51180n69301o49079o69194n79227m97741m13128l00657
1632.7A9709004j82673j57298j51691p6422J240R1320K04156L40370M85842O37848
1642.9B0901696P61497R27250J270606J535399J525355J541480J556236J602441K044946
1652C3666906L216502K831980J753423J705134J931721K078023K058354K005911J955593
1661.2E3203547K002972J889712J501107J345504J414531J469243J577407J576471
1669.4F5980494J199609R63628R33850R84532J210290J233572P33280N98520Q17400
$$ plain form
1602.1 27163947 26652399 26091409 25502560 24899600 24310499 23778729 23348901 23057935 22951661 23024814
1612.3 23024814 23255511 23604695 24006896 24437797 24826400 25038326 25124365 25148144 25094777 24908914
1622.5 24908914 24493904 23938511 23387331 22818030 22168951 21499757 20920530 20422789 20009661 19709004
1632.7 19709004 19526331 19369033 19217342 19140920 19142160 19233480 19437636 19778006 20263848 20901696
1642.9 20901696 21663193 22590443 23861049 25396448 26921803 28463283 30019519 31621960 33666906
1652 33666906 36883408 39715388 41468811 43173945 45105666 47183689 49242043 51247954 53203547
1661.2 53203547 55206519 57096231 58597338 59942842 61357373 62826616 64404023 65980494
1669.4 65980494 67180103 68143731 69077581 70062113 71272403 72505975 73239255 73837775 74655175
1678.6G4655175R65458R31955R04047J146186J435190R69940J41413J92081N31584
1687.7H1873029O90186O24455N23024M92382N65923P32535R92697R80401L26163K20179
1697.9H8020974P40648J216846L01069l94386N4622N06359N97489M33058K17545J63948
1708.1I1858172L30973M30805L84646M22961N99199P18445N93817N11420O58011L50589
1718.3I6859038k34532j90694J08332K91872L05056K21789J86616K19059K64293L49683
1728.5I8380512M00716K62606K28012N50204Q05694J33121n24843k94363J07777L96550
1738.7A00445986L54731k3615o8164J53100J37878K7120J13463K59626K91634J81353
1748.9A01873112J37257J35136j39475k91932r9110J31905K65002J47855q3196n4109
$$ plain form
1678.6 74655175 75620633 76552588 77456635 78602821 80038011 81007951 81149364 81341445 81873029
1687.7 81873029 82563215 83187670 83710694 84203076 84768999 85501534 86494231 87474632 87800795 88020974
1697.9 88020974 88761622 89978468 90279537 89885151 89939773 90446132 91043621 91476679 91694224 91858172
1708.1 91858172 92189145 92619950 93004596 93427557 94026756 94745201 95339018 95850438 96508449 96859038
1718.3 96859038 96624506 96433812 96542144 96834016 97139072 97360861 97547477 97766536 98030829 98380512
1728.5 98380512 98781228 99043834 99271846 99822050 100627744 100760865 100236022 99941659 100049436 100445986
1738.7 100445986 100800717 100777102 100708938 100862038 100999916 101027036 101140499 101400125 101691759 101873112
1748.9 101873112 102010369 102145505 102006030 101714098 101614988 101746893 102011895 102159750 102076554 102022445
1759.1A02022445J65332L17466J01149k12634j63185J0168J44983K63273J71614j0121
1769.3A02810490J61982M17936J86038l25871l42274j24943q0740p8845K3985J21438
1779.5A02769196Q0097q3149j11401L1769Q7262m5503j22833m6479N9723J78624K92623
1790.7A03089929K82383j765k96318k03502k0564L34N0139J78194J53840K4485k4986
1802A03232169o4099o5326M303O2311Q3923P7832J02341J40369N6899o7389p3529k1362
1814.2A03468442K4831N8329N3096M530j7381P141L3689N9843J26481K12228R3436
1825.4A04124665j38461o2144K16102K75422o5136k90144j59025j7941J7083M7445
1835.6A03947866O7699K3794k2292j788N0986J29020K80952L40128j9753l06010j54304
$$ plain form
1759.1 102022445 102187777 102505243 102606392 102393758 102230573 102240741 102385724 102648997 102820611 102810490
1769.3 102810490 102972472 103390408 103576446 103250575 102908301 102783358 102702618 102623773 102647758 102769196
1779.5 102769196 102849293 102766144 102654743 102686512 102773774 102728271 102605438 102558959 102618682 102797306 103089929
1790.7 103089929 103372312 103370547 103074229 102870727 102850163 102850497 102900636 103078830 103232670 103257155 103232169
1802 103232169 103168070 103102744 103107047 103169358 103253281 103331113 103433454 103573823 103630722 103563333 103489804 103468442
1814.2 103468442 103493273 103551602 103604698 103609228 103591847 103598988 103632677 103692520 103819001 104031229 104124665
1825.4 104124665 103986204 103924060 104140162 104415584 104350448 104060304 103901279 103883338 103900421 103947866
1835.6 103947866 104015565 104039359 104017067 104015279 104066265 104195285 104476237 104816365 104796612 104490602 104336298
1846.8A04336298j7798m9270o4015j7858J6499J9824Q524K003J3435L0601K5844l34
1859.1A04303753q475k63o389j2434J2207O6149J31727J88756J80554j275k32411k30384
1871.3A04391515r6643j9049L22K896L004M757N626K230m29M875J7262K8312K2435
1884.6A04367113J788m41N5218J30784O6877r8920j16563k2960M3869M1724l0685p0798
1896.8A04367006l5787l934n388r644j502O270L803o187k694K1243L8648L1471o390
1910A04396915n0902m4787o294J2720K6488R0217J63937O3455j19579r3782M9687R9969
1922.3A04588044K134r6810p0966j4090K587N185K241O68L552L94q393r655m709o426
1936.6A04393756j4305j2231J2315P0250J22201L9435j02032r0623j6367q202j7344
$$ plain form
1846.8 104336298 104318500 104269230 104205215 104187357 104203856 104223680 104232204 104234207 104247642 104278243 104304087 104303753
1859.1 104303753 104295278 104295015 104288626 104276192 104288399 104354548 104486275 104675031 104855585 104854310 104621899 104391515
1871.3 104391515 104294872 104275823 104276145 104279041 104282045 104286802 104292428 104294658 104294229 104299104 104316366 104344678 104367113
1884.6 104367113 104368901 104368460 104423678 104554462 104621339 104522419 104405856 104382896 104426765 104468489 104437804 104367006
1896.8 104367006 104331219 104327285 104321897 104312253 104310751 104317021 104320824 104314637 104311943 104333186 104371834 104403305 104396915
1910 104396915 104346013 104301226 104294932 104307652 104334140 104424357 104588294 104651749 104532170 104438388 104488075 104588044
1922.3 104588044 104590178 104493368 104422402 104408312 104410899 104416084 104418325 104418993 104422545 104422939 104414546 104404891 104400182 104393756
1936.6 104393756 104379451 104367220 104379535 104449785 104571986 104611421 104509389 104418766 104402399 104394197 104376853
1947.8A04376853m519R585J3494J3209K2232L4786L1614K2912K6357K7704K3425K8336
1960A04625988L1483K6083K4879L5238N7233P3790M6409j0813k6548K4K0230K4784
1972.3A04928780K3830J9216J3685J3995J7131J6510K0194K3663J6106Q499O879O497
1984.5A05114985Q213J7715K4485J0014Q785N5552O4647k2006p9942n0568j4162J144
1996.7A05138862O104k098j2303j2016n818l278k432j692m781o735m017n639j2338
2010A05071819j0276o843j1479p701J4245K9874M899l3021m0292k5201q547r013k1696
2023.2A04946768k1565j1122r107j1921j2803j4818j3507j1599j6141j9085j4901j2684
2035.5A04777515j1575o748m601j216J681j2040k2590j1254o473j1468q785m650p105
$$ plain form
1947.8 104376853 104372334 104381919 104395413 104408622 104430854 104465640 104497254 104520166 104546523 104574227 104597652 104625988
1960 104625988 104657471 104683554 104708433 104743671 104800904 104874694 104921103 104910290 104883742 104883766 104903996 104928780
1972.3 104928780 104952610 104971826 104985511 104999506 105016637 105033147 105053341 105077004 105093110 105101609 105108488 105114985
1984.5 105114985 105123198 105140913 105165398 105175412 105184197 105239749 105304396 105282390 105202448 105151880 105137718 105138862
1996.7 105138862 105144966 105142868 105130565 105118549 105112731 105109453 105107021 105105329 105100548 105093813 105089796 105084157 105071819
2010 105071819 105061543 105054700 105043221 105035520 105049765 105079639 105084538 105051517 105011225 104986024 104977477 104968464 104946768
2023.2 104946768 104925203 104914081 104904974 104893053 104880250 104865432 104851925 104840326 104824185 104805100 104790199 104777515
2035.5 104777515 104765940 104759192 104754591 104753375 104755056 104743016 104720426 104709172 104702699 104691231 104682446 104677796 104670691
2048.7A04670691r989p367p332q082r394j6522j6368r322o831n555q833j5283j0800
2062A04539013K241J1468K730k2733l2938j9908j1897j3614j2433o688l028q332j1635
2075.3A04412246q178j2028j8859j9968j9061j6988j6975j9145j9372j9168j9074j6355
2087.5A04207075k0266k9194k4426j3423j2684k2328k5964j5390p415j1944j9419k1995
2099.7A03982627k1731j8502j6570j5533j1360r847j1993j5330j6045j0944o223o663
2112A03821886q560j1837j7071j5843j0073j1039j3113j0955q333n555p474j3984j5855
2125.2A03672194r703m971r072j3280j1444j0467j2087j0062n567p510j6832k0635
2137.5A03540564j1945j633q83m959q213j1909j3173q058r42k194q845q631l159j216
$$ plain form
2048.7 104670691 104660702 104653335 104646003 104637921 104628527 104612005 104595637 104586315 104579484 104573929 104565096 104549813 104539013
2062 104539013 104541254 104552722 104555452 104532719 104499781 104479873 104467976 104454362 104441929 104435241 104432213 104423881 104412246
2075.3 104412246 104404068 104392040 104373181 104353213 104334152 104317164 104300189 104281044 104261672 104242504 104223430 104207075
2087.5 104207075 104186809 104157615 104133189 104119766 104107082 104084754 104058790 104043400 104035985 104024041 104004622 103982627
2099.7 103982627 103960896 103942394 103925824 103910291 103898931 103889084 103877091 103861761 103845716 103834772 103828549 103821886
2112 103821886 103813326 103801489 103784418 103768575 103758502 103747463 103734350 103723395 103715062 103709507 103702033 103688049 103672194
2125.2 103672194 103662491 103657520 103648448 103635168 103623724 103613257 103601170 103591108 103585541 103578031 103561199 103540564
2137.5 103540564 103528619 103526986 103526103 103521144 103512931 103501022 103487849 103479791 103478849 103476655 103467810 103459179 103456020 103454804
2151.7A03454804j835l302o676q476q380m435K372K51p987r275p915j1027j4448j3078
2166A03360593n996l469o688o520r716j7333j6653n699Q71n210j5247j8263j0883j598
2180.3A03238189O92n389q869j514L040m232p927p75N448L147o175r382o115o104n948
2195.6A03188086n258o043p725p355n329p177j1575j2004q214o139p808j0157j3041
2208.8A03080261j4496q297l612o712p653j0931j5199j4484j5390j4568j3470j6415
2221.1A02939034j9372j8597j2540n651m375q428j6427k5606k1339j0609j2899k0337
2233.3A02762854k1827j8883j1933j0073j5819j1170j752m900j3339j2648n269K801
2245.6A02638042P856L290l016n794n590J668Q107M816K98P75K741K277j752n925q416
$$ plain form
2151.7 103454804 103452969 103449667 103442991 103434515 103426135 103421700 103424072 103424323 103416336 103407061 103399146 103388119 103373671 103360593
2166 103360593 103354597 103351128 103344440 103337920 103328204 103310871 103294218 103288519 103289390 103284180 103268933 103250670 103239787 103238189
2180.3 103238189 103238881 103233492 103224623 103223109 103226149 103221917 103213990 103213215 103218663 103221810 103215635 103206253 103200138 103194034 103188086
2195.6 103188086 103182828 103176785 103169060 103161705 103156376 103149199 103137624 103125620 103117406 103111267 103103459 103093302 103080261
2208.8 103080261 103065765 103057468 103053856 103047144 103039491 103028560 103013361 102998877 102983487 102968919 102955449 102939034
2221.1 102939034 102919662 102901065 102888525 102882874 102878499 102870071 102853644 102828038 102806699 102796090 102783191 102762854
2233.3 102762854 102741027 102722144 102710211 102700138 102684319 102673149 102671397 102666497 102653158 102640510 102635241 102638042
2245.6 102638042 102645898 102649188 102646172 102640378 102634788 102636456 102644563 102649379 102649677 102650452 102653193 102655470 102653718 102647793 102639377
2260.8A02639377l564L552P2m614j824K4l242p451l838K14l266n150m888p641j0776
2276.1A02586985q774o581q654j3888j8501j7298r870M840K0790K6250K5809K8991
2288.4A02610099K8897K6297K3425K4378L4762M5037M2307K6059J8096K6596L9196
2299.6A02945149L9422K8873K6655M0281O2489Q3316J03593J07074Q7070P6580Q6677
2310.8A03687179P9763M9961L2889M5538Q3232J27554J72675K01690K02847J87063
2321A04870391J51431R7049N0962M6980R2518J39070J39356J33955J18661O4242O950
2332.2A05911565k2900j91P0906R5224L6752K0314M5168M7672K7275k0516q5151k02680
2344.5A05923438l95000n63323n43511k46811J81854M74429N09011M44723M23216M15314
$$ plain form
2260.8 102639377 102635813 102639365 102639437 102634823 102632999 102633023 102629781 102622330 102618492 102618706 102615440 102610290 102605402 102597761 102586985
2276.1 102586985 102578211 102571630 102562976 102549088 102530587 102513289 102503419 102508259 102529049 102555299 102581108 102610099
2288.4 102610099 102638996 102665293 102688718 102713096 102747858 102792895 102835202 102861261 102879357 102905953 102945149
2299.6 102945149 102984571 103013444 103040099 103080380 103142869 103226185 103329778 103436852 103523922 103600502 103687179
2310.8 103687179 103766942 103816903 103849792 103895330 103978562 104106116 104278791 104480481 104683328 104870391
2321 104870391 105021822 105118871 105169833 105216813 105309331 105448401 105587757 105721712 105840373 105904615 105911565
2332.2 105911565 105888665 105888474 105959380 106054604 106091356 106111670 106156838 106204510 106231785 106211269 106126118 105923438
2344.5 105923438 105528438 104965115 104421604 104174793 104356647 104831076 105340087 105784810 106208026 106623340
2354.7A06623340L68464K95925K22575J27972L2234n2953j36256j83535j92737k31719
2364.9A06873310k96259l33190l50869l75676l97766m10974m03273l70288l43180l28004
2375.1A03263831l09479k92802k81823k77423k78318k60592k16210j71780j43981j22202
2385.3A00909221r2590o1345m0734k6166j4806j3900j7070j5498j4233j4842j1706
2396.5A00586331q357j1575j9479k5022k2936k2626k7608k2757j4663j9646k6619k5928
2408.7A00339115k5964l1555l2055k3687k1708k4057k4938k7907k2161j4317j8454
2419.9A00072312k4509k4605k5344k9951l4255k9480j7786j8901l1286l5531l1465
2431.2I9769199k5463k2948k9778l8511l8558l2354k9105l3223l5191k7269k4229l3808
$$ plain form
2354.7 106623340 106991804 107287729 107510304 107638276 107670510 107617557 107481301 107297766 107105029 106873310
2364.9 106873310 106577051 106243861 105892992 105517316 105119550 104708576 104305303 103935015 103591835 103263831
2375.1 103263831 102954352 102661550 102379727 102102304 101823986 101563394 101347184 101175404 101031423 100909221
2385.3 100909221 100816631 100755286 100714552 100688386 100673580 100659680 100642610 100627112 100612879 100598037 100586331
2396.5 100586331 100577974 100566399 100546920 100521898 100498962 100476336 100448728 100425971 100411308 100391662 100365043 100339115
2408.7 100339115 100313151 100281596 100249541 100225854 100204146 100180089 100155151 100127244 100105083 100090766 100072312
2419.9 100072312 100047803 100023198 99997854 99967903 99933648 99904168 99886382 99867481 99836195 99800664 99769199
2431.2 99769199 99743736 99720788 99691010 99652499 99613941 99581587 99552482 99519259 99484068 99456799 99432570 99398762
2443.4I9398762l9840l6490l3128l2598l3778l9255m3947l7992l1704l8176m5318m1628
2455.6I8944908l7938l9792l9554l9988m5395m4555l4988l5518m4525m4447l7521l7801
2467.9I8462886m5967m7958m8226m6969l7813l6878m4119n0759n0980m2063l8302m1586
2480.1I7931266m6283m7600m0198l5059l7420m2784m7821m5568l9750l9983m4340m3243
2492.3I7421217l6341l5733m3875m8530m6772m3481l9912l6984l5012m0013n0240n2161
2504.6I6912163m8345m4864l7074l1829l3081l3295l6883m1956l9399l6978l9345l4601
2516.8I6454513k5737k5028l1048l8350l7801l1245l2145l8236m0841m3404m1914l3331
2529.1I6035433l6264n0294n2005m3178l5864l2341l8386m5061l8630k7579k4783k7913
$$ plain form
2443.4 99398762 99358922 99322432 99289304 99256706 99222928 99183673 99139726 99101734 99070030 99031854 98986536 98944908
2455.6 98944908 98906970 98867178 98827624 98787636 98742241 98697686 98662698 98627180 98582655 98538208 98500687 98462886
2467.9 98462886 98416919 98368961 98320735 98273766 98235953 98199075 98154956 98104197 98053217 98011154 97972852 97931266
2480.1 97931266 97884983 97837383 97797185 97762126 97724706 97681922 97634101 97588533 97548783 97508800 97464460 97421217
2492.3 97421217 97384876 97349143 97305268 97256738 97209966 97166485 97126573 97089589 97054577 97014564 96964324 96912163
2504.6 96912163 96863818 96818954 96781880 96750051 96716970 96683675 96646792 96604836 96565437 96528459 96489114 96454513
2516.8 96454513 96428776 96403748 96372700 96334350 96296549 96265304 96233159 96194923 96154082 96110678 96068764 96035433
2529.1 96035433 95999169 95948875 95896870 95853692 95817828 95785487 95747101 95702040 95663410 95635831 95611048 95583135
2541.3I5583135k4861k3419k8682k3299j2487j2130j8024k4748k8461k1953j5294k3461
2553.5I5326316l0356k2763j6266j8263k3771l1548l3683k6220k3580k8300l0184k9844
2565.8I5011538l1829l5321l6228l6860l9339l9100l5614m0525m9132m0686k5577k4783
2578I4576544l3939m2224m4430m0704l5125l1155l0845l0423k8508l0882l3623l0750
2590.2I4163936k8807k9826k6577k2144k1970j9061j4520j5986j4782r972j3292j7464
2602.5I3929535j3739j1682j2708j0687q535j2207j6308j0062j466o61r84j055m142
2615.7I3825299n782m047k587l672k759J710j800p158o44N191J318j812k09J741J0126
2631I3814915J9998J2415J884P302J0567J204j257J2713K3121J5652M184N091J4686
$$ plain form
2541.3 95583135 95558274 95534855 95506173 95482874 95470387 95458257 95440233 95415485 95387024 95365071 95349777 95326316
2553.5 95326316 95295960 95273197 95256931 95238668 95214897 95183349 95149666 95123446 95099866 95071566 95041382 95011538
2565.8 95011538 94979709 94944388 94908160 94871300 94831961 94792861 94757247 94716722 94667590 94626904 94601327 94576544
2578 94576544 94542605 94500381 94455951 94415247 94380122 94348967 94318122 94287699 94259191 94228309 94194686 94163936
2590.2 94163936 94135129 94105303 94078726 94056582 94034612 94015551 94001031 93985045 93970263 93960291 93946999 93929535
2602.5 93929535 93915796 93904114 93891406 93880719 93872184 93859977 93843669 93833607 93832141 93831480 93830496 93829441 93825299
2615.7 93825299 93819517 93815470 93812883 93809211 93806452 93808162 93806362 93799204 93798560 93803751 93805069 93803257 93803048 93804789 93814915
2631 93814915 93834913 93847328 93849212 93856514 93867081 93868285 93867028 93879741 93902862 93918514 93922698 93927789 93942475
2644.3I3942475K0731J8906J0306M017O724R298O086J174m214n621R54L284m208m542
2658.6I4005370n4l796k677M250j490j4293j3536m995j0687k4760k5445j6368j8447
2671.8I3873072l0291l1293k6172l2783m5812m7404l4445l1364l6782l2187l0040l3331
2684.1I3461168l6860l9267m0436m6861n4431n5140m9860m3559m1228m9621o1822o3330
2696.3I2878753o3115o9744o9237o0111n9372o8295o9517n8883n1540n7227o9106p5101
2708.5I2107505o7360n1432m4966m8399n4127n8353n1338l9494m0060m9913n3876n9844
2720.8I1488343o5839m6366k8467m9210o3777k7019J4651J2690o336j2553q011k157
2733I1205949k724o509j0961q566N097J6552K3561K6018J7017Q971J2159J2112p129
$$ plain form
2644.3 93942475 93963206 93982112 93992418 93996435 94003159 94012457 94018543 94019717 94015503 94009882 94010836 94014120 94009912 94005370
2658.6 94005370 94005316 94001520 93998843 94003093 94001603 93987310 93973774 93968779 93958092 93933332 93907887 93891519 93873072
2671.8 93873072 93842781 93811488 93785316 93752533 93706721 93659317 93624872 93593508 93556726 93524539 93494499 93461168
2684.1 93461168 93424308 93385041 93344605 93297744 93243313 93188173 93138313 93094754 93053526 93003905 92942083 92878753
2696.3 92878753 92815638 92745894 92676657 92616546 92557174 92488879 92419362 92360479 92308939 92251712 92182606 92107505
2708.5 92107505 92040145 91988713 91943747 91895348 91841221 91782868 91731530 91692036 91651976 91602063 91548187 91488343
2720.8 91488343 91422504 91376138 91347671 91298461 91234684 91207665 91222316 91235006 91228670 91216117 91208106 91205949
2733 91205949 91203225 91196716 91185755 91177189 91182286 91198838 91222399 91248417 91265434 91274405 91286564 91298676 91291547
2746.3I1291547k1172P069L3522K6882L0064L4422J9264P421N925J2183K2215J5103
2758.5I1484445k932j085J2344P826p963l183Q106p21r292m459J014j771j5920l6871
2772.8I1429538n4950n4169o640M0526K4479q249k1857k5004k1422k5582l2157k4235
2785I1220278j9342m7273q7404p5447j8299O044O556J0544j3446m3732m7320n8562
2797.3I0832597p2032k9588J6445L272k3293l3462l7605m0161m1557m7380p1120r2947
2809.5I0363169n9635o264m971k6143l4141m2397m7499m3535m7458n5158n0360m6169
2821.7H9899439n5260o0487n3805n3739o0380o3622o6036o8670o9773p1949p7713q9633
2834H9108372r4092p9835r8776j52147j26213k0820K3836k5135p8768r4360r5493j08045
$$ plain form
2746.3 91291547 91270375 91277444 91310966 91337848 91367912 91402334 91421598 91429019 91434944 91447127 91469342 91484445
2758.5 91484445 91481513 91480428 91492772 91500598 91492635 91489452 91497558 91496837 91487545 91483086 91484100 91482329 91466409 91429538
2772.8 91429538 91374588 91320419 91313779 91354305 91378784 91370535 91348678 91323674 91302252 91276670 91244513 91220278
2785 91220278 91200936 91153663 91066259 90990812 90972513 90978557 90985113 90995657 90982211 90938479 90891159 90832597
2797.3 90832597 90760565 90730977 90747422 90750694 90727401 90693939 90656334 90616173 90574616 90527236 90456116 90363169
2809.5 90363169 90303534 90297270 90292299 90266156 90232015 90189618 90142119 90098584 90051126 89995968 89945608 89899439
2821.7 89899439 89844179 89783692 89729887 89676148 89615768 89552146 89486110 89417440 89347667 89275718 89198005 89108372
2834 89108372 89014280 88934445 88835669 88683522 88557309 88536489 88560325 88535190 88456422 88362062 88266569 88158524
2846.2H8158524j30516j23704q6671p7027r4056j04523j12891j21337j22392j23638
2856.4H7061769j35243j54412j64020j40572j10346j15084j35923j49876j58906j58590
2866.6H5638797j50352j48583j58030j63477j65028j69462j32453n4777j6999k9767
2876.8H4449869l8182k3884p552J598J2362K3073K5081K2000K1059J7297J6314J9878
2889H4538913J3596L701j407q118k4873n4252n1618J336K7990J919k3413k9528l9661
2902.3H4354585o1166o1786l4493k6143m9209p7957j04458j12193j08487j41453j60194
2913.5H3417046q8316m0084q2469j05256r7877j01679j16724j52791j92296k22057
2923.7H2217497k47753k68352k84958l04842l26741l04764k12890j31744j10454r8633
$$ plain form
2846.2 88158524 88028008 87904304 87817633 87740606 87646550 87542027 87429136 87307799 87185407 87061769
2856.4 87061769 86926526 86772114 86608094 86467522 86357176 86242092 86106169 85956293 85797387 85638797
2866.6 85638797 85488445 85339862 85181832 85018355 84853327 84683865 84551412 84496635 84479636 84449869
2876.8 84449869 84411687 84387803 84380251 84381849 84394211 84417284 84442365 84464365 84485424 84502721 84519035 84538913
2889 84538913 84552509 84556210 84554803 84546685 84521812 84467560 84415942 84417278 84445268 84447187 84423774 84394246 84354585
2902.3 84354585 84293419 84231633 84197140 84170997 84121788 84043831 83939373 83827180 83718693 83577240 83417046
2913.5 83417046 83328730 83288646 83206177 83100921 83003044 82901365 82784641 82631850 82439554 82217497
2923.7 82217497 81969744 81701392 81416434 81111592 80784851 80480087 80267197 80135453 80024999 79926366
2933.9G9926366p2509l5316R107M3798P1776R6720J01608Q1456M6647M8184J01155
2945.1H0418992J13571Q8703J09119J26075P7302k301m6349j6713J9044j6141p4244
2956.3H0797058j11788j57660k06834k38675k75833l07941l03519l03322l31205l46256
2966.5G8214025l40688l35550l22795k91324k59083k38395k25049j91009j13177n1171
2976.7G5845784n8180p4923m0764Q118L8356P4661R8717Q1283O3187O8903P2091O1673
2989G6238906M9580L0684J5235O1113J35660J32519P2229L7652O2305J09422J02639
3000.2G7047944O8814N8746M3392K9004L7026L4875J0455q429j9574m0823m7213k0879
3012.4G7193338n442N930M1491M9609K7341J9485J6886J7428K1082M876l3266n1194
$$ plain form
2933.9 79926366 79853857 79818541 79827648 79871446 79943222 80039942 80141550 80223006 80269653 80317837 80418992
2945.1 80418992 80532563 80621266 80730385 80856460 80933762 80931461 80885112 80868399 80887443 80871302 80797058
2956.3 80797058 80685270 80527610 80320776 80082101 79806268 79498327 79194808 78891486 78560281 78214025
2966.5 78214025 77873337 77537787 77214992 76923668 76664585 76426190 76201141 76010132 75896955 75845784
2976.7 75845784 75787604 75712681 75671917 75680035 75718391 75793052 75891769 75973052 76036239 76105142 76177233 76238906
2989 76238906 76288486 76319170 76334405 76395518 76531178 76663697 76735926 76773578 76835883 76945305 77047944
3000.2 77047944 77116758 77175504 77218896 77247900 77284926 77319801 77330256 77321827 77302253 77261430 77214217 77193338
3012.4 77193338 77187896 77193826 77235317 77284926 77312267 77331752 77348638 77366066 77387148 77392024 77358758 77307564
3024.7G7307564j9068P552j7440n6690o7979o3133q1247j14501j23095j02497o3508
3035.9G6605958m2117p9614j43331j78152j76728j65540j33962q8894q9943r0641n8884
3047.1G5358152p1388j30057j68592j36757n9795l8100p5268p7272n0473l8499j4430
3058.3G4497521P242o479k5022k7609j4162J1784J1307r358J5485Q7231J31816J15961
3070.6G4795717R1797Q9443Q7041P6830N6076K9582K1821L7950N5272O4122P0465M9078
3082.8G5525194J0658L1542P8625O5815L6025K5595Q827J5414N0414N6988L2585J4222
3095G5951904M554n597k0462l1340k1345k324Q511L654j4901l3504n0116o9570p7284
3108.3G5642180l6251J8704J0663l0482n9175r0313j05226q0776m4418l2866n1784
$$ plain form
3024.7 77307564 77288496 77296048 77278608 77221918 77153939 77090806 77009559 76895058 76771963 76669466 76605958
3035.9 76605958 76563841 76484227 76340896 76162744 75986016 75820476 75686514 75597620 75507677 75417036 75358152
3047.1 75358152 75286764 75156707 74988115 74851358 74791563 74753463 74678195 74600923 74550450 74511951 74497521
3058.3 74497521 74504763 74498284 74473262 74445653 74431491 74443275 74454582 74445224 74460709 74547940 74679756 74795717
3070.6 74795717 74887514 74976957 75063998 75140828 75196904 75226486 75248307 75286257 75341529 75405651 75476116 75525194
3082.8 75525194 75535852 75567394 75646019 75711834 75747859 75773454 75782281 75797695 75848109 75905097 75937682 75951904
3095 75951904 75956458 75950861 75930399 75899059 75877714 75875390 75883901 75887555 75872654 75839150 75789034 75719464 75642180
3108.3 75642180 75605929 75624633 75635296 75604814 75545639 75455326 75350100 75269324 75224906 75192040 75140256
3119.5G5140256n0956K002M1259J2606l5590n1027n1707o6531r1004q7268m0352r286
3131.7G4712402k4736n0050o5315p8982r8598j11455j00303n5807M082J9271j4377
3143G4136132m0799m6742m6242n2636o5351p2593q9633j30635j40816n7990M0782M5299
3155.2G3478776m393l1405m1056n1707n7626n4163m6223m5490n2715n5790n3024m9078
3167.4G2936106m4370m3040n0790o4587o5434m7189l1364l2300m3833n0050n4193o0558
3179.7G2348398n3555m2790m4060m5323l9637m0060n1922o4266o8962n7221l7271l7390
3191.9G1765941m5657l9011k8187k7776m3690n5963n6559n7763n3840n4330n7560m6855
3204.1G1198750m2832m8668l7664k6047m0042n8604n6916m9996n6965o1577m5282l2425
$$ plain form
3119.5 75140256 75089300 75091302 75132561 75145167 75109577 75058550 75006843 74940312 74849308 74762040 74721688 74712402
3131.7 74712402 74687666 74637616 74572301 74493319 74394721 74283266 74182963 74127156 74131238 74150509 74136132
3143 74136132 74095333 74048591 74002349 73949713 73884362 73811769 73722136 73591501 73450685 73392695 73433477 73478776
3155.2 73478776 73474383 73442978 73401922 73350215 73292589 73238426 73192203 73146713 73093998 73038208 72985184 72936106
3167.4 72936106 72891736 72848696 72797906 72733319 72667885 72620696 72589332 72557032 72513199 72463149 72408956 72348398
3179.7 72348398 72294843 72252053 72207993 72162670 72123033 72082973 72031051 71966785 71897823 71840602 71803331 71765941
3191.9 71765941 71720284 71681273 71653086 71625310 71581620 71525657 71469098 71411335 71357495 71303165 71245605 71198750
3204.1 71198750 71155918 71107250 71069586 71043539 71003497 70944893 70887977 70837981 70781016 70719439 70674157 70641732
3216.4G0641732n2339p3552n5504k5755k5898l8403m0120m3750n0503n3143m9842m3380
3228.6G0089543m6611p0423j23966j75184j25271J8615R2196N0575o426l4862m5753
3239.8F9622433m6277l5089k8527n0259q7481j21826j19925l5840N4091M3971r794
3251.1F9185477l2502m2021o8897j05864p3874K1988M4078p588k8306k2739l3206m2808
3263.3F8793738m0668m3273m7130n7947j00762j65755j73485p1037O1286Q6343K712
3274.5F8244022l4559R114K0087j3304l8409m3249k5648k0832m5127n3620l5739k9618
3286.7F7933118m1449m8822p5233j33932j41459m8042J8287j4454l1537N764L8350
3298F7460591K8836j3327m2123n8257r4527j35130j23745n6655N299K6512K4510L1030
$$ plain form
3216.4 70641732 70589393 70515841 70460337 70434582 70408684 70370281 70330161 70286411 70235908 70182765 70132923 70089543
3228.6 70089543 70042932 69972509 69848543 69673359 69548088 69566703 69658899 69709474 69703048 69668186 69622433
3239.8 69622433 69576156 69541067 69512540 69462281 69374800 69252974 69133049 69097209 69151300 69195271 69185477
3251.1 69185477 69152975 69110954 69042057 68936193 68862319 68884307 68928385 68920797 68892491 68869752 68836546 68793738
3263.3 68793738 68753070 68709797 68662667 68604720 68503958 68338203 68164718 68093681 68154967 68241310 68244022
3274.5 68244022 68209463 68218577 68238664 68225360 68186951 68143702 68118054 68097222 68052095 67998475 67962736 67933118
3286.7 67933118 67891669 67842847 67767614 67633682 67492223 67444181 67462468 67448014 67416477 67422241 67460591
3298 67460591 67489427 67476100 67433977 67375720 67281193 67146063 67022318 66965663 66970962 66997474 67021984 67053014
3310.2F7053014L3146R066j1021j1670j2625k4581l9410m4137l9304l5625m2487n0866
3322.4F6783500n4086o0951n8699l5554j9533k2155l0511m1372l4243k0253l1770n1385
3334.7F6322988o6989q1766q4764p1209m2958j9818k9487n1301m4883l0446l3551l9279
3346.9F5726537m7559n2941m5931m0502l5595k5464k3400l1698l4726l1233l0142l1250
3359.1F5296096l0816k2960j3405j9419k8050k3997k3365k6673j7792n781p701j4347
3371.4F5061790j4746r394K68J1140J1659K140L934J3631J4895J628j0050P45J2720
3384.6F5100360P695K169O217J7637L5835M2492K2453l183o121J2201K7191K3490J3751
3397.9F5302187K8795N6273N1111J6898l684K712K0999L4535L1096L1262M5723M8822
$$ plain form
3310.2 67053014 67086160 67095226 67084205 67072535 67059910 67035329 66995919 66951782 66912478 66876853 66834366 66783500
3322.4 66783500 66729414 66668463 66609764 66574210 66554677 66532522 66502011 66460639 66426396 66406143 66374373 66322988
3334.7 66322988 66255999 66174233 66089469 66018260 65975302 65955484 65925997 65874696 65829813 65799367 65765816 65726537
3346.9 65726537 65678978 65626037 65580106 65539604 65504009 65478545 65455145 65423447 65388721 65357488 65327346 65296096
3359.1 65296096 65265280 65242320 65228915 65209496 65181446 65157449 65134084 65107411 65089619 65083838 65076137 65061790
3371.4 65061790 65047044 65037650 65037918 65049058 65060717 65062857 65066791 65080422 65095317 65096945 65086895 65087640 65100360
3384.6 65100360 65108055 65110224 65116441 65134078 65169913 65212405 65234858 65231675 65225554 65237755 65264946 65288436 65302187
3397.9 65302187 65330982 65387255 65438366 65455264 65451580 65454292 65475291 65509826 65540922 65572184 65617907 65666729
3410.1F5666729M3112M1616L5572K8241K9492M0472O1685P7730P6080O2978L6615K1887
3422.4F6222209M7701P2736O8366O2156O8611Q2552Q7077P0608N1778N6875Q8268J14054
3434.6F7092991R7304N8753M0394M1163O2102Q8924Q8501P2002P8762J16861J30558
3445.8F7968315J00797P5126O8051P2640Q3387R4437J00279R1201Q5104J03748J29890
3457F8972975J34683J18625J06358J03927J02603J07867J16926J23120J32459J39326
3467.2G0158869J40107J22487P8303O6906J06466J27607J24127J31279J38837J40840
3477.4G1335828J46866J53601J50723J29652J08265J11676J30224J52749J65462J49054
3487.6G2734100J32209J34754J40595J50520J57642J58936J59448J58084J63060J67930
$$ plain form
3410.1 65666729 65709841 65751457 65787029 65815270 65844762 65885234 65946919 66024649 66100729 66163707 66200322 66222209
3422.4 66222209 66269910 66342646 66411012 66473168 66541779 66624331 66711408 66782016 66833794 66890669 66978937 67092991
3434.6 67092991 67190295 67249048 67289442 67330605 67392707 67481631 67570132 67642134 67720896 67837757 67968315
3445.8 67968315 68069112 68144238 68212289 68284929 68368316 68462753 68563032 68654233 68739337 68843085 68972975
3457 68972975 69107658 69226283 69332641 69436568 69539171 69647038 69763964 69887084 70019543 70158869
3467.2 70158869 70298976 70421463 70499766 70566672 70673138 70800745 70924872 71056151 71194988 71335828
3477.4 71335828 71482694 71636295 71787018 71916670 72024935 72136611 72266835 72419584 72585046 72734100
3487.6 72734100 72866309 73001063 73141658 73292178 73449820 73608756 73768204 73926288 74089348 74257278
3497.8G4257278J68437J77545J91271J94335J76996J39671J17672J42670J81233J93394
3508G5940502J83397J65880J58209J70964J80786J73086J65558J71924J84935J90795
3518.2G7686036J95211K06959K25753K36153K10566J73783J76710K01511K02847J88636
3528.4G9704165J75250J62071J61248J78248K09326K31605K26993K05523J84089J80941
3538.6H1619459J93739K17259K40094K48557K63101K70384K26123J68007J50728J62912
3548.8H3760363J99705K37996K31921J88464J58054J71119K02679K26248K31623K27642
3559H5835814K27911K18653K21503K71565L39490L84396L57598K12455M9162j0252
3569.2H8108295M0609J33586J87784K08014K20466K14541K00492J97357J97727J93262
$$ plain form
3497.8 74257278 74425715 74603260 74794531 74988866 75165862 75305533 75423205 75565875 75747108 75940502
3508 75940502 76123899 76289779 76447988 76618952 76799738 76972824 77138382 77310306 77495241 77686036
3518.2 77686036 77881247 78088206 78313959 78550112 78760678 78934461 79111171 79312682 79515529 79704165
3528.4 79704165 79879415 80041486 80202734 80380982 80590308 80821913 81048906 81254429 81438518 81619459
3538.6 81619459 81813198 82030457 82270551 82519108 82782209 83052593 83278716 83446723 83597451 83760363
3548.8 83760363 83960068 84198064 84429985 84618449 84776503 84947622 85150301 85376549 85608172 85835814
3559 85835814 86063725 86282378 86503881 86775446 87114936 87499332 87856930 88069385 88118547 88108295
3569.2 88108295 88148904 88282490 88470274 88678288 88898754 89113295 89313787 89511144 89708871 89902133
3579.4H9902133J80995J77527K14117K65855K96557L37428L65162K54446P0351j877
3589.6I2062694N7351J66458K48689K65306K27356J77491J38259J43826J71578J78986
3599.8I3837994J77104J47581J21480J53381K25150L10975L49832K65145J46097R5558
3610I5830297J33127K36094K42246J47682J38348K14929L15732L31831J90204K7531
3620.2I7808021l5643K2942J42192K38729L33112M58837N68175N13870J14739k51049
3630.4I9913925j59133P8267J83142J30701Q7869J47915K07305K06530J92308K04289
3640.6A01193118K24352K27511K45774L47507N24044O56390N84149L40891R9421j34826
3650.8A04308331k50626j17492J50096L34013L12495R3269o9415J3613J43648J90460
$$ plain form
3579.4 89902133 90083128 90260655 90474772 90740627 91037184 91374612 91739774 91994220 92064571 92062694
3589.6 92062694 92120045 92286503 92535192 92800498 93027854 93205345 93343604 93487430 93659008 93837994
3599.8 93837994 94015098 94162679 94284159 94437540 94662690 94973665 95323497 95588642 95734739 95830297
3610 95830297 95963424 96199518 96441764 96589446 96727794 96942723 97258455 97590286 97780490 97808021
3620.2 97808021 97772378 97795320 97937512 98176241 98509353 98968190 99536365 100050235 100164974 99913925
3630.4 99913925 99754792 99833059 100016201 100146902 100234771 100382686 100589991 100796521 100988829 101193118
3640.6 101193118 101417470 101644981 101890755 102238262 102762306 103418696 104002845 104343736 104443157 104308331
3650.8 104308331 104057705 103940213 104090309 104424322 104736817 104830086 104760671 104774284 104917932 105108392
3661A05108392K08462K15792K00832K17462K96366M16016N38767N09310K38597l9709
3671.2A07910287k3234K83933O04534M98271j36280m16934j87195Q321R42l2246K4366
3682.4A08534765Q7869J37771K34997L57926M09519K73145O1834J0395q8621k36606
3692.6A09782994j75333l4416L4022N7280P5520J24394J92154K21801J16253j03558
3702.8A10291111j71220n5182O3205J56057K64871L37899K52998Q4579o2931k93553
3713A10867834l62885j87874k0015P6127J29545J28948R8205J34516J62780M4120j3030
3724.2A11058271O7186M6432r6845j34492K2745K29967L39520K67827J38474J56116
3734.4A12095201O0630k70450m38404l47913j46055P9203K34449L60393N29170K82753
$$ plain form
3661 105108392 105316854 105532646 105733478 105950940 106247306 106663322 107202089 107711399 107949996 107910287
3671.2 107910287 107887053 108170986 108775520 109273791 109137511 108720577 108533382 108541703 108542645 108510399 108534765
3682.4 108534765 108622634 108760405 108995402 109353328 109762847 110035992 110097826 110108221 110019600 109782994
3692.6 109782994 109607661 109573245 109607267 109664547 109740067 109864461 110056615 110278416 110394669 110291111
3702.8 110291111 110119891 110064709 110127914 110283971 110548842 110886741 111139739 111224318 111161387 110867834
3713 110867834 110504949 110317075 110297060 110373187 110502732 110631680 110729885 110864401 111027181 111071301 111058271
3724.2 111058271 111125457 111171889 111075044 110940552 110963297 111193264 111532784 111800611 111939085 112095201
3734.4 112095201 112155831 111885381 111446977 111099064 110953009 111032212 111266661 111627054 112156224 112438977
3744.6A12438977m29273m19783M5025L64673K99788k8646j94741l65305m62842k47371
3754.8A11000502P153R7787O8986N3406l7884k07198j76728P51J25051J52254M7123
3766A11131203o5720K4033J58226M3822k00212k27964j10496l5023n305M5156J20748
3777.3A10878468J56772P9000j01459j62435m1628O8450P5793n459q4150p6235k6834
3788.5A10760283q952j5044L004M0316Q7214J58095K11787J33610l3009r239K36059
3799.7A11564124L87001R9754l31640l13831n4764J46591J21153j74141l25132j91593
3809.9A10927522l7157M5836J24955K45058L37518J98221j37508j50597J62101L99887
3820.1A12115836K19476l10456m91691k43843J1003R0683l600j07932m2475J20926
$$ plain form
3744.6 112438977 112009704 111589921 111634946 111999619 112299407 112270761 112076020 111710715 111247873 111000502
3754.8 111000502 111007655 111105442 111174428 111227834 111189950 110982752 110806024 110806775 110931826 111084080 111131203
3766 111131203 111065483 111089516 111247742 111291564 111091352 110863388 110752892 110717869 110712564 110757720 110878468
3777.3 110878468 111035240 111114240 111012781 110850346 110808718 110877168 110952961 110947502 110863352 110787117 110760283
3788.5 110760283 110751331 110736287 110739291 110779607 110866821 111024916 111236703 111370313 111337304 111328065 111564124
3799.7 111564124 111951125 112050879 111719239 111405408 111350644 111497235 111618388 111444247 111119115 110927522
3809.9 110927522 110890365 110936201 111061156 111306214 111643732 111841953 111704445 111553848 111715949 112115836
3820.1 112115836 112335312 112024856 111533165 111289322 111300325 111391008 111387408 111279476 111237001 111357927
3830.3A11357927J92583P7462j8465Q1694J25396Q5604J83630J18220j37937j75238
3840.5A11890876j50168j30856q3029j51956k14887j12450M4275J67298K66313M06373
3850.7A11931789N92506N43105K5154n81468o46698l31187j52707j08326J2708J57320
3860.9A11442196J79994J00315Q2862M9806j24228j29580J33860L29458J21296k65408
3871.1A11920571k61855j7869M3261j54901k40087o5339J40619K50566J80662q9848
3881.3A11705780j91271j3519J29128R6679r4355k41124j29557Q2994J93286Q4698
3891.5A11622739j62137k28286j08611n555P8737J98746K87104K10440M4692J8930
3901.7A11956799J5187o0475j59299k77436k83491j82248q4745k9886n412R250K2030
$$ plain form
3830.3 111357927 111550510 111627972 111609507 111691201 111816597 111902201 112085831 112204051 112066114 111890876
3840.5 111890876 111740708 111609852 111526823 111374867 111159980 111047530 111091805 111259103 111525416 111931789
3850.7 111931789 112524295 113067400 113092554 112511086 111864388 111533201 111380494 111272168 111284876 111442196
3860.9 111442196 111622190 111722505 111805367 111855173 111730945 111601365 111735225 112064683 112185979 111920571
3871.1 111920571 111658716 111640847 111684108 111529207 111289120 111223781 111364400 111614966 111795628 111705780
3881.3 111705780 111514509 111500990 111630118 111726797 111632442 111391318 111261761 111344755 111538041 111622739
3891.5 111622739 111460602 111232316 111123705 111118150 111196887 111395633 111682737 111893177 111937869 111956799
3901.7 111956799 111971986 111911511 111752212 111474776 111191285 111009037 110924292 110894406 110888994 110898244 110920274
3912.9A10920274N5456J11926J46961J00327k9898r2649n6518o1559m8363L9899P3302
3924.1A11159158J31q6856p7701M876O1405O3145L7205o366p1823j13797r2149m1974
3936.3A10835254N031K9385K7406M1127P4125N9485l1638q8334m0031L5847O3395K8050
3948.6A11039102k1946n1475o1142m2987k2280j3817N531K3163J3840O473K0552K4581
3960.8A10919595P915k3770l7515j8287k074J8728L2436J6213q70M017J9991K0302
3973.1A10956681J3959N460j8299k2864J2004K9898M530k1636k5213j6511k050J0872
3985.3A10926831O866K754J1015J5271J1956J0181P462l421q547k420j31r442j3971
3998.5A10954404
$$ plain form
3912.9 110920274 110975730 111087656 111234617 111334944 111305046 111212397 111155879 111094320 111045957 111085856 111159158
3924.1 111159158 111159289 111072433 110994732 110999608 111061013 111124158 111161363 111154997 111083174 110969377 110877228 110835254
3936.3 110835254 110840285 110869670 110897076 110938203 111012328 111071813 111040175 110951841 110911810 110947657 111011052 111039102
3948.6 111039102 111017156 110965681 110904539 110861552 110839272 110825455 110830986 110854149 110867989 110874462 110895014 110919595
3960.8 110919595 110927510 110903740 110866225 110847938 110845864 110864592 110897028 110913241 110912371 110916388 110936379 110956681
3973.1 110956681 110970640 110976100 110957801 110934937 110946941 110976839 110981369 110959733 110934520 110918009 110915959 110926831
3985.3 110926831 110933697 110936451 110947466 110962737 110974693 110984874 110992336 110988915 110980368 110977948 110977817 110968375 110954404
3998.5 110954404
##END=$$ End of the data block
