##TITLE=G4 - [Mn(HBPa)2l $$ Begin of the data block
##JCAMP-DX=5.00 $$ ACD/SpecManager v 10.08
##SPECTROMETER/DATA SYSTEM=Alpha
##DATE=27 May 2015 08:52:56
##DATA TYPE=INFRARED SPECTRUM
##DATA CLASS=XYDATA
##ORIGIN=
##OWNER=
##NPOINTS=1765
##FIRSTX=399.76428223
##LASTX=3997.64306641
##MAXX=3997.64306641
##MINX=399.76428223
##MAXY=0.86950016
##MINY=0.54461676
##XFACTOR=1.0000000000
##YFACTOR=1.000000000000000e-9
##FIRSTY=0.81164736
##DELTAX=2.03961372
##XUNITS=1/CM
##YUNITS=ARBITRARY UNITS
##XYDATA=(X++(Y..Y))
399.8H11647356j808346p065654k668917M609108K827764m408777m349649K759039
$$ 811647356 809839010 802773356 800104439 804713547 807541311 803132534 798782885 801541924
416.1H01541924N029262j912117m370869K076924N396426j68800n270064j680553L463506
$$ 801541924 806571186 804659069 800288200 802365124 807761550 807592750 802322686 800642133 804105639
434.4H04105639M08233n442500l392518L246784L241837k955556l849387K452850N170823
$$ 804105639 804513872 799071372 795678854 798925638 802167475 799211919 795362532 797815382 802986205
452.8H02986205j86265m396438o66798L345847k84969n131424k170443M313290L624260
$$ 802986205 802799940 798403502 797736704 801082551 800797582 795666158 793495715 797809005 801433265
471.2H01433265k928197m183412N45919P85411n674124p880330j55688O827712L792882
$$ 801433265 798505068 794321656 794867575 795652986 789978862 782098532 781942844 788770556 792563438
489.5G92563438j918256J61886N964160M891277j570583k741754K777696M353046j556992
$$ 792563438 790645182 790807068 796771228 801662505 800091922 797350168 800127864 804480910 802923918
507.9H02923918n174101p97629L302991m89473o533563n561650n49853r84192n905747
$$ 802923918 797749817 796952188 800255179 799765706 793232143 787670493 787120640 786136448 780230701
526.2G80230701n014122K577067O109893J488149k484500R62317N522013K835095l037990
$$ 780230701 775216579 777793646 783903539 785391688 782907188 783869505 789391518 792226613 789188623
544.6G89188623k312600L329634L552974k270162m242301P20203L718614p61926n159318
$$ 789188623 786876023 790205657 793758631 791488469 787246168 787966371 791684985 790923059 785763741
562.9G85763741j676381M181147K831101l245235m015386P60019J614154l710092o036400
$$ 785763741 784087360 788268507 791099608 787854373 783838987 784599006 786213160 782503068 776466668
581.3G76466668o59228M474700K040505k677083j240134L508925K517343l382504m655123
$$ 776466668 775807440 780282140 782322645 779645562 778405428 781914353 784431696 781049192 776394069
599.6G76394069O51360L430605q33333m588783j597404K455532J09077n109966m623949
$$ 776394069 777045429 780476034 779642701 775053918 773456514 775912046 776021123 770911157 766287208
618G66287208N47230J190185m192412o988883l033697N70536j725436m575610r44912
$$ 766287208 766834438 768024623 763832211 756843328 753809631 754380167 752654731 748079121 747134209
636.4G47134209N995571Q373261O653487P690132J1954606J1793732M433275j499832
$$ 747134209 753129780 761503041 768156528 775846660 787801266 799594998 804028273 802528441
652.7H02528441P05421M654705J771868m122615l504038K162158M555464J788k236068
$$ 802528441 803233862 807888567 809660435 805537820 802033782 804195940 808751404 808753192 806517124
671H06517124J999736M707158Q86380m009247j884639L445029K701998k908051m148245
$$ 806517124 808516860 813224018 814110398 810101151 808216512 811661541 814363539 811455488 807307243
689.4H07307243L60549K114832k589762o282985k975464J621902q2195m468202k983749
$$ 807307243 807667792 809782624 807192862 800909877 797934413 799556315 799474120 795005918 792022169
707.7G92022169K794385L533840k322972o064534l151119j34528l157735p515251o265342
$$ 792022169 794816554 798350394 796027422 789962888 786811769 786677241 783519506 776004255 769738913
726.1G69738913k250493k867997p142126p470787k802729p68185o183744j4615953
$$ 769738913 767488420 764620423 757478297 750007510 747204781 746436596 740252852 725636899
742.4G25636899k0691335k5549412l0623853l1216323k3119152r894311J290500P671952
$$ 725636899 704945564 679396152 648772299 617555976 594436824 584542513 585833013 593504965
758.7E93504965J2371660J8405854K3678780K4062514K0781577J9181549J9846559
$$ 593504965 605876625 624282479 647961259 672023773 692805350 711986899 731833458
773G31833458J7283201J0021508M921675O770670J0237634Q177519L090024K477110
$$ 731833458 749116659 759138167 764059842 770830512 781068146 789245665 792335689 794812799
789.3G94812799N928695O229877K187371M58360L471255M820943N10395l551900j502932
$$ 794812799 800741494 806971371 809158742 809617102 813088357 817909300 818419695 814867795 813364863
807.7H13364863K599180J605988k920986l316879J123250K906143q10623l594160r63211
$$ 813364863 815964043 817570031 814649045 811332166 812455416 815361559 814550936 810956776 809993565
826H09993565K099276k81155m807175m558801p73967o17385m913568o738484k915084
$$ 809993565 812092841 811811686 807004511 802445710 801671743 801054358 796140790 789402306 786487222
844.4G86487222R32514j24693k289891J7107M378736M302561R1910j561164J293897
$$ 786487222 787419736 787295043 785005152 785022259 789400995 793703556 793795466 792234302 793528199
862.8G93528199K682567j213849n787849o016016m324615n031347o127298k996087
$$ 793528199 796210766 794996917 789209068 783193052 778868437 773837090 767709792 764713705
879.1G64713705K779662N028844K468884O96659L321469O043792L672242r67383j487077
$$ 764713705 767493367 772522211 774991095 775687754 779009223 785053015 788725257 787757874 786270797
897.4G86270797J630008K094031j535058l426254k43366L327072K106428j332045j326143
$$ 786270797 787900805 789994836 788459778 785033524 784790158 788117230 790223658 788891613 787565470
915.8G87565470J104414L02077l865600n617619l022372r23157k567887m246176j823246
$$ 787565470 788669884 788971961 785106361 779488742 776466370 775543213 772975326 768729150 766905904
934.1G66905904J955032J864612j135766j562000J460612K835989J20104k417088j055360
$$ 766905904 768860936 770725548 769589782 768027782 769488394 772324383 772444487 770027399 768972039
952.5G68972039J205683j06275l170669k855957N56290J864195l56495j554132R99749
$$ 768972039 770177722 770071447 766900778 764044821 764601111 766465306 766108811 764554679 765554428
970.9G65554428L523588J993478j109958r81450J460314J369238j644075l048063j385748
$$ 765554428 769078016 771071494 769961536 768980086 770440400 771809638 770165563 767117500 765731752
989.2G65731752p38919l305495n039632k403855J247465O91235l018856m564345k961695
$$ 765731752 764992833 761687338 756647706 754243851 755491316 756182551 753163695 748599350 745637655
1007.6G45637655k479672m698575n434632j581728L699183N315721L169417J199246
$$ 745637655 743157983 738459408 733024776 731443048 735142231 740457952 743627369 744826615
1023.9G44826615J72615l331065r318710j1994838q338333k968788q67784p28488Q83460
$$ 744826615 744999230 741668165 732349455 720354617 712016284 709047496 708179712 707451224 708334684
1042.2G08334684L123880K857685Q27730J198530M907667P574738N703091J835764
$$ 708334684 711458564 714316249 715143979 716342509 721250176 728824914 734528005 736363769
1058.6G36363769M17172J037777q583k954781m198134k660155j616776l120125m650473
$$ 736363769 736780941 737818718 737810135 734855354 730657220 727997065 726380289 723260164 718609691
1076.9G18609691l526569j506865j878679l976881m240394j970529k37644p33197j301884
$$ 718609691 715083122 713576257 711697578 707720697 703480303 701509774 701272130 700538933 699237049
1095.3F99237049n246J443685N90205j388669j344443O49870J758933J706779L116846
$$ 699237049 699231803 700675488 701265693 699877024 698532581 699182451 700941384 702648163 705765009
1113.6G05765009O365299Q106351O010711K410054J146317K355099L370464L198027
$$ 705765009 712130308 720236659 726247370 728657424 729803741 732158840 735529304 738727331
1129.9G38727331K752721K344251Q25226k528190n520702n613207m239619m329801
$$ 738727331 741480052 743824303 744649529 742121339 736600637 730987430 726747811 722418010
1146.3G22418010n051791l036738J981616O377280P601678P085443P123172P117033
$$ 722418010 717366219 714329481 716311097 722688377 730290055 737375498 744498670 751615703
1162.6G51615703N087495J718342j27256J1564n76675l149271n274058m909277l705203
$$ 751615703 756703198 758421540 758294284 758305848 757729173 754579902 749305844 744396567 740691364
1180.9G40691364m067838n342067n271196m006982l729701m647553m467547k146244
$$ 740691364 736623526 731281459 726010263 722003281 718273580 713626027 709158480 707012236
1197.3G07012236L14951R23932O24358J260996K199352J259387j660944m145205m787027
$$ 707012236 707327187 708251119 708875477 710136473 712335825 713595212 711934268 707789063 703002036
1215.6G03002036m861772n692184o563604o589234o845713q539200j0131955q787036
$$ 703002036 698140264 692448080 685884476 679295242 672449529 663910329 653778374 644991338
1231.9F44991338m561782q82506k92003j677215k708733l196657m290164n722940o036639
$$ 644991338 640429556 639547050 639255047 637577832 634869099 631672442 627382278 621659338 615622699
1250.3F15622699m906177l555775k769828j864910m02152K80201j188815l268122k797604
$$ 615622699 610716522 607160747 604390919 602526009 602123857 602404058 601215243 597947121 595149517
1268.6E95149517K49386K227306J505673J383782M974663J0231376J2694001J1161685
$$ 595149517 595398903 597626209 599131882 600515664 605490327 615721703 628415704 639577389
1285F39577389Q091926N740226M412710M061818N051196O840169P493139N817056L312528
$$ 639577389 647669315 653409541 657822251 661884069 666935265 673775434 681268573 687085629 690398157
1303.3F90398157K345800L024519L577411L458738M069448N968570P397712O649136
$$ 690398157 692743957 695768476 699345887 702804625 706874073 712842643 720240355 726889491
1319.6G26889491M555225L092230K312064J049817l86477m74036P34508J250506O4909
$$ 726889491 731444716 734536946 736849010 737898827 737512350 737038314 737772822 739023328 739088237
1338G39088237j238763q17657M63248P40945M6671k03372J78874k26676j852990l075838
$$ 739088237 737849474 737031817 737495065 738236010 738282681 738079309 738258183 738031507 736178517 733102679
1358.4G33102679k860129k275645k253712j999020o46889J230061J974702J040637
$$ 733102679 730242550 727966905 725713193 723714173 723067284 724297345 726272047 727312684
1374.7G27312684J5736l4154m11808j684249k347588j933694j756191k433837l471017
$$ 727312684 727328420 727294266 726882458 725198209 722850621 720916927 719160736 716726899 713255882
1393.1G13255882l490090j223028J590550K842665K946675K909064K231538M91321
$$ 713255882 709765792 708542764 710133314 712975979 715922654 718831718 721063256 721554577
1409.4G21554577j536309k298355j663149j871049m457832o643295p414818q512914
$$ 721554577 720018268 717719913 716056764 714185715 709727883 703084588 695669770 687156856
1425.7F87156856j0087192j1968434j1620164q679449o997109o938576o050170n242109
$$ 687156856 677069664 665101230 653481066 644801617 637804508 630865932 624815762 619573653
1442F19573653n897343r164691j4428318j7522037j6519964j1424541K18749J7943144
$$ 619573653 613676310 604511619 590083301 572561264 556041300 544616759 544835508 562778652
1458.3E62778652K6693642K6554406K1401345Q863092m080475j5268385k8454363l0669392
$$ 562778652 589472294 616026700 637428045 646291137 642210662 626942277 598487914 567818522
1474.7E67818522j6673088j152753P136523O665886M247844Q210599J9542516K8766572
$$ 567818522 551145434 549992681 557129204 563795090 568042934 576253533 595796049 624562621
1491F24562621K6344776J9575060J2828588N191386R38713J237989N092442J0321975
$$ 624562621 650907397 670482457 683311045 688502431 689441144 690679133 695771575 706093550
1507.3G06093550J0258078Q733750Q977353R441912Q819938O197214L568650K371788
$$ 706093550 716351628 725085378 734062731 743504643 752324581 758521795 762090445 764462233
1523.6G64462233K265155J509726K21968M947Q6248o27280k347528n063177l978788
$$ 764462233 766727388 768237114 768459082 768464029 768550277 767922997 765575469 760512292 756533504
1542G56533504R42766L341735K815604J498461L77178q87335k383947n411148q620620
$$ 756533504 757476270 760818005 763633609 765132070 765509248 764621913 762237966 756826818 748206198
1560.3G48206198p626474q443236j0511041j0216713o643772j209020J091480j773775
$$ 748206198 740579724 732136488 721625447 711408734 704764962 703555942 704647422 702873647
1576.6G02873647o278336q982718j1299491j2889325j3729930j4508784j5109420j3676703
$$ 702873647 696595311 687612593 676313102 663423777 649693847 635185063 620075643 606398940
1593F06398940q138239l16441M256665M041732L462910N861104Q835673Q600831N390108
$$ 606398940 598260701 597944260 602200925 606242657 609705567 615566671 624402344 633003175 638393283
1611.3F38393283K757668K477467L213942L258110L581583M630268N082309M735529
$$ 638393283 641150951 643628418 646842360 650100470 653682053 658312321 663394630 668130159
1627.6F68130159M176081M278481N659937O577135M296779K336979K726197L673137
$$ 668130159 672306240 676584721 682244658 688821793 693118572 695455551 698181748 701854885
1643.9G01854885L830611K740622K372205M210055N105972K763212K559781M420161
$$ 701854885 705685496 708426118 710798323 715008378 720114350 722877562 725437343 729857504
1660.3G29857504O343007O375492N464852O371379P797301P093787O024480N478382
$$ 729857504 736200511 742576003 748040855 754412234 762209535 769303322 775327802 780806184
1676.6G80806184N621373O357730O311953M951417L634811M079223M334569L470420
$$ 780806184 786427557 792785287 799097240 804048657 807683468 811762691 816097260 819567680
1692.9H19567680L468812M171669M116655K783596J116991J237810J910567J359582
$$ 819567680 823036492 827208161 831324816 834108412 835225403 836463213 838373780 839733362
1709.2H39733362L98636M97878J656770J855910O9797p59780K05457J372039J229465
$$ 839733362 840131998 840629876 842286646 844142556 844212353 843452573 843658030 845030069 846259534
1727.6H46259534K97487L12746J463830J538933M87804J19269R22799K032280J831055
$$ 846259534 846557021 846869767 848333597 849872530 850360334 850479603 851402402 853434682 855265737
1745.9H55265737Q04066O66082J523674J697540Q68678L58343J212597K007723J107871
$$ 855265737 856069803 856735885 858259559 859957099 860825777 861184120 862396717 864404440 865512311
1764.3H65512311K98K59698J314402J109123m80592q74758L16441J187026M11034p78139
$$ 865512311 865512609 865772307 867086709 868195832 867715240 866840482 867156923 868343949 868754983 867976844
1784.7H67976844m82142Q90434J115024l87132j032174J80841R68516M7743j088142
$$ 867976844 867494702 868385136 869500160 869113028 868080854 868261695 869230211 869277954 868189812
1803H68189812n70834O50048N99742o18517r18925K11060Q28266k2232q12948j89483
$$ 868189812 867618978 868269026 868868768 868250251 867331326 867542386 868370652 868348420 867535472 867345989
1823.4H67345989Q22544N59747p24912j126408J1623O36816k52426r71317j99676P03991
$$ 867345989 868168533 868728280 868003368 866876960 866888583 867525399 867272973 866301656 866101980 866805971
1843.8H66805971K5391j132309r60291J63317N31137l73006j039028l67582N23746
$$ 866805971 866831362 865699053 864738762 864902079 865433216 865060210 864021182 863653600 864177346
1862.2H64177346K48194n59866n50390J45614K07484o17862j088976l50535M35829
$$ 864177346 864425540 863865674 863315284 863460898 863668382 863050520 861961544 861611009 862046838
1880.5H62046838l7432r42349o82176L41416L99351n76258r88304k34008M83572K7061
$$ 862046838 862009406 861067057 860384881 860726297 861125648 860549390 859561086 859327078 859810650 859837711
1900.9H59837711p86483m97699M80354N14388m96924q57234J6212O22511p2062q58545
$$ 859837711 859051228 858553529 859033883 859548271 859051347 858194113 858210325 858832836 858760774 857902229
1921.3H57902229m93825L66629L46660n35071q17418J0312N81085o675o35982j77383
$$ 857902229 857408404 857775033 858121693 857586622 856769204 856779516 857360601 857353926 856717944 856540561
1941.7H56540561N92887L47793n67257p31230R4235N37515j49131q02219k66314O13034
$$ 856540561 857133448 857481241 856913984 856182754 856276989 856814504 856665373 855863154 855596840 856209874
1962.1H56209874M15623n37753p65860P868M24981j94251p56205k65956M65870J80126
$$ 856209874 856625497 856087744 855321884 855329752 855754733 855560482 854804277 854538321 855004191 855184317
1982.5H55184317o91474p33256J13010M48585k81692p94828j84715N46217K25962n98550
$$ 855184317 854492843 853759587 853872597 854321182 854039490 853244662 853059947 853606164 853832126 853233576
2002.9H53233576n89550J92642M32253k60234o85513j08182M65035n4419r90390j050890
$$ 853233576 852644026 852836668 853268921 853008687 852323174 852214992 852680027 852625608 851635218 850584328
2023.3H50584328j67250N43594J84595l71038J1503N30660R6262o65844n50866K08915
$$ 850584328 850417078 850960672 851145267 850774229 850785732 851316392 851412654 850746810 850195944 850404859
2043.7H50404859L17156m16696p16329l3617N10276J3470p13229m85778K88367L09587
$$ 850404859 850722015 850305319 849588990 849555373 850065649 850079119 849365890 848880112 849168479 849478066
2064.1H49478066m25220o45279J5854M68076k9147o77168m18425L13759K99752m13776
$$ 849478066 849052846 848407567 848423421 848891497 848862350 848185182 847766757 848080516 848380268 847966492
2084.5H47966492n87284Q8155M96924m0412o69360l87490L13520K26260n02170o16490
$$ 847966492 847379208 847467363 847964287 847923875 847254515 846867025 847180545 847406805 846904635 846288145
2104.9H46288145P9274M36187j32323o96242l52859K90692J55449n03004n41508J37746
$$ 846288145 846367419 846803606 846671283 845975041 845622182 845912874 846068323 845565319 845023811 845161557
2125.3H45161557M15087j84834o95884k81692L48568J18494n55217n14269J91569M06742
$$ 845161557 845576644 845391810 844695926 844414234 844762802 844881296 844326079 843811810 844003379 844410121
2145.7H44410121k27928o61671j84774M00185J32561m96149l83854L17514M21584l07322
$$ 844410121 844182193 843520522 843335748 843735933 843868494 843372345 842988491 843306005 843727589 843420267
2166.1H43420267p25925j60694M70400J64091n05685m15027K41577L31164l15547o54996
$$ 843420267 842694342 842533648 843004048 843168139 842662454 842247427 842489004 842820168 842504621 841849625
2186.5H41849625j59919L23832l2842o12021m04715K45809K38896m29631o82830j36257
$$ 841849625 841689706 842013538 841980696 841368675 840963960 841209769 841448665 841019034 840336204 840199947
2206.9H40199947K92719q1480n69403l15726K77281K18868m24087n98967l5584L06308
$$ 840199947 840492666 840411186 839841783 839526057 839803338 840022206 839598119 838999152 838963568 839269876
2227.3H39269876j33574n84244k64585K96890J39535n33283o59883p8738K10941k44736
$$ 839269876 839136302 838552058 838287473 838584363 838723898 838190615 837530732 837451994 837662935 837418199
2247.7H37418199o31035k62558K64585M4942n78106n82337K7716K68996j84417n16713
$$ 837418199 836787164 836524606 836789191 836834133 836256027 835673690 835701406 835970402 835785985 835269272
2268.1H35269272j44779L22163N5670n67197n52595J2636J47164l22699n44191j30117
$$ 835269272 835124493 835446656 835502326 834935129 834382534 834395170 834542334 834219635 833675444 833545327
2288.5H33545327K22504j08659o47962n63443r417R8884l61562n03600J8061M35352
$$ 833545327 833767831 833659172 833011210 832447767 832438350 832537234 832175672 831672072 831690133 832125485
2308.9H32125485J24574m35710l83377J96218L57270j46210m06444L8684L85403k0563
$$ 832125485 832250059 831814349 831430972 831627190 831984460 831838250 831431806 831470490 831855893 831835330
2329.3H31835330o50883n98431m7505M8101l66151m67360j57178k03549m76897l12269
$$ 831835330 831184447 830586016 830538511 830586612 830220461 829753101 829595923 829392374 828915477 828603208
2349.7H28603208K05278O63102N69224L8744j57118J20282L6299p03812j148045p75873
$$ 828603208 828808486 829471588 830040812 830079556 829922438 830042720 830079019 829375207 828227162 827451289
2370.1H27451289m00007o39319r45509o94096k01523j44720n27740o94692l16680O2406
$$ 827451289 827051282 826411963 825466454 824772358 824570835 824426115 823898375 823203683 822887003 822949409
2390.4H22949409j13248m67122l58105J6928n364m51982o50585k95341P510k39849
$$ 822949409 822836161 822369039 822010934 822027862 822022498 821570516 820919931 820624590 820632100 820392251
2410.8H20392251n67257l90351j2160p0631m81665o13809k91943p0572l22938n80132
$$ 820392251 819824994 819434643 819422483 819351852 818870187 818256378 817964435 817893863 817570925 816990793
2431.2H16990793l48866r120j38163n29826n64039j90139j4543l05712n21541k64645
$$ 816990793 816641927 816632807 816494644 815964818 815400779 815210640 815196097 814890385 814368844 814104199
2451.6H14104199L5465j30653n20349n43654k06113j13368m31716n86629k92838k8669
$$ 814104199 814139664 814009011 813488662 812945008 812738895 812625527 812193811 811607182 811314344 811285675
2472H11285675k29776n80609n22375j72794r8586l55363m34160j46449N9605j73867
$$ 811285675 811055899 810475290 809952915 809780121 809681535 809326172 808892012 808745563 808805168 808631301
2492.4H08631301m81248l53098q225n842l05771l64960o5863R0480j82807m91560l78430
$$ 808631301 808150053 807796955 807788730 807782888 807477117 807112157 807046294 807136774 806953967 806462407 806083977
2514.9H06083977q4758j45256m62890m98295k05993j08183m20332o75737m94302k24232
$$ 806083977 805999219 805853963 805391073 804892778 804686785 804578602 804158270 803482533 802988231 802763999
2535.3H02763999l22223n94378n61475k47241j62243m61579o52492m03821j38700l06189
$$ 802763999 802441776 801847398 801285923 801038682 800876439 800414860 799762368 799358547 799219847 798913658
2555.6G98913658n65291m32968j18256r7930l84569n30899l10123j19567k98380n13375
$$ 798913658 798348367 797915399 797797143 797699213 797314644 796783745 796473622 796354055 796055675 795542300
2576G95542300l86298j35481j87993n08488o23345l71635j85311l37898m77195k54274
$$ 795542300 795156002 795020521 794832528 794324040 793700695 793329060 793143749 792805851 792328656 792074382
2596.4G92074382O2347P868k96057l21805k0087J21713q5473k31743K3782L40939K28762
$$ 792074382 792136729 792144597 791848540 791526735 791506648 791628361 791542888 791311145 791334927 791675866 791904628
2618.9G91904628r8228j23739J16586J94907K981r3460J25169L18826J23202k18331
$$ 791904628 791806400 791682661 791799247 791994154 791997135 791903675 792028844 792347670 792470872 792252541
2639.3G92252541k30313K4796P6890j45972k43425n5313P6413j57357m96268m97460
$$ 792252541 792022228 792047024 792123914 791977942 791734517 791679204 791755617 791598260 791101992 790604532
2659.7G90604532k86162k93851n24342n99623l78311k22265m59075p87676p37726m96328
$$ 790604532 790318370 790024519 789500177 788900554 788522243 788299978 787840903 787053227 786315501 785819173
2680.1G85819173n40972p66754p16984m10796l25977o27637q84533p33555m44948m54784
$$ 785819173 785278201 784511447 783794463 783383667 783057690 782430053 781545520 780811965 780367017 779912233
2700.5G79912233o50346n89430k72274j55747l84569n42105l29733m4822p6890k78533
$$ 779912233 779261887 778672457 778400183 778244436 777859867 777317762 776988029 776943207 776866317 776587784
2720.9G76587784k01821J31249J79053j69456l53575j05202J72913Q2552j51097k0743
$$ 776587784 776385963 776517212 776696265 776526809 776173234 776068032 776240945 776323497 776172400 776151657
2741.2G76151657L48210L69430J2040j87635J371K05218O6758j98961j51217R9898
$$ 776151657 776499867 776869297 776881337 776693702 776695073 776900291 776967049 776768088 776616871 776716769
2761.6G76716769K1279l85762n55098l20852j35302l19779o13034n70893k98917l47436
$$ 776716769 776738048 776352286 775797188 775476336 775341034 775021255 774408221 773837328 773538411 773190975
2782G73190975p32541q58188o07431n51044q85666j121759r30429o96122r00388j312018
$$ 773190975 772458434 771600246 770992815 770441771 769556105 768434346 767503917 766807795 765907407 764595389
2802.4G64595389j358986r99391p43329q77917j020849p97689n17964o61910j099169
$$ 764595389 763236403 762237012 761493683 760615766 759594917 758797228 758279264 757617354 756518185
2820.8G56518185j267373j057923r33111j067340j094699p90358m49002m34696o76036
$$ 756518185 755250812 754192889 753259778 752192438 751097739 750307381 749858379 749423683 748747647
2839.1G48747647p35223m40598k33233l90172m86553j35719L00467L28421J66535K57552
$$ 748747647 748012424 747571826 747338593 746948421 746461868 746326149 746626616 746955037 747121572 747379124
2859.5G47379124M95553M28379n305k81155j31488n2333m31180q56459q10802m79639
$$ 747379124 747874677 748303056 748297751 748016596 747885108 747832775 747401595 746545136 745734334 745254695
2879.9G45254695m21881o60897o85870l73900k06113m39346o69300n07653k17140k43485
$$ 745254695 744832814 744171917 743486047 743112147 742906034 742466688 741797388 741289735 741072595 740829110
2900.3G40829110n40137o44088l95238k74539o09339r85562r38714o93917p26164r48548
$$ 740829110 740288973 739644885 739249647 738975108 738365769 737380207 736441493 735747576 735021412 734072864
2920.7G34072864q44419l17752P1227l695j34886R0957M60804N15163L21567L68893
$$ 734072864 733228445 732910693 732981920 732978225 732843339 732934296 733395100 733910263 734231830 734600723
2941.1G34600723P01487Q03411N13196L68118O74069R99153Q77142N14328M41790O26147
$$ 734600723 735302210 736105621 736618817 736986935 737661004 738660157 739537299 740051627 740493417 741119564
2961.5G41119564N56588J11282k20895q9467J20819n0903l65734l49998j29819k33471
$$ 741119564 741676152 741787434 741566539 741477072 741597891 741546988 741181254 740831256 740701437 740467966
2981.9G40467966o84798r61483q41915o81341r28521j378775j415372j175522j254499
$$ 740467966 739783168 738821685 737979770 737298429 736369908 734991133 733575761 732400239 731145740
3000.3G31145740j605630j714945j372516r01282o89149o55770m23849n8293n3287
$$ 731145740 729540110 727825165 726452649 725551367 724862218 724206448 723782599 723724306 723671019
3018.6G23671019m35889o54816n58198n82099q63611j039863q72493o86049q21233
$$ 723671019 723235130 722580314 722022116 721440017 720576406 719536543 718664050 717978001 717156768
3037G17156768j007259r27508p43329p95484j105845j253665j042723q17180q73804
$$ 717156768 716149509 715222001 714478672 713683188 712577343 711323678 710280955 709463775 708589971
3055.3G08589971j069724r06170k22921M62651P86364R33945J206339J534342J545370
$$ 708589971 707520247 706614077 706391156 706853807 707640171 708574116 709780455 711314797 712860167
3073.7G12860167J295865J205623J259029J143694Q46207O57916Q06808R82881P07507
$$ 712860167 714156032 715361655 716620684 717764378 718610585 719268501 720075309 721058190 721765697
3092.1G21765697K43008K08438N33700N66423J86681M7207M06861O40214L04043n2213
$$ 721765697 722008705 722217143 722750843 723317266 723503947 723551154 723958015 724598229 724902272 724850059
3112.4G24850059R3579L48508K14398k54094n32032k76863K9027j17778m56334m72426
$$ 724850059 724943638 725292146 725506544 725252450 724720418 724443555 724472582 724354804 723898470 723426044
3132.8G23426044j45078M2379j69694l97980j96159J22010M6373j41084k2114J14799
$$ 723426044 723280966 723323345 723153651 722755671 722559512 722681522 722727895 722586811 722564697 722679496
3153.2G22679496p6771l58939l46303n8711N6923k12550m90606m17173j72615j80364
$$ 722679496 722602725 722243786 721897483 721838772 721895695 721683145 721192539 720775366 720602751 720422387
3173.6G20422387m13716m38332k00928j12116l65555o47247n54085k65002k81632n48482
$$ 720422387 720008671 719570339 719369411 719257295 718891740 718244493 717690408 717425406 717143774 716595292
3194G16595292o13451l97682k59698m60982p20262o11723l57687m19379o63161o57976
$$ 716595292 715981841 715584159 715324461 714863479 714143217 713531494 713173807 712754428 712091267 711433291
3214.4G11433291m16278l54588o19114q48651p05182m09663m00186n98311n99504m30524
$$ 711433291 711017013 710662425 710043311 709194660 708489478 708079815 707679629 707081318 706481814 706051290
3234.8G06051290m20332o27100p42436n36799k99454m05073o43671n27560j63258j01268
$$ 706051290 705630958 705003858 704261422 703724623 703425169 703020096 702376425 701848865 701685607 701584339
3255.2G01584339m06027n71668l45647j15156k23279l61622j63436N4598j01626m69625
$$ 701584339 701178312 700606644 700260997 700145841 699922562 699560940 699397504 699452102 699350476 698880851
3275.6F98880851o44505m59373k36809l35991n53072m76956k12908k74003p02798r69112
$$ 698880851 698236346 697776973 697540164 697204173 696651101 696174145 695961237 695687234 694984436 694015324
3296F94015324q63790o67453o29068p15553p90060q85189j118958j407980j460851
$$ 694015324 693151534 692484081 691855013 691139460 690349400 689464211 688345253 686937273 685476422
3314.4F85476422j272082j174092j295150j400709j307308j246334j475453j804888
$$ 685476422 684204340 683030248 681735098 680334389 679027081 677780747 676305294 674500406
3330.7F74500406j865030j614928j450121j713634k064228k015054j822710j856387
$$ 674500406 672635376 671020448 669570327 667856693 665792465 663777411 661954701 660098314
3347F60098314k021193k208889k298355k239525k225876k253711k193094k082884k032757
$$ 660098314 658077121 655868232 653569877 651330352 649104476 646850765 644657671 642574787 640542030
3365.4F40542030k137005k347052k464712k358794k174675k033174j821697j644016
$$ 640542030 638405025 636057973 633593261 631234467 629059792 627026618 625204921 623560905
3381.7F23560905j658380j704216j470387j001060r89079j506805j579166r64463n95033
$$ 623560905 621902525 620198309 618727922 617726862 616737783 615230978 613651812 612687349 612092316
3400F12092316j069486j630545j410782q62777o85394q64089j038670q56161m88341
$$ 612092316 611022830 609392285 607981503 607118726 606433332 605569243 604530573 603674412 603186071
3418.4F03186071m54366o34373n12659j28865N9187n3644J8895L64959L76522J0610
$$ 603186071 602731705 602097332 601584673 601455808 601514995 601461351 601480246 601845205 602221727 602232337
3438.8F02232337q5592K77042O87003P93219O82413P34568J016259J211167J162231
$$ 602232337 602146745 602423787 603110790 603904009 604586422 605320990 606337249 607548416 608710647
3457.1F08710647J027345R85921J202047J577794J631260J265645J011729J125396
$$ 608710647 609737992 610723913 611925960 613503754 615135014 616400659 617412388 618537784
3473.4F18537784J246929J313329J425623J392603J316548J339912J382053J526773
$$ 618537784 619784713 621098042 622523665 623916268 625232816 626572728 627954781 629481554
3489.8F29481554J670718J558721J363874J397490J651824J725495J397431J230180
$$ 629481554 631152272 632710993 634074867 635472357 637124181 638849676 640247107 641477287
3506.1F41477287J534223J778543J677931J439869J379490J584172J809359J915336
$$ 641477287 643011510 644790053 646467984 647907853 649287343 650871515 652680874 654596210
3522.4F54596210J818656J669288J659155J598120J555383J807570J989067J808584
$$ 654596210 656414866 658084154 659743309 661341429 662896812 664704382 666693449 668502033
3538.7F68502033J754701J999915K126991J837731J495480J510620J705230J867771
$$ 668502033 670256734 672256649 674383640 676221371 677716851 679227471 680932701 682800472
3555F82800472J938462J948357K046764K221226K235055J989663J728713J790226K051890
$$ 682800472 684738934 686687291 688734055 690955281 693190336 695179999 696908712 698698938 700750828
3573.4G00750828K182126K190888K374768K670527K751052K461672K019763K024173
$$ 700750828 702932954 705123842 707498610 710169137 712920189 715381861 717401624 719425797
3589.7G19425797K321661K362013K292394K442182K594053K439559K152324K079606
$$ 719425797 721747458 724109471 726401865 728844047 731438100 733877659 736029983 738109589
3606G38109589K261936K344370K213121K120852K158940K253771K092540J711845J679600
$$ 738109589 740371525 742715895 744929016 747049868 749208808 751462579 753555119 755266964 756946564
3624.4G56946564J941621J993656J601458J318276J439094J557529J452565J277984
$$ 756946564 758888185 760881841 762483299 763801575 765240669 766798198 768250763 769528747
3640.7G69528747J325249J660228J910329J642227R37104O77169R41574J045823Q36015
$$ 769528747 770853996 772514224 774424553 776066780 777003884 777681053 778622627 779668450 780504465
3659G80504465P09117P89463R91821J082063R71913R09985Q46743L15488l03269j66893
$$ 780504465 781213582 782003045 782994866 784076929 785048842 785958827 786805570 787121058 786817789 786650896
3679.4G86650896L07322O39915P74562Q18491N28694J967j76669r9837P4327K55763
$$ 786650896 786958218 787598133 788372695 789191186 789719880 789721847 789545178 789445341 789519668 789775431
3699.8G89775431J65343n4240J20580M86374L49701l26991n75364j93059K02953K62142
$$ 789775431 789940774 789886534 790007114 790493488 790843189 790516198 789940834 789747775 789950728 790212870
3720.2G90212870J1444j33753J8775K07663K05815Q7499n3227j78277j96040j11580
$$ 790212870 790224314 790090561 790109336 790316999 790522814 790610313 790557086 790378809 790182769 790071189
3740.6G90071189m4047j0550O8187j27852o53386o82890k22028j02937k88009k71082
$$ 790071189 790027142 790016592 790084779 789956927 789303541 788620651 788398623 788295686 788007677 787736595
3761G87736595o795R1970r8825l47793m05729k29656j7882J05083N0008j27911k39730
$$ 787736595 787729800 787821770 787722945 787375152 786969423 786739767 786721885 786826968 786876976 786749065 786509335
3783.5G86509335l46839l76821k13981k0682O5386N7876J15156J54495j17182l86536
$$ 786509335 786162496 785785675 785571694 785551012 785616398 785674274 785789430 785943925 785826743 785440207
3803.9G85440207m60089m82440k22802R9063J53363P8201J35601l7730n26071n47707
$$ 785440207 784980118 784497678 784274876 784373939 784527302 784605503 784741104 784703374 784177303 783629596
3824.3G83629596k48611j22606r3759L2783K33352J75595k21431n08249n09679l58820
$$ 783629596 783380985 783258379 783164620 783197403 783430755 783606350 783384919 782876670 782366991 782008171
3844.6G82008171q5354K34604L19600j81794o78837m26412j60217r0063j18136j23978
$$ 782008171 781922817 782157421 782477021 782295227 781616390 781189978 781029761 780939698 780821562 780697584
3865G80697584l9935r5487j79112j38998k02298k44319k02954j21295j4365j69337
$$ 780697584 780657649 780562162 780383050 780244052 780041754 779797435 779594481 779473186 779458821 779289484
3885.4G79289484l14951j40726j19925k87890k01643N066L8982j25468l76642m01199
$$ 779289484 778974533 778833807 778713882 778425992 778224349 778229415 778268397 778142929 777766287 777365088
3905.8G77365088j46985p093q6426j71185j63853j20342p7963o7055j00374o1691J9848
$$ 777365088 777218103 777211010 777124584 776953399 776789546 776669204 776591241 776524186 776423812 776362121 776381969
3928.3G76381969q0347k69413k38359p2300J4007J0312o5506q1181o974j02580l25262
$$ 776381969 776301622 776032209 775793850 775721550 775735557 775745869 775680363 775599182 775592208 775489628 775164366
3950.7G75164366l09587p5936K6941l2604j5497L6657l0458j60634k22266j39833k5570
$$ 775164366 774854779 774778843 774805784 774773180 774757683 774794340 774763882 774603248 774380982 774241149 774215579
3973.1G74215579l4809j16944j23382j7881M1127r8586k62678k25782q3745n3525j15514
$$ 774215579 774180770 774063826 773940444 773922563 773963690 773865104 773602426 773376644 773292899 773239374 773123860
3995.6G73123860q5413
$$ 773123860 773038447
3997.6G73038447
$$ 773038447
##END=$$ End of the data block
