##TITLE=G4 - [FeSalen] $$ Begin of the data block
##JCAMP-DX=5.00 $$ ACD/SpecManager v 10.08
##SPECTROMETER/DATA SYSTEM=Alpha
##DATE=23 Jun 2014 11:13:46
##DATA TYPE=INFRARED SPECTRUM
##DATA CLASS=XYDATA
##ORIGIN=
##OWNER=
##NPOINTS=1765
##FIRSTX=399.75695801
##LASTX=3997.56933594
##MAXX=3997.56933594
##MINX=399.75695801
##MAXY=0.86542958
##MINY=0.31017426
##XFACTOR=1.0000000000
##YFACTOR=1.000000000000000e-9
##FIRSTY=0.78283131
##DELTAX=2.03957629
##XUNITS=1/CM
##YUNITS=ARBITRARY UNITS
##XYDATA=(X++(Y..Y))
399.8G82831311J0504484Q827568N521714J972914l4213j251936k848864m491508p717311
418.1G93314159j2791038j7850697k6619613l7359238m2317092l2615960l147125L1932771
434.4F52546167N0787390M5556962K9931665J6832292P767319J608730n360306j7325997
450.7G82344222k9414236k3748398l28362J5082776J5325666J6967773J7004013J1281610
467.1H04515064N738437K217412P77900R85027Q45730M53591L77476q21292k445400
485.4H12643945q11219K679348L179371J561880Q69811L12626p94768j122773q75771
503.8H17642450j345992j581311r21369j281261m318714r753287j2010515l084004
520.1G83345997R220243J1216819N113661r75072n497217j1977375k2740543k7191162
$$ y = [782831311, 793335795, 802163363, 807685077, 809657991, 809623778, 808371842, 805522978, 801031470, 793314159, 780523121, 762672424, 736052811, 698693573, 656376481, 623760521, 620613396, 652546167, 703333557, 748890519, 778822184, 795654476, 803421795, 805030525, 799670219, 782344222, 752929986, 729181588, 728853226, 743936002, 759261668, 776229441, 793233454, 804515064, 810253501, 812470913, 813248813, 814233840, 815079570, 815533161, 815910637, 815089345, 812643945, 811832726, 814512074, 817691445, 819253325, 820123136, 820435762, 819640994, 818518221, 817642450, 816296458, 814715147, 813793778, 812512517, 808193803, 798440516, 786430001, 783345997, 792566240, 803783059, 808896720, 807921648, 802424431, 790447056, 767706513, 740515351]
536.4G40515351q450746K0476341K8796256J7793774P431507K537072k90155j978577
552.7H06830823l514468p666350j5274167j6811073j228809J7250240J8490136R007334
569H07083666J898349j198888l082872o231904j2203872k1905660k9050410j6536355
585.4G18772054J3926267L0913174K3081780J0087371L640294j02103l731429m326106
601.7G92261302j653134r03011n312562j5393793l2724619n1524997m8427701p310808
618F29010677M0721059N5858255M4793784K8854072J4967859L816366k443194r3103
634.3H15485775O452740O457030o92129n779743j671135O252646Q071661N010545K497197
652.7H42084587J386106Q06212M60804M04179L91304j38581j001954m8458J522004
$$ y = [740515351, 732064605, 752540946, 781337202, 799130976, 806562483, 809099555, 808809400, 806830823, 803316355, 795650005, 780375838, 763564765, 762335956, 779586196, 798076332, 807083666, 808982015, 807783127, 804700255, 798468351, 786264479, 764358819, 735308409, 718772054, 732698321, 763611495, 786693275, 796780646, 800420940, 800318837, 796587408, 792261302, 790608168, 789705157, 784392595, 768998802, 736274183, 684749186, 636321485, 629010677, 669731736, 725589991, 770383775, 799237847, 814205706, 818022072, 815578878, 815485775, 821938515, 828395545, 827703416, 821923673, 820252538, 826505184, 834576845, 839587390, 842084587, 843470693, 844276905, 844737709, 845141888, 845533192, 845394611, 844392657, 844344199, 845866203]
671H45866203R92716L81052M13954L78371K18451L34143L94583P8559L9816L54230
691.4H49452078K17378j25229N4956K09272j64509l25501o0916p4148l04044j96755
711.8H48682582k31862o93917r01759o87420p76291j248121j489103j827121k780735
730.2H38046253m067779o101489q599102p947386n056560p073402j1328221q916854
746.5G78955460q295238k3593903n1682949p3055863n8893025r111047K6465475J0306836
762.8E91095746j7873943M129767N7650805P9334557N9392512L1242370J4449418O104707
779.1H25525939K03968n451441j1547327j7129124k0254254k0974457j8104911j0000050
795.4G22268343k680838J395464J1614442K7119338L3271790K6459336J5784681P779360
$$ y = [845866203, 846858919, 847239971, 847653925, 848032296, 848250747, 848584890, 848979473, 849058032, 849097848, 849452078, 849669456, 849544227, 849599183, 849808455, 849643946, 849318445, 849257529, 849183381, 848879337, 848682582, 848450720, 847756803, 846855044, 846167624, 845391333, 844143212, 842654109, 840826988, 838046253, 833978474, 827876985, 819277883, 811330497, 806273937, 799200535, 787872314, 778955460, 770660222, 747066319, 695383370, 622327507, 563434482, 554323435, 580788910, 591095746, 573221803, 577351570, 635002375, 714336932, 773729444, 804971814, 819421232, 825525939, 825729907, 820278466, 808731139, 791602015, 771347761, 750373304, 732268393, 722268343, 719587505, 720982969, 732597411, 759716749, 792988539, 819447875, 835232556, 843011916]
811.7H43011916K864957j77801j220644L00408L311336N330980N197584L683210J997113
830.1H64299059Q51512K79009j72198o00636r05156j480698k907992n824983r092450
848.5H44445467o838322K371371P799804L915370l455401j1274457j5995144q591295
864.8H12377393Q373499J7304480J2248516M124880j17540j531363k013027l013313
881.1H47753525n559623r737492j2913585q648753J812935N577147k206028j5043675
897.4H01034451l0623436m6701193m2847514j809478M5616150N7343900L9912224K0706474
913.7H42631578R654999M580498K292693J235306P52807M53889J72555j27554q33153
932.1H60813618k407193m310251l358841O51837K123475p03097m286527n765260n038976
$$ y = [843011916, 845876873, 845699072, 844478428, 844778836, 848090172, 853421152, 858618736, 862301946, 864299059, 865150571, 865429580, 865257382, 864656746, 863751590, 862270892, 859362900, 853537917, 844445467, 837607145, 839978516, 847778320, 851693690, 848238289, 836963832, 820968688, 812377393, 820750892, 838055372, 850303888, 854428768, 854311228, 852779865, 850766838, 847753525, 842193902, 832456410, 819542825, 810894072, 812707007, 818284154, 816078126, 801034451, 770411015, 723709822, 680862308, 679052830, 724668980, 782012880, 821925104, 842631578, 852286577, 856867075, 859159768, 860395074, 861147881, 861601770, 861774325, 861646771, 860813618, 858406425, 854096174, 850737333, 851389170, 853512645, 852809548, 848523021, 842757761, 837718785]
950.4H37718785m868388k865672M377901Q772791N506455Q7560n168140j0750115j1438191
968.8H21372986m267872K466739N048155M087925n699694j6087353o826639J3936877
985.1H14031124J8639326R142816K306223R6977o70195j206815j919210l122687m803419
1003.5H32494140n026758j624584K136111J886427n13672k188504l172755m339755
1019.8H19650650n983829q806646j4357508k3117363k5568068j1149168Q130848J7781079
1036.1G56579995J7157972N448699j3394833k8686344k4738610M882753L4971893L9002359
1052.4G91223884K4668634J1314749M270315J096428m57406j439095k181887k978325
1068.7H25517297m173994o243587q817434r058952o271661p575571j8033266k9543221
$$ y = [837718785, 832850397, 829984725, 834362626, 843135417, 848641872, 848729432, 843561292, 832811177, 821372986, 817105114, 819571853, 824620008, 828707933, 823008239, 806920886, 800094247, 814031124, 832670450, 841813266, 844119489, 844216466, 843546271, 842339456, 840420246, 837297559, 832494140, 827467382, 825842798, 827978909, 829865336, 829351664, 827163160, 823990405, 819650650, 813666821, 804860175, 790502667, 767385304, 741817236, 730668068, 738798916, 756579995, 773737967, 779186666, 765791833, 737105489, 712366879, 717249632, 752221525, 791223884, 815892518, 827207267, 831477582, 832574010, 832116604, 830677509, 828495622, 825517297, 821343303, 815099716, 806282282, 797223330, 790951669, 783376098, 765342832, 735799611]
1085G35799611k0877064J2911678L7322700L0985176J4667094N319774J298487m77433
1101.4H16950023j082122j457334k281666l621220n798102r441971j3839543j5650988
1117.7G63777077j6850531k4645626k7791620n056202L1262159M6044529L2081067
1132G98820853J1190057l579140j8446862m0704787m8941195j4032364K9032171L4880459
1148.3G48219192K4970412K0913124J5713096R335816M827380K164960Q42094j26063
1164.6H26860011q98421j260996j531661j947224k390861k919853l758550m679262
1180.9H07473183n401910o453573q835137j3321221j9540906k2057772j2454331L986717
1197.2G23395050R839892M051387J741588N142630M309475j153052l174901K95520
$$ y = [735799611, 714922547, 727834225, 765156925, 796142101, 810809195, 816128969, 817427456, 816950023, 815867901, 814410567, 812128901, 808507681, 802709579, 793267608, 779428065, 763777077, 746926546, 722280920, 694489300, 689433098, 720695257, 766739786, 798820853, 810010910, 806431770, 787984908, 747280121, 698338926, 684306562, 713338733, 748219192, 773189604, 794102728, 809815824, 819151640, 823979020, 826143980, 826986074, 826860011, 825961590, 824700594, 823168933, 821221709, 818830848, 815910995, 812152445, 807473183, 802071273, 795617700, 786782563, 773461342, 753920436, 731862664, 719408333, 723395050, 733234942, 737286329, 739027917, 744170547, 748480022, 747326970, 744152069, 744447589]
1213.5G44447589L843605L485859P72059k040088l916741l209948k40088J862109K189517
1231.9G47193873K941072J719654o862045k1339059k9165148j6943932M241824O011784
1248.2F87798023n856216N670131L4588634L9106012J8041074k615213j7592371l4125209
1264.5G25014865m7469616l0883431K1990597N9253991M6316743J6067982j115680
1278.8G89175451p595301j0480106j2848973j5589535j7465294j7088055j5960872
1293.1F92147315j6838789k1197260k4783015j9236148p237792j71780P187426K8263509
1309.4F38133466M9100340M7683000L0623138J4338315J3590j9478441m4737875m6148658
1325.7F69526875l75569M1334570L7172913K3612082K1117747J6097069R275734N463124
$$ y = [744447589, 748291194, 751777053, 752549112, 750509024, 746592283, 743382335, 743142247, 745004356, 747193873, 750134945, 751854599, 744992554, 723653495, 694488347, 677544415, 681786239, 687798023, 681941807, 687611938, 722200572, 761306584, 779347658, 776732445, 759140074, 725014865, 677545249, 646661818, 668652415, 727906406, 774223149, 790291131, 789175451, 781580150, 771100044, 758251071, 742661536, 725196242, 708108187, 692147315, 675308526, 654111266, 629328251, 610092103, 602854311, 602682531, 609869957, 638133466, 687233806, 734916806, 765539944, 779878259, 779891849, 760413408, 715675533, 669526875, 669151306, 710485876, 747658789, 771270871, 792388618, 808485687, 817761421, 823224545]
1342H23224545M197180L759324K543569R28938k48491j055539j559317j669407j706302
1360.4H28414500j681507j673996k078474k969146l829777n033851p273137j0727227
1376.7G93147385j7974317l2181144m1780293k2066414J5703618K6163340J5997410
1391G37009585J8984198K3781717J5863657O831706K870262Q53419m62234j240671
1407.3H04491639j895666k597630l143609l657937m851222o461680p014095q646548
1423.6G66223252j2372315j7246306k1989644k0596504j5992462k0239711k9539585
1437.9F28246725l4980297m6480716m6980619j156539P1698576R7457290O7166865
1452.2G34971285L0853689N173504j4303804k9587686m6180784m1684330P098437L4989595
$$ y = [823224545, 827421725, 831181049, 833724618, 834653556, 834405065, 833349526, 831790209, 830120802, 828414500, 826732993, 825058997, 822980523, 820011377, 816181600, 811147749, 803874612, 793147385, 775173068, 742991924, 701211631, 679145217, 694848835, 721012175, 737009585, 755993783, 779775500, 795639157, 802470863, 805341125, 806194544, 805732310, 804491639, 802595973, 799998343, 796854734, 793196797, 788345575, 781883895, 774869800, 766223252, 753850937, 736604631, 714614987, 694018483, 678026021, 657786310, 628246725, 593266428, 546785712, 499805093, 498648554, 570347130, 667804420, 734971285, 765824974, 770998478, 756694674, 727106988, 680926204, 639241874, 646340311, 681329906]
1468.5F81329906J0436118j7625571J2552441N6644141M7508419J6651630O08862k983869
1484.8H05122077k268374k52902J16348k210617n645037r102582r658635o969810l414690
1503.2G65715778j005709j439989k649486q03769K929688N728960N866885L821552
1519.5G78163910J865446j18911k808749n526424p048070r254277j3646066j5834511
1535.8G25792348k1852612m6539664o6246510l7557661K3118555P0804536P1056784
1550.1G18575776L5131991J47581k2533536l6893428l587424L7093579L3821941J5133977
1566.4G76890457k03729o082535o556690p658123j0636271j1067807j1490822j4033198
1582.7G09161282j6306401j8869996k4231195l3972919m5851946m8632145l2431871
$$ y = [681329906, 691766024, 674140453, 686692894, 743337035, 790845454, 807497084, 808105946, 805122077, 802853703, 802600801, 802717149, 800506532, 794861495, 785758913, 776100278, 769130468, 765715778, 764710069, 763270080, 760620594, 759816825, 762746513, 768475473, 774342358, 778163910, 780029356, 779910445, 777101696, 771575272, 764527202, 755272925, 741626859, 725792348, 703939736, 657400072, 591153562, 553595901, 576714456, 647518992, 718575776, 753707767, 753855348, 731321812, 694428384, 690840960, 727934539, 761756480, 776890457, 776686728, 770604193, 764047503, 756389380, 745753109, 734685302, 723194480, 709161282, 692854881, 673984885, 649753690, 615780771, 569928825, 521296680, 488864809]
1597D88864809O99103M0314287N8767200L9186358O272912j6198814k5805592k7546764
1613.3E64553499k9512822k9799521k1728307k1415174l5554529m8625409m7181279
1627.6C30736458k0562201K5144040O7347080Q9082449M4478089j3870716l0191451
1641.8D92163748o056488M6153635P8178763N7127893M4749677M5973540K4955153
1656.1G83245921J2465894R738207Q295894O532788M109264K788603K470374J754105
1672.4H31401050Q35359M04835N782n79715j115799p57456K82824M58598M35531K92063
1692.8H31663072Q4758K31445O26802J478434J872301J628220J590788J246453N57184
1711.2H40979457r8765n54562m57763J37388J66476l12686o21259p53224p95901p88808
$$ y = [488864809, 489563912, 529878199, 588645399, 627831757, 634104669, 617905855, 592100263, 564553499, 535040677, 505241156, 483512849, 462097675, 426543146, 377917737, 330736458, 310174257, 335318297, 402665377, 491747826, 536225915, 522355199, 492163748, 486107260, 532260895, 610439658, 667567551, 712317228, 758290768, 783245921, 795711815, 805450022, 813745916, 820278704, 824387968, 827176571, 829646945, 831401050, 832236409, 832641244, 832647026, 832067311, 830951512, 830194056, 830476880, 830935478, 831371009, 831663072, 831747830, 831979275, 832606077, 834084511, 835956812, 837585032, 839175820, 840422273, 840979457, 840880692, 840326130, 839868367, 840005755, 840172231, 839859545, 839238286, 838485062, 837689161, 836900353]
1731.6H36900353o08444M4763J10567k07007j31190q34k11835m67897l70085O5565
1752H35123956J36078r2388j64508k81752l32832j44005k07185m86792o47604n29587
1772.4H32373381k02835l02195p89822j300931j615285j451254o55234O1929J75953
1790.7H26293707K37346J89721l06487q36551j099706j233101j166641o15061O9857
1809.1H21533084L00646P1704l26514o44326n50032j53661J08898K08378J16586j51634
1829.5H20513129k75373l03269l07977j52826m3571r9719p7247J05381J41263J29342
1849.9H19629133J35302j2815j68442k56420m13775n93722p12991r65178j240134r99868
1870.3H14401090m98414k79367j69277r298M2200r3460k51532l51250n12839o16133
$$ y = [836900353, 836291909, 836336672, 836447239, 836240232, 836109042, 836108208, 835896373, 835428476, 835058391, 835123956, 835260034, 835167646, 835003138, 834721386, 834388554, 834244549, 834037364, 833550572, 832902968, 832373381, 832170546, 831868351, 831078529, 829777598, 828162313, 826711059, 826055825, 826117754, 826293707, 826531053, 826720774, 826414287, 825577736, 824478030, 823244929, 822078288, 821463227, 821533084, 821833730, 821905434, 821578920, 820934594, 820384562, 820230901, 820339799, 820548177, 820664763, 820513129, 820237756, 819934487, 819626510, 819473684, 819430113, 819330394, 819253147, 819358528, 819499791, 819629133, 819764435, 819751620, 819583178, 819326758, 818912983, 818319261, 817606270, 816641092, 815400958, 814401090, 813902676, 813623309, 813454032, 813444734, 813486934, 813393474, 813141942, 812790692, 812277853, 811661720]
1890.7H11661720n76198n43117n63741p05242j043678j479446j575828j160204p01845
1909H03312421n25177l86297p3731K05695J33634k65598o07789p12335o98149o51956
1929.4G99730718p42316j053870j153707p39336j58787L02434O93321Q49366P14183
1947.8G98442006M52936J27673j57595k11775l8922O2764n3525j97053k46286k69652
1968.2G97910571l28481l78788l57806l51727m07040m23670m11630m42326m68910m87506
1988.6G93852687n97894p22885p74801q89063j090705j178265r72390n48482j98245
2006.9G86879957j11461k47240n07593p32959p32362n97179n91755o51300o24895o39677
2027.3G81443536p15255o80805n77688n71072o27816o98805q92639j174629j282930
$$ y = [811661720, 811085522, 810542405, 809978664, 809273422, 808229744, 806750298, 805174470, 804014266, 803312421, 802787244, 802400947, 802327216, 802532911, 802666545, 802400947, 801793158, 801080823, 800382674, 799730718, 798988402, 797934532, 796780825, 796041489, 795882702, 796185136, 796878457, 797727823, 798442006, 798894942, 799022615, 798865020, 798653245, 798614323, 798677087, 798623562, 798426509, 798180223, 797910571, 797582090, 797203302, 796845496, 796493769, 796086729, 795663059, 795251429, 794809103, 794340193, 793852687, 793254793, 792531908, 791757107, 790868044, 789777339, 788599074, 787626684, 787078202, 786879957, 786768496, 786521256, 786013663, 785280704, 784548342, 783951163, 783359408, 782708108, 782083213, 781443536, 780728281, 780047476, 779469788, 778898716, 778270900, 777572095, 776679456, 775504827, 774221897]
2045.7G74221897j169920j046359r33171p04705l91901J6689P00951J499474J927257
2064G74120212J897096J699507J429141J071572P91908O39856M68730L12508L06904
2082.4G82737434K79367O9797r8050j42097k98143n22613n73993n15401m56810k32399
2102.8G80247092J45197L56794M03463N02110N08845K66373O3717Q1480Q0287j9073
2123.2G82636285l3021j3054j23381k13862j50978r4354r2209k8372j4722j51098k31325
2145.6G81489909j89603k21252l01778k45691j72019k58326k82765j04546k2352j30236
2166G79561341j98424j98901k62201l15129k67446k95163m21226m13358l13163l19063
2186.4G76557267l28481k37167k16127k99156l10897k77698l31700l43561k19167j81138
$$ y = [774221897, 773051977, 772005618, 771072447, 770367742, 769975841, 769992530, 770693481, 772192955, 774120212, 776017308, 777716815, 779145956, 780217528, 781009436, 781649292, 782118022, 782430530, 782737434, 783016801, 783086598, 782988548, 782846451, 782548308, 782025695, 781451702, 780936301, 780479491, 780247092, 780392289, 780749083, 781152546, 781654656, 782163501, 782429874, 782493591, 782575071, 782655358, 782636285, 782603264, 782590210, 782466829, 782252967, 782101989, 782007635, 781915426, 781887054, 781872332, 781721234, 781489909, 781300306, 781079054, 780777276, 780531585, 780359566, 780101240, 779818475, 779713929, 779691577, 779561341, 779362917, 779164016, 778901815, 778586686, 778319240, 778024077, 777602851, 777189493, 776876330, 776557267, 776228786, 775991619, 775775492, 775476336, 775165439, 774887741, 774556041, 774212480, 773993313, 773812175]
2206.8G73812175k82407k88010k18331k62142l22222k86699l16560m39763m42922l53396
2227.2G70599723l62218l82006k78473k04563k45094k34783j56522j55031j70052j09375
2247.6G68301606j19150k54154l49223l90292n03718o14942o10291o24121p31229p60854
2268G63343632o49869n68092n68211m71354k09748J15335L90231M33922J68025j97231
2288.4G61786640m04358m60327m62234l78370l06547l80635m40300l74376l40045l90172
2308.8G57849276m24445m37200m87864o08444p73072q58367p73191o35803o53565p78377
2329.2G51418948p52508o25611o18994o56068o07312m58241j06275N27621P51674K3186
2349.6G48896420j074195j716256j670957j349985q45194k87295J34409N11050Q24213
$$ y = [773812175, 773529768, 773241758, 773023427, 772761285, 772439063, 772152364, 771835804, 771396041, 770953119, 770599723, 770237505, 769855499, 769577026, 769372463, 769127369, 768892586, 768736064, 768581033, 768410981, 768301606, 768182456, 767928302, 767579079, 767188787, 766685069, 766070127, 765459836, 764835715, 764104486, 763343632, 762693763, 762125671, 761557460, 761086106, 760876358, 760991693, 761381924, 761815846, 761983871, 761786640, 761382282, 760921955, 760459721, 760081351, 759774804, 759394169, 758953869, 758579493, 758239448, 757849276, 757424831, 756987631, 756499767, 755891323, 755118251, 754259884, 753486693, 752850890, 752197325, 751418948, 750666440, 750040829, 749421835, 748765767, 748158455, 747700214, 747593939, 748121560, 748873234, 748896420, 747822225, 746105969, 744435012, 743085027, 742239833, 741952538, 742086947, 742597997, 743422210]
2367.9G43422210Q94845P77006O39915M90189L23534K10464N6505k03669m09543m58181
2388.3G45743275m75467n46872n43058m44234m11629m81308n74886o98686q63314r84073
2408.7G39719748j070678j138508r79602n30243r4176J05143J24931K9624j95980m28319
2429.1G35541940n12660m99129m55260l18289j16050l2127m7922Q7142M06444O94990
2449.5G34749079Q67307R28700Q12590N42998K28763j04189m50730o93977p35521p02441
2469.9G35442579p30694p21931o58631o63042o72222o09636o11782p38263q45730q97706
2490.3G28292942j027763j206398j260877j229941j254917j290142j241505j122594
2506.6G18658805r43661p30514o02782n73218m61578j63854K70188P71940J166761
$$ y = [743422210, 744317055, 745094061, 745733976, 746224165, 746547699, 746758163, 746814668, 746610999, 746201456, 745743275, 745267808, 744720936, 744177878, 743733644, 743322015, 742840707, 742265821, 741567135, 740703821, 739719748, 738649070, 737510562, 736530960, 736000717, 735906541, 736011684, 736136615, 736166239, 735970259, 735541940, 735029280, 734530151, 734074891, 733756602, 733640552, 733608425, 733560503, 733647645, 734054089, 734749079, 735616386, 736545086, 737357676, 737900674, 738129437, 738025248, 737574518, 736880541, 736145020, 735442579, 734711885, 733989954, 733331323, 732668281, 731996059, 731386423, 730774641, 730036378, 729190648, 728292942, 727265179, 726058781, 724797904, 723567963, 722313046, 721022904, 719781399, 718658805, 717715144, 716984630, 716381848, 715808630, 715347052, 715183198, 715453386, 716225326, 717392087]
2525G17392087J206100R28640O47962M57645K01642m3034q2970j04606l03209m25577
2545.4G19874680l13282k11835k76804l98159n03957o65307q93414j094043j261294
2563.7G14256585j353979j209140q53062m44055m0054K81692M08053L69012L24846
2582.1G11739898L28123L38733M47035O73473P64430N61774K06768j52707n04732q42571
2602.5G13560224j101852j150489q96334n90921o29127r59754j248419j383424j469910
2620.8G04129994j519084j402021j109600p68780m40955j10627J71781L25084L03626
2639.2F99579418J02460k43723p03156j117647j277864j202464j130760j182854j171410
2657.5F91652000q83937l78370J5795q523m30108r43183j245261j172065n81980M30405
$$ y = [717392087, 718598187, 719526827, 720174789, 720632434, 720834076, 720791042, 720708072, 720603466, 720300257, 719874680, 719561398, 719349563, 719072759, 718674600, 718170643, 717505336, 716611922, 715517879, 714256585, 712902606, 711693466, 710840404, 710396349, 710356295, 710637987, 711046040, 711415052, 711739898, 712068021, 712406754, 712853789, 713527262, 714291692, 714853466, 715060234, 714907527, 714402795, 713560224, 712458372, 711307883, 710411549, 709820628, 709191501, 708231747, 706983328, 705599904, 704129994, 702610910, 701208889, 700099289, 699330509, 698889554, 698778927, 698950708, 699275792, 699579418, 699681878, 699438155, 698734999, 697617352, 696339488, 695137024, 694006264, 692823410, 691652000, 690768063, 690389693, 690405488, 690396965, 689966857, 689023674, 687778413, 686606348, 686024368, 686454773]
2677.9F86454773J369417J869499K007842J929880J657664J241744P15613L1293p31528
2696.3F96546197j344621j717866j907646j879633j570582j029551l81768K36034O69003
2714.6F87619567P94709O77049M38928J04309k99156p57575j201272j474619j555264
2733F84346676j507521j368582j129568p26223k56359L2902O3955j4424n2810l2663
2753.4F79355383l874n3883k48909n32687q03768j013518j137495j182914j163065
2771.8F73215270j123190j136362j137913j087665j088143j110255j028836r35137
2788.1F64567769j003087j105487j062572r26853p93218o26683k03491N48721J346051
2806.4F60741150J763165J567781J075149O81162K91586j91689n71787p28429p53283
$$ y = [686454773, 687824190, 689693689, 691701531, 693631411, 695289075, 696530819, 697246432, 697277725, 696546197, 695201576, 693483710, 691576064, 689696431, 688125849, 687096298, 686714530, 686950564, 687619567, 688414276, 689091325, 689530253, 689634562, 689335406, 688577831, 687376559, 685901940, 684346676, 682839155, 681470573, 680341005, 679614782, 679358423, 679391325, 679455280, 679440856, 679388046, 679355383, 679351509, 679297626, 679048717, 678516030, 677712262, 676698744, 675561249, 674378335, 673215270, 672092080, 670955718, 669817805, 668730140, 667641997, 666531742, 665502906, 664567769, 663564682, 662459195, 661396623, 660469770, 659676552, 659049869, 658846378, 659395099, 660741150, 662504315, 664072096, 665147245, 665828407, 666119993, 665928304, 665356517, 664628088, 663874805]
2824.8F63874805p23958o62208o96242r16004j228809j503825j781047k066552k186716
2843.1F52109444k008855j389563n65708j84417m09484q00073q57889m95017p6532
2861.5F45321906M3869j55509m81248p36952q53538r06646q60155o12795l95179m94242
2881.9F39869511q43167j327276j985968k860009l989458n364955o722927p227957
2898.2F09547794n223930o9976N069077O165505L691911P47383j255572j950264q01206
2916.6F15920722J204134J670718l8922k243817k859175j009464K066850M591108N798578
2934.9F25100732N304992L327668J011967j028359k992212l856480j410127L254056
2951.2F28712237N440295L749907J101434k64168M0352J134754J447737N87404l62873
$$ y = [663874805, 663150847, 662488639, 661792397, 660876393, 659647584, 658143759, 656362712, 654296160, 652109444, 650100589, 648711026, 648145318, 647960901, 647551417, 646751344, 645893455, 645398438, 645321906, 645365775, 645210266, 644729018, 643992066, 643138528, 642231882, 641371727, 640758932, 640363753, 639869511, 639026344, 637699068, 635713100, 632853091, 628863633, 623498678, 616775751, 609547794, 604323864, 604253888, 609322965, 615488470, 619180381, 619927764, 618672192, 616721928, 615920722, 617124856, 618795574, 618756652, 616512835, 613653660, 612644196, 614711046, 619302154, 625100732, 630405724, 633733392, 634745359, 633717000, 630724788, 626868308, 625458181, 628712237, 634152532, 637902439, 639003873, 638739705, 638780057, 639914811, 641362548, 641949952, 641587079]
2969.6F41587079o30022n08844m38691l20911o3002J93655N23329Q68321R49740P09713
2990F42870367Q0406p84099j237213j191915j103580j003921q32200p55190r20058
3008.3F35122597j335025j865267k246380k130449j143515O66082K250790K479017
3024.7F31797850J679123R78827P94828Q24928N16355j4782P2420O97494Q35537k8312
3045.1F38154268j538872l178180m071295k239704K356827N512595M552901J893401
3061.4F41441941K51115J51634Q49664J025200K39134n76377k13623J181900J983762
3079.7F46334350J555324R58383Q95917J062155J001894P68424P58349R31442Q10743
3098.1F55076981L00705j54972k12193j8179O855j83523j37925J40905K24412J79886
$$ y = [641587079, 640957057, 640448213, 640009522, 639688611, 639625609, 639819264, 640342593, 641210914, 642160654, 642870367, 642950773, 642166674, 640929461, 639737546, 638633966, 637630045, 636797845, 636042655, 635122597, 633787572, 631922305, 629675925, 627545476, 626401961, 627068043, 629318833, 631797850, 633476973, 634455800, 635250628, 636075556, 636591911, 636577129, 636649549, 637347043, 638182580, 638154268, 636615396, 633437216, 629365921, 627126217, 629483044, 634995639, 639548540, 641441941, 641693056, 641844690, 642694354, 643719554, 643958688, 643382311, 643168688, 644350588, 646334350, 647889674, 648848057, 649743974, 650806129, 651808023, 652576447, 653334796, 654266238, 655076981, 655377686, 655222714, 655010521, 654992342, 654999197, 654815674, 654677749, 654818654, 655043066, 655222952]
3118.5F55222952J42336j4662j71662j68264j59561k93315m09543l52085k27273j93178
3138.9F53375745j95325o3598J02103J38164J53064J16885j58191m45008m09365k01702
3159.3F52412772p2717p6235k08437l34859l40879l03686k96175l09706l44515m45366
3179.7F49680197n97536p09534p68065p60079o82831o47127o95050p96676r28819j035452
3200.1F42059028j064241r88126q35061p11858o70493o60896p04586q63731j042724
3218.4F34517312j123190j104653r87112q31545p46905p09475o45697n89430n75840
3236.8F27203465n73099n60463n17070m56929m18782m30942m78387n39660n96404n94557
3257.2F22037172n71131n79894n73099n42104n45144n73039o39737p24733p15434o58810
$$ y = [655222952, 655365288, 655350626, 655178964, 655010700, 654851139, 654557824, 654148281, 653796196, 653568923, 653375745, 653180420, 653116822, 653218925, 653357089, 653510153, 653627038, 653468847, 653023839, 652614474, 652412772, 652340055, 652263820, 652055383, 651720524, 651379645, 651075959, 650779784, 650470078, 650125563, 649680197, 649082661, 648373127, 647605062, 646844983, 646162152, 645515025, 644819975, 644023299, 643094480, 642059028, 640994787, 640006661, 639171600, 638459742, 637789249, 637128353, 636423767, 635560036, 634517312, 633394122, 632289469, 631302357, 630470812, 629723907, 629014432, 628368735, 627779305, 627203465, 626630366, 626069903, 625552833, 625095904, 624677122, 624246180, 623767793, 623228133, 622631729, 622037172, 621466041, 620886147, 620313048, 619770944, 619225800, 618652761, 618013024, 617288291, 616572857, 615914047]
3277.6F15914047o36637o24299o40750p39754q87334r92477j062810j148820j246393
3295.9F07934773j345038j369477j248896j123428j251340j619637j935899k009750
3312.2E96031308j885414j788676j809239j842797j802444j776100k000868k297342
3328.6E80828428k344787k279222k168059k034009k193510k532125k700209k791465
3344.9E61785042k699792k399981k517700l030718l188729k952039k810180k909780
3361.2E39276123k942383k662957k453923k761364l245115l250182k840161k543748
3377.5E16576290k452731k418101k340555k137303j810015j491725j582086j992345
3393.8E00351429j963943j430959j185089j641780k071679j797020j338184j216114
$$ y = [615914047, 615277410, 614653111, 614012361, 613272607, 612385273, 611392796, 610329986, 609181166, 607934773, 606589735, 605220258, 603971362, 602847934, 601596594, 599976957, 598041058, 596031308, 594145894, 592357218, 590547979, 588705182, 586902738, 585126638, 583125770, 580828428, 578483641, 576204419, 574036360, 572002351, 569808841, 567276716, 564576507, 561785042, 559085250, 556685269, 554167569, 551136851, 547948122, 544996083, 542185903, 539276123, 536333740, 533670783, 531216860, 528455496, 525210381, 521960199, 519120038, 516576290, 514123559, 511705458, 509364903, 507227600, 505417585, 503925860, 502343774, 500351429, 498387486, 496956527, 495771438, 494129658, 492057979, 490260959, 488922775, 487706661]
3410.1D87706661j305938j438766j414866j170665r96440r43840p68780m55320k38866
3428.5D78973180k87771k73407n7310j43259m79430m25220l069L36676M62383M75198
3448.9D78577971N33134O32405P26671Q63641R73403R08763R14454J224935J395881
3467.2D86751258J047165O05821O55085J016617J276105J239926R78530R52541J190961
3485.6D95714009J226991J135737J215607J315802J320899J248657J247466J327992
3501.9E05753160J184344R94980J103759J375258J584947J527607J310528J286506
3518.2E16121089J466394J635671J499772J229047J310885J573682J686990J737953
3534.5E28261483J703798J609684J746475J931966J806199J497507J427114J584769
$$ y = [487706661, 486400723, 484961957, 483547091, 482376426, 481379986, 480436146, 479667366, 479212046, 478973180, 478685409, 478412002, 478354692, 478211433, 477732003, 477306783, 477303714, 477640390, 478102773, 478577971, 479111105, 479743510, 480470181, 481333822, 482307225, 483215988, 484130442, 485355377, 486751258, 487798423, 488404244, 489059329, 490075946, 491352051, 492591977, 493570507, 494523048, 495714009, 496941000, 498076737, 499292344, 500608146, 501929045, 503177702, 504425168, 505753160, 506937504, 507932484, 509036243, 510411501, 511996448, 513524055, 514834583, 516121089, 517587483, 519223154, 520722926, 521951973, 523262858, 524836540, 526523530, 528261483, 529965281, 531574965, 533321440, 535253406, 537059605, 538557112, 539984226, 541568995]
3550.9E41568995J690328J751303J812339J842857J776158J555026J461446J892090
3567.2E55350542K365470K283394K078534K091646K202451K340853K458155K386272
3583.5E73557317K140582K069950K353668K446890K314866K356052K519071K542138
3599.8E92300534K429724K246082K034783K018392K178252K254725K224802K063036
3616.1F09750330J968146K200186K241671J779676J189768J089454J739740K004802
3632.4F23963773J732588J468659J325666J200319R74834O24299K68876M70579J210570
3650.8F33240163J259864Q40902Q10981R97901P35760L09586J40429p0692l79920j79350
3671.2F37705624M6015j73688J85966P13826O90281N25594L61979J72019P1287L17872
$$ y = [541568995, 543259323, 545010626, 546822965, 548665822, 550441980, 551997006, 553458452, 555350542, 557716012, 559999406, 562077940, 564169586, 566372037, 568712890, 571171045, 573557317, 575697899, 577767849, 580121517, 582568407, 584883273, 587239325, 589758396, 592300534, 594730258, 596976340, 599011123, 601029515, 603207767, 605462492, 607687294, 609750330, 611718476, 613918662, 616160333, 617940009, 619129777, 620219231, 621958971, 623963773, 625696361, 627165020, 628490686, 629691005, 630665839, 631290138, 631559014, 632029593, 633240163, 634500027, 635340929, 636151910, 637149811, 637885571, 638195157, 638335586, 638264894, 637884974, 637705624, 637751639, 637577951, 637763917, 638477743, 639168024, 639693618, 640055597, 640227616, 640298903, 640616775]
3691.6F40616775N97000N00381J88529o6697q3864J37150J56224k00093n12719k42829
3712F41089857L74496M39286K5987k91526l17514j71482K682Q1420j09375m30226m16756
3734.4F40276849P1526M42087J58132o23584r84848k49564k6286k67684K36094N37753
3754.8F39570475J72913j16527K9146J21832j08898k74240k33651l8743J09196m947
3775.2F39226556j75834k49088j96457j48832j67609j04487o8008j85550l79562n11766
3795.6F37039363m78685n36978n09619K563J44064P987J29640K2829l94285o17325
3816F34809554l57390l14772k43843K21670K26498q881j46866k74182l17275m60982
3836.4F33133531n22018p4267K68340K41756J06395k54989q87215j344979m45962O54399
$$ y = [640616775, 641213775, 641714156, 641902685, 641835988, 641752124, 641889274, 642045498, 641845405, 641332686, 641089857, 641464353, 641903639, 641929626, 641638100, 641320586, 641149104, 641151786, 641233206, 641123831, 640693605, 640276849, 640348375, 640790462, 640948594, 640325010, 639340162, 639090598, 639064312, 638796628, 639032722, 639570475, 639743388, 639626861, 639656007, 639777839, 639668941, 639394701, 639161050, 639122307, 639231503, 639226556, 639050722, 638801634, 638605177, 638456345, 638288736, 638184249, 638116241, 637930691, 637551129, 637039363, 636560678, 636023700, 635514081, 635516644, 635660708, 635668695, 635798335, 635821164, 635426879, 634809554, 634452164, 634137392, 633893549, 634115219, 634341717, 634332836, 634185970, 633911788, 633594513, 633133531, 632611513, 632537246, 632805586, 633047342, 633153737, 632898748, 632011533, 630666554, 630220592, 630874991]
3856.8F30874991M81844j09970m96805m25398j97292l49164l66389M2378K37883R4533
3877.2F29786611k72155k98619j014j15812j95920j43766k60592j21593K145l51488
3897.6F28027797o90520n28038j81734J14500K57373P6175j97053l29196l98040l51250
3918F25800014j64927n7220o0976m6432p6413k05874k20299p7426l8803j28031k14696
3940.4F24508917k27272j07408l8564q7738m6551K38p6234j42574j31906j18970j32263
3962.9F23399675j43647j20879r0897r1016p7069o6220j16051j58608j23024q7499
3983.2F22324765j63198k47001k21968j79708j47283j04547j00314
3997.5F21160746
$$ y = [630874991, 631356835, 631246865, 630750060, 630324662, 630127370, 629778206, 629411817, 629454195, 629692078, 629786611, 629514456, 629215837, 629214823, 629099011, 628903091, 628759325, 628498733, 628377140, 628379285, 628027797, 627337277, 626809239, 626627505, 626742005, 626999378, 627075553, 626878500, 626549304, 626151264, 625800014, 625635087, 625577867, 625516891, 625470459, 625394046, 625188172, 624967873, 624890447, 624851644, 624723613, 624508917, 624281645, 624174237, 624135673, 624047935, 624001384, 624001622, 623925388, 623782814, 623650908, 623531938, 623399675, 623256028, 623135149, 623044252, 622953236, 622876167, 622809947, 622693896, 622535288, 622412264, 622324765, 622161567, 621914566, 621692598, 621512890, 621365607, 621261060, 621160746]
##END=$$ End of the data block
