##TITLE=G4 - [Co(HBPa)2]Cl $$ Begin of the data block
##JCAMP-DX=5.00 $$ ACD/SpecManager v 10.08
##SPECTROMETER/DATA SYSTEM=Alpha
##DATE=27 May 2015 08:52:56
##DATA TYPE=INFRARED SPECTRUM
##DATA CLASS=XYDATA
##ORIGIN=
##OWNER=
##NPOINTS=1765
##FIRSTX=399.76428223
##LASTX=3997.64306641
##MAXX=3997.64306641
##MINX=399.76428223
##MAXY=0.88482755
##MINY=0.58253253
##XFACTOR=1.0000000000
##YFACTOR=1.000000000000000e-9
##FIRSTY=0.83009678
##DELTAX=2.03961372
##XUNITS=1/CM
##YUNITS=ARBITRARY UNITS
##XYDATA=(X++(Y..Y))
399.8H30096781l047943J126886J468539j679838j782954J556278J867592q51393j686811
418.1H27067137m22836l34858j977027k535522l09646O26326j866818k767801L4451
436.5H17513406J533866q63611k628685k50697J558364j346171m403174l062427j79947
454.8H07870924p98642l400088k370119O6698r37700l219009j964450J526654J903176
473.2G98677444p48455j340389R97364K208770L58939q71063R08256J946688l87013
491.5H01750541k461553r62198J148403L81887r70364P68304L458143K817273J42395
509.9H06072831n4240J950324K018690k72274q73864J038313J583040n81384j769722
528.3H09111714k5034J210690l13222j849056q31127N16892m48168j750171l94583
$$ plain form
399.8 830096781 827048838 828175724 829644263 827964425 826181471 827737749 829605341 828753948 827067137
418.1 827067137 826644301 826309443 824332416 821796894 821487248 822113574 820246756 817478955 817513406
436.5 817513406 819047272 818183661 815554976 815304279 816862643 815516472 811113298 808050871 807870924
454.8 807870924 807072282 803672194 801302075 801368773 800431073 797212064 795247614 796774268 798677444
473.2 798677444 797928989 796588600 797585964 799794734 800153673 799282610 800190866 802137554 801750541
491.5 801750541 799288988 798326790 799475193 799857080 798886716 799655020 803113163 805930436 806072831
509.9 806072831 806018591 807968915 809987605 809715331 808841467 809879780 811462820 810881436 809111714
528.3 809111714 809086680 810297370 809984148 808135092 807303965 807820857 807372689 805622518 805227935
546.6H05227935J938343J569927o51836j045406N27561P14838j281619k388120j103222
565H03508401q822j086592k091766q48472M91560o33657k499700k435386j451850k024710
585.4G90919006l582478l338098r97901O97255Q67367J784861L988087M793942L051281
603.7G98183322J692712K821028M026175K666891K90513l52979K87294l3974q67248
622.1H08713734K36333K786040L625631K237082J453817K458274K995610J739919P82967
640.4H27029407J678526K582193J470446l22103m47691l159j566171l801108k829492
658.8H23790848J083553L515840K821326J837015K453804K082110K54690q06331Q3088
677.2H37115943J066506R8467j330137q32319Q63850J222610L14415M66168J845717
$$ plain form
546.6 805227935 807166278 808736205 808084369 807038963 807566524 808281362 806999743 804611623 803508401
565 803508401 803499579 802412987 800321221 799472749 799964309 799330652 796830952 794395566 792943716 790919006
585.4 790919006 787336528 783998430 783000529 783697784 784565151 786350012 790338099 795132041 798183322
603.7 798183322 799876034 802697062 806723237 809390128 809680641 809327662 809614956 809580982 808713734
622.1 808713734 808950067 811736107 815361738 817598820 819052637 821510911 824506521 826246440 827029407
640.4 827029407 828707933 831290126 832760572 832438469 831990778 831987619 830421448 826620340 823790848
658.8 823790848 824874401 828390241 831211567 833048582 835502386 837584496 837839186 837032855 837115943
677.2 837115943 838182449 838280916 836950779 836118460 836982310 838204920 838519335 838985503 840831220
695.5H40831220K109409O09278m43101K98798R58741k96473k020359k345622k158225
713.9H37543666l001928m037857l585637k525270l227114n425692o198525m082620
730.2H05459023j066924P15375J857281L600717M765868K561986l055095q810461j3146758
748.5G92881012j6841352j9310117j8719017j4761150q840978k232075M379332J0343432
764.9G26899087J4204443J4822662J3539433J2623370J1885524R768307O752431N176247
781.2H15671504N772292O706238O475210N744815N508065N121291M078090L391981
797.5H58469486L544688L299952J699984R1255K65658J342833J200437M7565k06948
815.8H69754910L64304j82509j737476k112627j047969n02288j100361j185418J60099
$$ plain form
695.5 840831220 842940629 843549907 843106806 843405604 844364345 844067872 842047513 839701891 837543666
713.9 837543666 834541738 830503881 826918244 824392974 821165860 815740168 809541643 805459023
730.2 805459023 804392099 805107474 806964755 810565472 815331340 817893326 814838231 806027770 792881012
748.5 792881012 776039660 756729543 738010526 723249376 714408398 712176323 716555655 726899087
764.9 726899087 741103530 755926192 769465625 782088995 793974519 803742826 810495257 815671504
781.2 815671504 821443796 828150034 834625244 840370059 845878124 850999415 855077505 858469486
797.5 858469486 862014174 865314126 867014110 867105365 867371023 868713856 869914293 869961858 869754910
815.8 869754910 870119214 869936705 868199229 866086602 865038633 864536345 863435984 862250566 862410665
834.2H62410665J358687P23124q80182j423418j066208j432717k274692j861274p3791
852.6H55480194J139701P03096k5570J24156K00450q10384k287686l466368n144060
870.9H45913529q086264j0358274q890629l643512K406299O610334P860243O440103
887.2H38251829L561318K73943k355337l298223k784431j870632j004815K01344J769424
905.6H32744420K620101K225160J679838J891792K310097K107203J453042R86338O15120
923.9H48633111j47701r45449r50753m45426n51700j338065j802921j620055j333594
942.3H39497447r58920J40071J768172K708674K403855J584053J100600R60529O29425
960.7H49833906J11937N4062N27203P60555M47571K55704O11067R19044N64396k0921
$$ plain form
834.2 862410665 863769352 864492476 863612294 862188876 861122668 859689951 857415259 855553985 855480194
852.6 855480194 856619895 857322991 857297421 857421577 857622027 856811643 854523957 851057589 845913529
870.9 845913529 837827265 827468991 818578362 814934850 817341149 823951483 831811726 838251829
887.2 838251829 841813147 842087090 839731753 836433530 833649099 831778467 830773652 830974996 832744420
905.6 832744420 835364521 837589681 839269519 841161311 843471408 845578611 847031653 848017991 848633111
923.9 848633111 848485410 847539961 846589208 846143782 845592082 844254017 842451096 840831041 839497447
942.3 839497447 838538527 838678598 840446770 843155444 845559299 847143352 848243952 849204481 849833906
960.7 849833906 849945843 849999905 850527108 851287663 851735234 851990938 852602005 853521049 854085445 854064524
981.1H54064524o5327K08378n6147q24332j176954r42290r62913j524746j930773j770437
1001.4H45018983j597107k002179k578318k614379k399862k674639l158510k832830
1017.8H25161159j573622n30064q84295k663731m736901n790472n166888k958119J97053
1036.1H01054120L037453M368961M299938L786564L229678K165973N69105k95937M55856
1054.5H22671711J898885K560079K228439J817823J621544R68277n8174n21063l36648
1072.8H32850873k92778o01112o90759l43263r0182l38614p08878o80506n38528q79288
1093.2H27686965j520097k015352k718866m088521n266130m704654k346635M71711
1109.6H05498421L026784N410432P300616P802725O545782M422009K709031J727938
$$ plain form
981.1 854064524 853999197 854207575 854151428 853327096 852150142 851207852 850244939 848720193 846789420 845018983
1001.4 845018983 843421876 841419697 838841379 836227000 833827138 831152499 827993989 825161159
1017.8 825161159 823587537 823057473 822173178 819509447 814772546 808982074 803815186 800857067 801054120
1036.1 801054120 804091573 808460534 812760472 816547036 819776714 821942687 822511792 822215855 822671711
1054.5 822671711 824570596 827130675 829359114 831176937 832798481 833766758 833708584 833187521 832850873
1072.8 832850873 832558095 831956983 831266224 830922961 830832779 830494165 829785287 829104781 828566253 827686965
1093.2 827686965 826166868 824151516 821432650 817344129 812077999 807373345 805026710 805498421
1109.6 805498421 808525205 813935637 821236253 829038978 835584760 840006769 842715800 844443738
1125.9H44443738J098454P59125Q00550Q15511J87397j207769k909839m486263n706787
1144.2H33794117n895257m350543j614869R06408K404332L153861L904343M791021
1160.5H37093413M993081M076660K883434K222836J760364R74774J70767j63257k68161
1178.9H53743911o94037j327097j646102j712977k077163k808213l276944l025532
1195.2H37175846k273679j302063J6212J606226K723515K747536J979351J129389M40359
1213.6H44242692l30985j212775j786828j927436k203822l056109m079759m585504
1229.9H25059474m258752l095210j533866m61280n57065j783192l455580m894674n996942
1248.2G99022913p041931q015514q250534p400394o471157o933510r244978j2505114
$$ plain form
1125.9 844443738 845542192 846301317 847101867 847917378 848104775 846897006 843987167 839500904 833794117
1144.2 833794117 827898860 823548317 821933448 822839856 825244188 828398049 832302392 837093413
1160.5 837093413 842086494 846163154 849046588 851269424 853029788 854004562 854175329 854012072 853743911
1178.9 853743911 853049874 851722777 850076675 848363698 846286535 843478322 840201378 837175846
1195.2 837175846 834902167 833600104 833616316 835222542 837946057 840693593 842672944 843802333 844242692
1213.6 844242692 843911707 842698932 840912104 838984668 836780846 833724737 829644978 825059474
1229.9 825059474 820800722 817705512 816171646 815710366 815153301 813370109 809914529 805019855 799022913
1248.2 799022913 791980982 783965468 775714934 768314540 761843383 754909873 745664895 733159781
1264.6G33159781j4903367j4995098j2850702r616375o690860m560470k277911Q11040
1280.9F68076038M027248O524622Q336485J0164082J2412429J4701664J6233325J6515732
1297.2G56991625J5604257J3729632J1079252Q163333N758107M247248L434479K994955
1313.5H22002888K922475L124654L011525K363503J860917J975655K260506K104283
1329.8H41626406J575291J151204J033187Q75831L68595o4075K205J72436j4782l93629
1350.2H46332669n46455n16713o74426r75967j303613j850128k404452k575516k334774
1368.6H33150625j220703K62141N51522o0797k91347l82185m63486O3896O16610K81215
1389H32507491p9334j4484m1723M0949K66075L03089L82304L01958j93835r92179k190768
$$ plain form
1264.6 733159781 718256414 703261316 690410614 680794239 674103379 669542909 667264998 668076038
1280.9 668076038 672103286 678627908 686964393 697128475 709540904 724242568 740475893 756991625
1297.2 756991625 772595882 786325514 797404766 805568099 811326206 815573454 819007933 822002888
1313.5 822002888 824925363 828050017 831061542 833425045 835285962 837261617 839522123 841626406
1329.8 841626406 843201697 844352901 845386088 846261919 846630514 846566439 846568644 846741080 846726298 846332669
1350.2 846332669 845786214 845269501 844595075 843619108 842315495 840465367 838060915 835485399 833150625
1368.6 833150625 831929922 832192063 832743585 832682788 832391441 832009256 831545770 831609666 832226276 832507491
1389 832507491 832428157 832413673 832371950 832412899 832678974 832982063 833364367 833666325 833472490 832480311 830289543
1411.4H30289543l321588l809810m551351o091058n643666l562510k185524j858949
1427.7G99265087k628982l695012m409730o516457r523928j0189473j0765672j2058914
1444.1G39476919j3069093j3938308j3216674j0039747l595292Q766174K2157490K2676468
1460.4G39217937J7527878R770274k455174j3000727k3157358l6689401l7510216j9748867
1476.7F33954346J943529J9488990K7546525K7632833K7299761K8050304K5264025
1491G91180313J8561780J4098704J1285365O855249L773987L364146L858209K014458
1507.3H54992211j286149j840472j420856j527965k045631j957357j787484j886964
1523.6H41239333j389384o86705J39296R13143O89268N27918J953185L128707J392961
$$ plain form
1411.4 830289543 826967955 823158145 818606794 812515736 806872070 803309560 801124036 799265087
1427.7 799265087 796636105 792941093 788531363 782014906 772490978 762301505 751535833 739476919
1444.1 739476919 726407826 712469518 699252844 689213097 685617805 694383979 716541469 739217937
1460.4 739217937 756745815 766516089 764060915 751060188 727902830 691213429 653703213 633954346
1476.7 633954346 635897875 655386865 682933390 710566223 737865984 765916288 791180313
1491 791180313 809742093 823840797 835126162 841981411 845755398 849119544 852977753 854992211
1507.3 854992211 853706062 851865590 850444734 848916769 846871138 844913781 843126297 841239333
1523.6 841239333 839849949 839163244 839302540 840215683 840904951 841432869 843386054 846514761 847907722
1542H47907722l08216o06954o10888j045882k026260k885938l359079o862045j2910247
1560.3H17292213j1267423q632422o260872k000868K055407M294634N476892M215121
1576.6H05172682n79953m806340q575499j2991667j8217206k4096966k8545856k6709557
1593F80649638j4878213L261506J7187655K0701528J5826225P609606k93195n695343
1609.3G24369407o702841l876149k05875K488256L829956M891157N418241M674315
1625.6G34886467M379213M780889N406201O851911Q014083O160081M583776M972934
1641.9G80035555N810142O687879N980850M625499N536616N226493K345144K339244
1658.2H18587422L540039M127920L805161L688454M350662M235209L420770L418743
$$ plain form
1542 847907722 847599506 846992552 846381664 845335782 843309522 840423584 837064505 830202460 817292213
1560.3 817292213 806024790 797392368 791131496 789130628 791186035 795480669 800957561 805172682
1576.6 805172682 804592729 799786389 791210890 778219223 760002017 735905051 707359195 680649638
1593 680649638 665771425 669032931 686220586 706922114 722748339 730357945 730064750 724369407
1609.3 724369407 717666566 713790417 713584542 716072798 719902754 724793911 730212152 734886467
1625.6 734886467 739265680 744046569 749452770 756304681 764318764 770478845 775062621 780035555
1641.9 780035555 785845697 792533576 798514426 803139925 808676541 813903034 816248178 818587422
1658.2 818587422 822127461 826255381 830060542 833748996 838099658 842334867 845755637 849174380
1674.5H49174380L154695K737284L313243L988982L017366J020848Q56579J376092
1690.9H68639469J802147K182185J854658J336754N66125l7670J13010M470m4405M33385
1711.3H76850128J016498J334905O51896o57498p06852o8724L86417P25150J027226
1729.6H80559146J238466R18686p8320r0957K86937K11894L09229N73099O15298J75417
1750H84718895l98278l08335q464O437J14560n185l06487n1737M36604O29544k8252
1772.4H84799302r21369p39872r3103R8527j13428k30789o7353M05967O27994k205
1792.8H83763671n20051j66773J16765j53720m17888k43426L3021N7340j33038k09510
1813.2H82126391p4923n8830j18852P3910L34263K14458J4841j08242m24147m69088
$$ plain form
1674.5 849174380 852329075 855066359 858379602 862368584 865385950 866406798 867263377 868639469
1690.9 868639469 870441616 872623801 874478459 875815213 876381338 876343668 876456678 876461148 876416743 876850128
1711.3 876850128 877866626 879201531 879853427 879195929 878489077 878420353 878806770 879531920 880559146
1729.6 880559146 881797612 882716298 882637978 882547021 882833958 883045852 883355081 883928180 884543478 884718895
1750 884718895 884320617 884012282 884003818 884010255 884124815 884119630 883813143 883761406 884198010 884827554 884799302
1772.4 884799302 883877933 883138061 883044958 883143485 883030057 882799268 882731915 883137882 883765876 883763671
1792.8 883763671 883243620 883076847 883193612 883039892 882622004 882378578 882411599 882468939 882335901 882126391
1813.2 882126391 882051468 881992638 881873786 881947696 882281959 882496417 882511258 882403016 881978869 881509781
1833.6H81509781l04818k78831o5326L74853K40266n22971p04586l75986k19643k65360
1854H79387379k34485r0659o3598j57535n1141K78831J94013m69625p40826m28856
1874.4H77623498j42157j18911k29239k25306m7803J15097L576k87056k51532m9650
1894.8H76390517j42873k63810j32680K0504m530j22726j76608j62244j28984o4493
1915.2H75212073n9962j12534q9764k18511m26173k86519k7538l1292j73092j38223
1935.6H73648465P3015J99557N7161k05875j98543n4300j24633k39790j49071k8014
1956H72977972j02639k35796j71125L4094K1219k46525l35932j26957m650j63197l09348
1978.5H71337116j98305n8114j29283k21074r3340P4744n6207l22938l40641j48237
$$ plain form
1833.6 881509781 881204963 880926132 880860806 881235659 881475925 880952954 880248368 879872382 879652739 879387379
1854 879387379 879152894 879062235 878998637 878841102 878789961 879068792 879262805 878793180 878052354 877623498
1874.4 877623498 877481341 877362430 877133191 876907885 876860082 876975179 876978755 876691699 876440167 876390517
1894.8 876390517 876247644 875983834 875851154 875871658 875867128 875744402 875567794 875405550 875276566 875212073
1915.2 875212073 875152111 875039577 874949813 874731302 874305129 874018610 873991072 873959780 873786688 873648465
1935.6 873648465 873721480 873921037 873978198 873772323 873573780 873519480 873394847 873155057 873005986 872977972
1956 872977972 872875333 872639537 872468412 872502506 872523725 872277200 871941268 871814311 871809661 871646464 871337116
1978.5 871337116 871138811 871080697 870951414 870730340 870637000 870711744 870655537 870332599 869991958 869843721
1998.8H69843721k4914r9361j81079q9109J6630n7638j70410j22964q8930k98560n74291
2021.3H68153095p40409n25176J99854N46813K35081O3300R5129k205j38641j18017
2041.7H67768824j9133o5565k16842k20060n0068L4332p1525j59204o2943O9022J8061
2064.1H67024899j34111j26362J7703M5895p8976j15633K7299J11401k205j19269n1677
2086.6H66598964O9678L8921q3088q0586M7088O4432p0989j25706K98R1791j7524j38878
2111H66394401o0082O7413Q94j53005j21355K9623L0578r3163j06751K8312Q2493p3255
2135.5H66026103j98543o4611R9719O973j70409j14620P4983N7458j29103j38939N7757
2157.9H65506768J23084m6313j24574L3796J53363P9393O438J06215K49207J68622
$$ plain form
1998.8 869843721 869818807 869719446 869538367 869449258 869465888 869408250 869237840 869114876 869025946 868727386 868153095
2021.3 868153095 867412686 866887510 867087364 867634177 867869258 867932558 868027687 868025482 867886841 867768824
2041.7 867768824 867749691 867684126 867467284 867247224 867197156 867231488 867159963 867000759 866937816 867006838 867024899
2064.1 867024899 866890788 866764426 866782129 866828024 866749048 866633415 866660714 866772115 866769910 866650641 866598964
2086.6 866598964 866668642 866707563 866624475 866543889 866590977 866655409 866584420 866458714 866459012 866550803 866533279 866394401
2111 866394401 866334319 866401732 866402626 866249621 866128266 866157889 866188467 866095304 865988553 866016865 866099358 866026103
2135.5 866026103 865827560 865762949 865862668 865869641 865699232 865584612 865659595 865717053 865587950 865449011 865506768
2157.9 865506768 865629852 865583539 865458965 865492761 865646124 865725517 865731955 865838170 866087377 866255999
2178.3H66255999n9069p8141J12593J56820m8816j73450k3425J07885k0385j62721
2198.7H66067290n8889R5427R954j93596j78575K1457M6432j25468j46567M1306J17540
2221.2H65696311o6221k16484q4936Q5055o675j99437j32740Q1181L8445j88946k23637
2243.6H64781916n4419j1504j85787k70307j11282J3888j17898k70009j62363K0742
2264H63632977j2934j47283j01686P3075Q9944p0393j40965k1696P6830n0187k11298
2286.4H63116384j25647K4617o3539k63750k67804j17242r1851k27690k97189k00569
2306.8H61485720j29700k33233l04878j69813p2360j97173l24845k41220q4817j05083
2327.2H59622598k61367k89738j36018j02698k69354l17991j26958L6479J31964K51234
$$ plain form
2178.3 866255999 866196930 866118789 866231382 866388202 866339386 866165936 866142511 866250396 866230011 866067290
2198.7 866067290 866008401 866103828 866113782 865920186 865741611 865763068 865809500 865684032 865537465 865578771 865696311
2221.2 865696311 865630090 865413606 865328670 865413725 865407050 865207613 865074873 865156054 865194499 865005553 864781916
2243.6 864781916 864727497 864715993 864530206 864259899 864148617 864162505 864044607 863774598 863612235 863632977
2264 863632977 863620043 863472760 863371074 863444149 863534093 863463700 863322735 863301039 863377869 863327682 863116384
2286.4 863116384 862990737 863015354 862951815 862688065 862420261 862303019 862211168 861983478 861686289 861485720
2306.8 861485720 861356020 861122787 860817909 860648096 860575736 860378563 860053718 859812498 859727681 859622598
2327.2 859622598 859361231 859071493 858935475 858832777 858563423 858245432 858118474 858154953 858286917 858538151
2347.6H58538151J60277j41681m32670n37336l58223o8486K0444m4882j4126J10387
2368H57231855J85788J95146J75357J96158K32578J79708Q0943N1796P2122L0577q2314
2390.4H58549714j27137m3392L9578J0371q7619j23322n7936j4901o9141j17421r0361
2412.9H57868433o9261j08540j50084j30296q9884j18673j81436j54913o3538n2750
2433.3H56749058j46091k06292j38819n9903j03473j84238j43826k8491l2366j41263
2453.7H55564296j51098n4359l7551j54972k24352j41740o8664j21773j67727p9036
2474.1H54363024M2796L6002q3924j18434j5199K622j21057j71065q2791m7863j47759
2496.5H53656352j84060q2075m0651j32083k11001j82330j03653r2387j57237j77860
$$ plain form
2347.6 858538151 858698428 858556747 858124077 857586741 857228518 857160032 857180476 857135594 857121468 857231855
2368 857231855 857417643 857612789 857788146 857984304 858216882 858396590 858477533 858529329 858601451 858632028 858549714
2390.4 858549714 858422577 858379185 858418763 858429134 858341515 858218193 858160257 858145356 858076215 857958794 857868433
2412.9 857868433 857799172 857690632 857540548 857410252 857320368 857201695 857020259 856865346 856801808 856749058
2433.3 856749058 856602967 856396675 856257856 856197953 856094480 855910242 855766416 855737925 855705559 855564296
2453.7 855564296 855413198 855358839 855321288 855166316 854941964 854800224 854731560 854609787 854442060 854363024
2474.1 854363024 854405820 854441822 854357898 854239464 854224265 854226887 854105830 853934765 853851974 853804111 853656352
2496.5 853656352 853472292 853390217 853349566 853217483 853006482 852824152 852720499 852628112 852470875 852293015
2516.9H52293015j08958p5221j52945k02835j38342p5877j17362j97410j76668j09792
2537.3H50937605j47700k47538k70069j91987j56879k45512k98202j97887r4712j32918
2557.7H48954201k10822j91152j20938j14858j57058j55151j16527j27614k19047k84612
2578.1H47256422k31624j40428j06335j15096r5725j7465K7657n305j9908K7061N4180
2600.5H46633434L398k8134M2558Q7082Q524r2268r8884k8610k8789j18554j40369
2623H46239388o5267l3915j17123j96338j52111q0705j20282j97053j67012j00315
2643.4H45009267j48356k63750k92003k09749j72973k51174k79367j77860j03354j61589
2663.7H42949092k32040j90378j07527j29759k24173j89543n6862r3937k86937l64185
$$ plain form
2516.9 852293015 852184057 852108836 851955891 851753056 851614714 851538837 851421475 851224065 851047397 850937605
2537.3 850937605 850789905 850542367 850272298 850080311 849923432 849677920 849379718 849181831 849087119 848954201
2557.7 848954201 848743379 848552227 848431289 848316431 848159373 848004222 847887695 847760081 847541034 847256422
2578.1 847256422 847024798 846884370 846778035 846662939 846567214 846549749 846577406 846572101 846552193 846579254 846633434
2600.5 846633434 846636832 846608698 846651256 846738338 846746862 846654594 846555710 846527100 846498311 846379757 846239388
2623 846239388 846174121 846140206 846023083 845826745 845674634 845593929 845473647 845276594 845109582 845009267
2643.4 845009267 844860911 844597161 844305158 844095409 843922436 843671262 843391895 843214035 843110681 842949092
2663.7 842949092 842717052 842526674 842419147 842289388 842065215 841875672 841818810 841724873 841437936 841073751
2684.1H41073751k74121k29538l21150l82304l17216k62499l52382m77731m46916l41654
2704.5H37668240l47078m27007m19200l11255k84374l87788m07577k67803j93656k78413
2724.9H34344089l89039l77596k79009l09587m17650l91840l07799l20017l68238k96354
2745.3H30886960j47462j39356k63631l07858k22802j75059k65121l57390l11613k01940
2765.7H28494728j85728k53678k32041j70767k99335n08844n47409m67241m51863n18799
2786.1H24859023n71012o06835o65307o91474o46591n95212n88536o00398o04987n31554
2806.5H18757117l34323k17557k53260k20299j11341q1718j90198l91782n55873o17027
2826.9H15783739o80208p95007q47399q32021q58724j055480j319944j337827j220643
$$ plain form
2684.1 841073751 840799630 840570092 840248942 839866638 839549422 839286923 838934541 838456810 838009894 837668240
2704.5 837668240 837321162 836894155 836474955 836163700 835879326 835491538 835083961 834816158 834622502 834344089
2724.9 834344089 833955050 833577454 833298445 832988858 832571208 832179368 831871569 831551552 831183314 830886960
2745.3 830886960 830739498 830600142 830336511 830028653 829805851 829630792 829365671 829008281 828696668 828494728
2765.7 828494728 828309000 828055322 827823281 827652514 827353179 826844335 826296926 825829685 825377822 824859023
2786.1 824859023 824288011 823681176 823015869 822324395 821677804 821082592 820494056 819893658 819288671 818757117
2806.5 818757117 818422794 818205237 817951977 817731678 817620337 817538619 817348421 816956639 816400766 815783739
2826.9 815783739 815103531 814308524 813461125 812629104 811770380 810714900 809394956 808057129 806836486
2845.3H06836486j255870j344144j259983j016080p88689o33359n19276m62591m70042
2863.6G99086452n04613m96865l57926j63614j60873k95580k43544k7955Q4996N9724
2884G96980202N1499J09553R2387m1246j18554j10447j56105k48372l08037l41892
2904.4G95908988m07696n20528o40630p95424j024127j234114j251519r63450l93510
2922.8G88677990K39730P31290J041352J146377J159370J215100J226604J171827J114369
2941.1G97724009R76979P31170N00918M00960L79980L48687L51370L53097K74301J52349
2961.5H02193820M2737k9445q1896j18912j27017j32323j94013l25501n38408q67427
2981.9G99821615j186549j388312j513719j524568j556277j761139j866400j821816
$$ plain form
2845.3 806836486 805580616 804236472 802976489 801960409 801171720 800538361 800019085 799556494 799086452
2863.6 799086452 798581839 798084974 797727048 797563434 797402561 797106981 796863437 796835482 796920478 796980202
2884 796980202 797031701 797141254 797233641 797192395 797073841 796963394 796807289 796558917 796250880 795908988
2904.4 795908988 795501292 794980764 794340134 793544710 792520583 791286469 790034950 789071500 788677990
2922.8 788677990 788917720 789649010 790690362 791836739 792996109 794211209 795437813 796609640 797724009
2941.1 797724009 798700988 799432158 799933076 800334036 800714016 801062703 801414073 801767170 802041471 802193820
2961.5 802193820 802236557 802207112 802125216 802006304 801879287 801746964 801552951 801227450 800689042 799821615
2981.9 799821615 798635066 797246754 795733035 794208467 792652190 790891051 789024651 787202835
2998.2G87202835j777887j616597j391650j188278q72314n61833n79715q96275j211822
3016.6G77106464j402974j499713j466751j359224j238704r75728o33120m15147m03464
3034.9G67711639m22954k00749N37j88232n98132q79824r32873r97781j159370j174271
3055.3G61157990j002074p03454k62320K02298N21481N50986L79324L38971N15819
3073.7G61699021P64370R02533P81298O23226O67095P44701P35342O14822L61204J68920
3094.1G68062532J26839O1988j45375m08709n24342m55201m13895m80890l30269O3538
3114.5G65556216K12431Q1420r2804k38478j85550L1650J23263o438j76549k12371
3134.9G65092790j53005j94371m09603n75840n53370m48823l22282k62797m52995p13647
$$ plain form
2998.2 787202835 785424948 783808351 782416701 781228423 780356109 779794276 779214561 778318286 777106464
3016.6 777106464 775703490 774203777 772737026 771377802 770139098 769163370 768530250 768115103 767711639
3034.9 767711639 767288685 767087936 767088473 766900241 766302109 765422285 764489412 763491631 762332261 761157990
3055.3 761157990 760155916 759452462 759190142 759392440 759913921 760464907 760844231 761183202 761699021
3073.7 761699021 762463391 763365924 764147222 764770448 765437543 766182244 766917586 767532408 767893612 768062532
3094.1 768062532 768189371 768251359 768105984 767697275 767172933 766717732 766303837 765822947 765492678 765556216
3114.5 765556216 765768647 765850067 765757263 765518785 765333235 765364885 765488148 765481710 765305161 765092790
3134.9 765092790 764939785 764745414 764335811 763759971 763206601 762757778 762435496 762172699 761719704 761006057
3155.3G61006057p31706o32048n88477n60760n25654n29885n65231n55634n38051n81563
3175.7G55197048o20007o21200o42180o40154n91994n73515o03021o41226p08998q19027
3196.1G48735726q78453q69871q37266p89881p68304p75814p77304p99477q49605q41856
3216.5G40547895p85589p75754q01265q28684q40902q08537p28309p05779q57472r75073
3236.9G32440531q88765p74085p08938o55174o68168p48575p52449o46233n80788o26683
3257.3G25390673o58334o26564o19471o22928n32448l98040n02348p90417r31919r26137
3277.7G18782067q93116q87274r32336j002550j006246r03904r21667j146793j378894
3296G09709287j559019j591742j379848j158476j292586j782239k178788k217233k068281
$$ plain form
3155.3 761006057 760274351 759642303 759053826 758493066 757967412 757437527 756872296 756316662 755778611 755197048
3175.7 755197048 754577041 753955841 753313661 752673507 752081513 751507998 750904977 750263751 749554753 748735726
3196.1 748735726 747857273 746987402 746150136 745360255 744591951 743816137 743038833 742239356 741389751 740547895
3216.5 740547895 739762306 738986552 738185287 737356603 736515701 735707164 734978855 734273076 733415604 732440531
3236.9 732440531 731551766 730777681 730068743 729413569 728745401 727996826 727244377 726598144 726017356 725390673
3257.3 725390673 724732339 724105775 723486304 722863376 722330928 721932888 721430540 720640123 719708204 718782067
3277.7 718782067 717888951 717001677 716069341 715066791 714060545 713156641 712234974 711088181 709709287
3296 709709287 708150268 706558526 705178678 704020202 702727616 700945377 698766589 696549356 694481075
3314.4F94481075k000332k053440k095699k049744k036035k257467k511799k507329
3330.7F76969230k375066k251983k214312k433122k697646k750039k764702k684415
3347F56797945k474546k615929l054142l191888k984285k794624k823770k847254k602518
3365.4F31408989k437293k727568l122270l064573k684951k440631k345682k255976
3381.7F10330045k127290j965940j717865j406133j466870j879097j871109j317679
3398E96578062j020253j431286j848817j612902j193464j055479j084328j154184j098156
3416.3E85079193q29339o20127n54919m05073j37210P6473J19388K39491M87090M50313
3436.7E83905280K41458L34203O73890R74954J078188J000702J015664J192867J377881
$$ plain form
3314.4 694481075 692480743 690427303 688331604 686281860 684245825 681988358 679476559 676969230
3330.7 676969230 674594164 672342181 670127869 667694747 664997101 662247062 659482360 656797945
3347 656797945 654323399 651707470 648653328 645461440 642477155 639682531 636858761 634011507 631408989
3365.4 631408989 628971696 626244128 623121858 620057285 617372334 614931703 612586021 610330045
3381.7 610330045 608202755 606236815 604518950 603112817 601645947 599766850 597895741 596578062
3398 596578062 595557809 594126523 592277706 590664804 589471340 588415861 587331533 586177349 585079193
3416.3 585079193 584249854 583629727 583074808 582669735 582532525 582608998 582728386 582967877 583454967 583905280
3436.7 583905280 584146738 584480941 585154831 586129785 587207973 588208675 589224339 590417206 591795087
3455.1E91795087J533210J625598J554191J551389J868487K074003J728952J295328
3471.4F05026245J381755J757145K032518K014935J722157J647234J885295J946807
3487.7F19414091J859307J929641K063811K116799K015949J976728K072573J895785
3504F35344684J653016J822173K104938K174497K042413J872659J937031K213717K416730
3522.4F53581858K262473J995563J980841K018750K062023K298295K408803K244234
3538.7F70852840K335727K655804K642989K200664J925170K114654K285301K278924
3555F89292073K397239K594173K666831K651632K710998K719343K396643K178431K377510
3573.4G11984873K654970K798795K928496L079176L204763L194212K867520K513111
$$ plain form
3455.1 591795087 593328297 594953895 596508086 598059475 599927962 602001965 603730917 605026245
3471.4 605026245 606408000 608165145 610197663 612212598 613934755 615581989 617467284 619414091
3487.7 619414091 621273398 623203039 625266850 627383649 629399598 631376326 633448899 635344684
3504 635344684 636997700 638819873 640924811 643099308 645141721 647014380 648951411 651165128 653581858
3522.4 653581858 655844331 657839894 659820735 661839485 663901508 666199803 668608606 670852840
3538.7 670852840 673188567 675844371 678487360 680688024 682613194 684727848 687013149 689292073
3555 689292073 691689312 694283485 696950316 699601948 702312946 705032289 707428932 709607363 711984873
3573.4 711984873 714639843 717438638 720367134 723446310 726651073 729845285 732712805 735225916
3589.7G35225916K528548K750039K872408K877831K804697K665758K645194K791465
3606G57161856K967655K923966K706528K549648K500713K564966K374888J994848K105296
3624.4G79850364K545774K742827K152621J520932J607061J766026J728177J782298
3640.7G95696080K013027K346039K627194K455950J432717O13272Q14080J296640J289189
3659H10584188J082956J046479J287103J658916J761794J370251R29535O22749J03891
3677.4H20447862j08898J20163N07474J046658J474798Q95440k86221m83454j7762
3695.8H23596060K83420L17932K06053R6738K55823N44369N12422M2617l57330l14414
3716.2H25183690m3273J96218K16663l8803k50578m1186M73559Q06033M65930k06471
$$ plain form
3589.7 735225916 737754464 740504503 743376911 746254742 749059439 751725197 754370391 757161856
3606 757161856 760129511 763053477 765760005 768309653 770810366 773375332 775750220 777745068 779850364
3624.4 779850364 782396138 785138965 787291586 788812518 790419579 792185605 793913782 795696080
3640.7 795696080 797709107 800055146 802682340 805138290 806571007 807184279 807998359 809294999 810584188
3659 810584188 811667144 812713623 814000726 815659642 817421436 818791687 819721222 820343971 820447862
3677.4 820447862 820338964 820459127 820966601 822013259 823488057 824383497 824097276 823613822 823596060
3695.8 823596060 823879480 824197412 824403465 824500203 824756026 825300395 825812817 825855434 825498104 825183690
3716.2 825183690 825140417 825336635 825553298 825514495 825263917 825222731 825696290 826502323 826968253 826761782
3736.5H26761782l96550j61051J10089K39730J49250K6644k76625p23005o01232j81079
3756.9H24947953j28746l88145l25501N4717J23620j68920m21762l95775q2314J62065
3777.3H23377192L4094k19107k49564k44499k80440j46985O3241J72794K43068K75552
3797.7H23025346K08854J4425l02673m30226m08947l60787j30952J75357L86000L42131
3818.1H22518528J4066m64737o55830l80933r4891L2067K18153M04895K57611k45869
3838.5H21603060n64277n07474l98219k50518J08957M52518K48671m90308p64370m54962
3858.9H18983078J9789K22504J2040j37806n7638j30117l71575l92556j44124J47223
3879.3H18150818J31727r3818k00987k96593k81930k41160l14832j21236K76924L53455
$$ plain form
3736.5 826761782 826365232 826204181 826314270 826554000 826703250 826729894 826453269 825730264 825129032 824947953
3756.9 824947953 824819207 824431062 824105561 824160278 824283898 824114978 823693216 823297441 823215127 823377192
3777.3 823377192 823411286 823192179 822942615 822698116 822417676 822270691 822333932 822506726 822749794 823025346
3797.7 823025346 823234200 823248625 822945952 822515726 822106779 821745992 821615040 821790397 822176397 822518528
3818.1 822518528 822532594 822067857 821412027 821031094 820936203 820968270 821186423 821591318 821848929 821603060
3838.5 821603060 821038783 820531309 820133090 819882572 819991529 820444047 820692718 820202410 819438040 818983078
3858.9 818983078 819002867 819225371 819237411 819099605 819041967 818911850 818540275 818147719 818003595 818150818
3879.3 818150818 818282545 818188727 817987740 817691147 817409217 817168057 816853225 816731989 817008913 817362368
3899.7H17362368K3723l65496n78582n34773l30031q7082R5784R7156q8215k06888
3920.1H15387964j26660m9889j05083r5427M1008J5021j93715k89679j77801k742L8624
3942.5H14441621n0723o4969k742m5478j50741j68085q1062j1086m7088j04606p3076
3965H13641965m530k6047q3267m3810J5676l6716j19150q3625q941n5909j30594j18256
3989.5H12946796o4015m7863j06573j09076
3997.6H12619269
$$ plain form
3899.7 817362368 817386091 817020595 816442013 815907240 815577209 815490127 815585911 815683067 815594852 815387964
3920.1 815387964 815261304 815211415 815106332 815010905 815051913 815066934 814873219 814583540 814405739 814402997 814441621
3942.5 814441621 814390898 814325929 814323187 814277709 814126968 813958883 813877821 813866735 813819647 813715041 813641965
3965 813641965 813637435 813611388 813528121 813484311 813499987 813463271 813344121 813260496 813251555 813195646 813065052 812946796
3989.5 812946796 812882781 812834918 812728345 812619269
3997.6 812619269
##END=$$ End of the data block
