##TITLE=G3Ni $$ Begin of the data block
##JCAMP-DX=5.00 $$ ACD/SpecManager v 10.08
##SPECTROMETER/DATA SYSTEM=Alpha
##DATE=15 Apr 2015 09:49:12
##DATA TYPE=INFRARED SPECTRUM
##DATA CLASS=XYDATA
##ORIGIN=
##OWNER=
##NPOINTS=1765
##FIRSTX=399.76428223
##LASTX=3997.64306641
##MAXX=3997.64306641
##MINX=399.76428223
##MAXY=1.00231493
##MINY=0.59322840
##XFACTOR=1.0000000000
##YFACTOR=0.000000010000000
##FIRSTY=1.00000000
##DELTAX=2.03961372
##XUNITS=1/CM
##YUNITS=ARBITRARY UNITS
##XYDATA=(X++(Y..Y))
399.8A00000000j30218k29949J50305K09862j63919j96385J62047Q082o80154j261097
$$ 100000000 99869782 99639833 99790138 100000000 99836081 99639696 99801743 99809825 99129671 97868574
420.2I7868574j629812k057493j312995O51890K063376K037007J368594P95507R6190
$$ 97868574 96238762 94181269 92868274 93520164 95583540 97620547 98989141 99784648 99880838
438.5I9880838k36696J12683J47140l99727m21971M2463j04767n24146j96397K15238
$$ 99880838 99644142 99756825 99903965 99504238 99082267 99124730 99019963 98495817 98299420 98514658
458.9I8514658j88517m46767k19351l89159o89882k85655K68894J94139k5457K94524
$$ 98514658 98326141 97879374 97660023 97270864 96580982 96295327 96564221 96758360 96732903 97027427
479.3I7027427P04497M68999J74517M57948M90069p6746k01661K51103J50621l26372
$$ 97027427 97731924 98200923 98375440 98833388 99323457 99246711 99045050 99296153 99446774 99120402
499.7I9120402j39832K17736k04367o38562l33280k39515q55732j036197l57222O3824
$$ 99120402 98980570 99198306 98993939 98355377 98022097 97782582 96926850 95890653 95533431 95597255
520.1I5597255L523L92914R26691N41049n9324J94579M96507J1992k84672K07103L54892
$$ 95597255 95600778 95993692 96920383 97461432 97402108 97596687 98093194 98105186 97820514 98027617 98382509
542.5I8382509j93805k59942K20526M6444n37020m08358l0636k71035m51958j06025
$$ 98382509 98188704 97928762 98149288 98195732 97658712 97250354 97219718 96948683 96496725 96390700
562.9I6390700l68690j846898k907181j646482R07218K297366K219927J662123P78932
$$ 96390700 96022010 94175112 91267931 89621449 90528667 92826033 95045960 96708083 97487015
581.3I7487015r627J05602M67831J11508k56461J23048L46238j30630k95353J67495
$$ 97487015 97477388 97582990 98050821 98162329 97905868 98028916 98375154 98244524 97949171 98116666
601.7I8116666J73330l55833k91604K69824K12115k17426l6394L27432M4268k43962
$$ 98116666 98289996 97934163 97642559 97912383 98124498 97907072 97870678 98198110 98242378 97998416
622.1I7998416J13100L14957j20640k95168Q3155M9054n53584q25363r56160j673067
$$ 97998416 98111516 98426473 98305833 98010665 98093820 98142874 97589290 96763927 95807767 94134700
642.5I4134700j712393l255J445395J226151P07465Q20101Q41844L42214O7162L35795
$$ 94134700 92422307 92419052 93864447 95090598 95798063 96618164 97460008 97802222 97869384 98205179
662.9I8205179L61502j15025k12407K86496J78015j79184o5291K34980O2513j85203
$$ 98205179 98566681 98451656 98239249 98525745 98703760 98524576 98459285 98694265 98756778 98571575
683.3I8571575L5643K26921l4112j77657P5108J33168j52081j80322P3499J9085k53582
$$ 98571575 98607218 98834139 98800027 98622370 98697478 98830646 98678565 98498243 98571742 98590827 98337245
705.7I8337245k01416j4275j84852m59922m70405n92781j122105j436823j142669r84132
$$ 98337245 98135829 98121554 97936702 97476780 97006375 96413594 95291489 93854666 92711997 91727865
726.1I1727865j558388k456498k915436k536159j540882K36112K880603M220051K642256
$$ 91727865 90169477 87712979 84797543 82261384 80720502 80956614 83837217 88057268 90699524
744.5I0699524l31772l360188o477785q173239n844235M732N631513P252258M607796
$$ 90699524 90367752 87007564 80529779 72356540 66512305 66517037 72148550 79400808 84008604
762.8H4008604J157677n01745j0598J586598K594227K454793J704836P76321r072j69414
$$ 84008604 85166281 84664536 84653938 86240536 88834763 91289556 92994392 93770713 93761641 93592227
783.2I3592227L11928P58565P43860N54383M16273K33662O8325P1692J07139p039j15216
$$ 93592227 93904155 94662720 95406580 95960963 96377236 96610898 96679223 96750915 96858054 96851015 96735799
805.6I6735799j31660k59626m16589k23059K17921M43995L73161K58350J77264L0524
$$ 96735799 96604139 96344513 95927924 95704865 95922786 96366781 96739942 96998292 97175556 97206080
826I7206080p1222m929M3213n5295q7875K1225r477k48140m10151m37302n06443m86725
$$ 97206080 97134858 97129929 97173142 97117847 97029972 97051197 97041720 96793580 96383429 95946127 95439684 94952959
850.5I4952959j63162J90586K02316L5644n1916k29484o09004q72249q04067p15410
$$ 94952959 94789797 94980383 95182699 95218343 95166427 94936943 94327939 93455690 92651623 91936213
870.9I1936213q64512q71605m66805r2072L28046J305897J882350R60052n75620j538068
$$ 91936213 91071701 90200096 89733291 89641219 89969265 91275162 93157512 94117564 93541944 92003876
891.3I2003876k132309l096449l781330k418530N14817K310198K079004J049364q2749
$$ 92003876 89871567 86775118 82993788 80575258 81090075 83400273 85479277 86528641 86445892
909.7H6445892r90629o08969J392496L237754L328418K318573J354188N86909O7699
$$ 86445892 85455263 84846294 86238790 89476544 92804962 95123535 96477723 97064632 97132331
928I7132331Q7667L71837L67278K30199L11339L76725K51168K34509L66324K70623
$$ 97132331 97219998 97591835 97959113 98189312 98500651 98877376 99128544 99363053 99729377 100000000
948.4A00000000m7714j68508l0219J4132j18178j48130o4563n8622N991K14803K51692
$$ 100000000 99952286 99783778 99753559 99767691 99649513 99501383 99436820 99378198 99384189 99598992 99850684
970.9I9850684J926j63466q0323p7325k59710l07524j89733k50316m93837o29895p80130
$$ 99850684 99852610 99689144 99608821 99531496 99271786 98964262 98774529 98524213 98030376 97400481 96620351
993.3I6620351j309144j921565j820993j118279m77755J94627P23142M59742m11957
$$ 96620351 95311207 93389642 91568649 90450370 89972615 90167242 90890384 91350126 90938169
1011.6I0938169j130241q11947P53671K055878J784151P94071O336q35412j384801
$$ 90938169 89807928 88995981 89749652 91805530 93589681 94383752 94390088 93554676 92169875
1030I2169875p14988P93267J658362J393908P07460J97976R6n4789l44980j132232
$$ 92169875 91454887 92248154 93906516 95300424 96007884 96205860 96205956 96151167 95806187 94673955
1050.4I4673955k297425k688265o19822K199316K151841J68138r84907j287818q27944
$$ 94673955 92376530 89688265 89068443 91267759 93419600 93587738 92602831 91315013 90487069
1068.8I0487069O60902J838148J727551J108450O35254K59107P028q4478j87772l65931
$$ 90487069 91147971 92986119 94713670 95822120 96457374 96716481 96723509 96639031 96451259 96085328
1089.2I6085328m26513k90597q2570R8777J23221k11376n71818l31789K56831N68330
$$ 96085328 95658815 95368218 95285648 95384425 95507646 95296270 94724452 94392663 94649494 95217824
1109.6I5217824N41878L53342J72913M3786j05834j59461m1K25758L61204M60840N15252
$$ 95217824 95759702 96113044 96285957 96329743 96223909 96064448 96064407 96290165 96651369 97112209 97627461
1132I7627461M08709J98501l1387l88718q89939j427549j812285j538706o57964L55273
$$ 97627461 98036170 98234671 98203284 97814566 96924627 95497078 93684793 92146087 91488123 91843396
1152.4I1843396J330382J635194J202834R94420J093822Q82751M36956J96188J30433
$$ 91843396 93173778 94808972 96011806 97006226 98100048 98982799 99419755 99615943 99746376
1170.7I9746376L2711m0710j5312k5165j51468k74586l67797n01901n23757j82802
$$ 99746376 99779087 99738377 99723065 99697900 99546432 99271846 98904049 98402148 97878391 97695589
1191.1I7695589L65591O27208M83054K79379J53958P636q8501n6511m1843j44011k21061
$$ 97695589 98061180 98688388 99171442 99450821 99604779 99612415 99523914 99467403 99425560 99281549 99060488
1213.6I9060488j93858j76764j98358j63162j38110k83122m50033l13848L5208J72419
$$ 99060488 98866630 98689866 98491508 98328346 98190236 97907114 97457081 97143233 97178441 97350860
1234I7350860M3398q0347j92911m35060o91092p34538n25373k41661m6796N9927O4879
$$ 97350860 97394258 97313911 97121000 96685940 95994848 95260310 94734937 94493276 94446480 94506407 94571286
1256.4I4571286o7579k63018m25601n33890o17725p22867r39364j314926j712423k035141
$$ 94571286 94503707 94240689 93815088 93281198 92663473 91940606 91001242 89686316 87973893 85938752
1276.8H5938752k411497k900875l329688l512603l330201k749854k123523j945376
$$ 85938752 83527255 80626380 77296692 73784089 70453888 67704034 65580511 63635135
1293.1F3635135k045375j446438P27677M037607O579178O917102N656689L956878K259797
$$ 63635135 61589760 60143322 60870999 64908606 71487784 78404886 84061575 88018453 90278250
1311.5I0278250P05945q07505k470982l155828j203877K136457M030359L638631K335090
$$ 90278250 90984195 90176690 87705708 84549880 83346003 85482460 89512819 93151450 95486540
1329.8I5486540J427328R29648N57470L70866K97594J16939o7866p5436m6575j95014
$$ 95486540 96913868 97843516 98400986 98771852 99069446 99186385 99118519 99043083 98996508 98801494
1350.2I8801494m25119n40357o65683r58508j284760j273352o22452p4261j99622j19567
$$ 98801494 98376375 97836018 97170335 96211827 94927067 93653715 93031263 92957002 92757380 92637813
1370.6I2637813Q09348J579708J290667O68704K00063p5471L4666K43318R2834j17433
$$ 92637813 93447161 95026869 96317536 96986240 97186303 97110832 97145498 97388816 97481650 97364217
1391I7364217r0814r0223k94107m62419m20743l86823o24942r25434j300108k258587
$$ 97364217 97273403 97183180 96889073 96426654 96005911 95619088 94994146 94068712 92768604 90510017
1411.4I0510017l393179l274191j686090l8850N03671N72031J72705j032060k282554
$$ 90510017 87116838 83842647 82156557 82117707 82621378 83193409 83366114 82334054 80051500
1429.8H0051500j782298N65648K780419K900744J059490m93145j547962j894558j798659
$$ 80051500 78269202 78834850 81615269 84516013 85575503 85082358 83534396 81639838 79841179
1448.1G9841179k427400l550350k919448J606632P349807N879622K563817p1562k685034
$$ 79841179 77413779 73863429 70943981 72550613 79900420 85780042 88343859 88272297 85587263
1466.5H5587263m195213o120795r126997o821418L35479N027783O296467M253740Q18502
$$ 85587263 81392050 75271255 66144258 59322840 59658319 64686102 70982569 75236309 76054811
1484.9G6054811K72292L254515N442405M402745L225457K504045J378060O72167N98347
$$ 76054811 76327103 79581618 85024023 89426768 92652225 95156270 96534330 97206497 97804844
1503.2I7804844P44909N66757q362q3727J4538N5980P5293Q4394Q518j00774l3069
$$ 97804844 98549753 99116510 99108148 99024421 99038959 99094939 99170232 99254626 99263144 99162370 99129301
1525.6I9129301k1219p7516L475M1145p730P6282J05953k50143n30875n58787m25017
$$ 99129301 99108082 99030566 99034041 99075186 99067456 99143738 99249691 98999548 98468673 97909886 97484869
1548.1I7484869m02773o23887r04406r85264j183826j070297M7523O81871O50746m2463
$$ 97484869 97082096 96458209 95553803 94568539 93384713 92314416 92361939 93043810 93694556 93652093
1568.5I3652093j108843j457727r30315N2607N21386j29002j278675k577514l918534
$$ 93652093 92543250 91085523 90155208 90207815 90729201 90600199 89321524 86744010 82825476
1586.8H2825476n085176m916543k376783J545095M259003M073536J431525k043599
$$ 82825476 77740300 72823757 70446974 71992069 76251072 80324608 81756133 79712534
1603.2G9712534l523332r05901L653067N428750L928279K156264J007313K89118N7113
$$ 79712534 76189202 75283301 78936368 84365118 88293397 90449661 91456974 91746092 91803205
1621.5I1803205p3445j63114k01285k75683j49125K19923M86058K52873J43182L15589
$$ 91803205 91729760 91566646 91365361 91089678 90940553 91160476 91646534 91899407 92042589 92358178
1641.9I2358178M81683N74344M41438L01063M59624L79377L9608J24472K52342K47139
$$ 92358178 92839861 93414205 93855643 94156706 94616330 94995707 95035315 95159787 95412129 95659268
1662.3I5659268J90377K33758L19105K63113J84125K10154J46299J21463K65550L79324
$$ 95659268 95849645 96083403 96402508 96665621 96849746 97059900 97206199 97327662 97593212 97972536
1682.7I7972536J85371n9522K3735Q3214J04755K19470K54006J46335M9668O1518J04714
$$ 97972536 98157907 98098385 98122120 98205334 98310089 98529559 98783565 98929900 98979568 99041086 99145800
1705.1I9145800j365o9571O0666K08634K32750P8410j09660j09131n8382R912J26952
$$ 99145800 99144435 99074864 99135530 99344164 99576914 99655324 99545664 99436533 99378151 99388063 99515015
1727.6I9515015J89435J70368J19800j2005n6612k8610Q916N0557M3434L6180K3055
$$ 99515015 99704450 99874818 99994618 99982613 99926001 99897391 99906307 99956864 100000298 100036478 100059533
1750A00059533o7669j11169m6950K9617L6013n7882r0366L0327J07723P4166j0902
$$ 100059533 99991864 99880695 99833745 99863362 99899375 99841493 99751127 99781454 99889177 99963343 99952441
1772.4I9952441r8866j16604o8820J7619O1852J5438j5116Q1563J59162J1331j14822
$$ 99952441 99853575 99736971 99668151 99685770 99747622 99763060 99747944 99829507 99988669 100000000 99885178
1794.9I9885178k5845M6724k8551q2552p379M7344K4223Q744K1023Q410k2119K050
$$ 99885178 99859333 99906057 99877506 99794954 99787575 99834919 99859142 99867886 99888909 99897319 99875200 99877250
1819.4I9877250N8729M3046k0641O270K2674r9426j17761L326M6259P671M6062J00017
$$ 99877250 99935979 99979025 99958384 99964654 99987328 99887902 99770141 99773467 99819726 99827397 99873459 99973476
1843.8I9973476n955j26564j10322n0271o2775j02532n8294J7673K7782L9577J14829
$$ 99973476 99967521 99840957 99730635 99680364 99617589 99515057 99456763 99474436 99502218 99541795 99656624
1866.3I9656624J04081o8861j36733m2516J7196j4395k6536J4079R882l1173k1690
$$ 99656624 99760705 99691844 99555111 99512595 99529791 99515396 99488860 99502939 99512821 99481648 99459958
1888.7I9459958K951j425m512K1404N2392K5142k3234j1105R549k9069m9424J2809
$$ 99459958 99462909 99461484 99456972 99478376 99530768 99555910 99532676 99521571 99531120 99502051 99452627 99465436
1913.2I9465436O7007L0250k1118J2260K8873j4919j502N0920M5019O354J2708M5484
$$ 99465436 99532443 99562693 99541575 99553835 99582708 99567789 99566287 99617207 99662226 99668580 99681288 99726772
1937.7I9726772M7541K2083o973k7883n3382o1107k7770q756k8228k4093J3292J4925
$$ 99726772 99774313 99796396 99789423 99761540 99708158 99647051 99619281 99610525 99582297 99558204 99571496 99586421
1962.1I9586421j0580o699J389j7232k3848L082K1809j699k4885p462Q464r829j7709
$$ 99586421 99575841 99569142 99570531 99553299 99529451 99532533 99554342 99552643 99527758 99520296 99528760 99518931 99501222
1988.7I9501222j120k9236q4335p0965j2559J0401J156P320J7476J615l349L6704O6507
$$ 99501222 99500102 99470866 99386531 99315566 99303007 99313408 99314564 99321884 99339360 99340975 99337626 99374330 99440837
2015.2I9440837K9170k2220k8944m2820o5959j9824M8578M4143L183O43J9777L416
$$ 99440837 99470007 99447787 99418843 99376023 99310064 99290240 99338818 99382961 99386144 99386787 99406564 99409980
2039.6I9409980k8855k2328j156j4305l0530j4138p713l4863m3088j3751l874l0071
$$ 99409980 99381125 99358797 99357641 99343336 99312806 99298668 99290955 99256092 99213004 99199253 99195379 99165308
2064.1I9165308l7705j4991j4371l3182j6790J7726J6284K754K2227M1884K1028O6
$$ 99165308 99127603 99112612 99098241 99065059 99048269 99065995 99082279 99085033 99107260 99149144 99170172 99170238
2088.6I9170238J6987K6083j174j5128M822N192k7669l0607M626R077j8501j3882P546
$$ 99170238 99187225 99213308 99212134 99197006 99201828 99207020 99179351 99148744 99153370 99162447 99143946 99130064 99137610
2115.1I9137610j2088m0978k4068J341j7887m0108j7918j573k9934m1955q321L862
$$ 99137610 99125522 99084544 99060476 99061817 99043930 99003822 98985904 98984331 98954397 98912442 98904121 98907983
2139.6I8907983k3925k4450Q345K414l7706l6246m756j5509m9335l9476j4049l2914
$$ 98907983 98884058 98859608 98867953 98870367 98832661 98796415 98791659 98776150 98726815 98687339 98673290 98640376
2164.1I8640376o0051l9018j281n48q262K0939L8088O091j0114J7124K0224j7393k4199
$$ 98640376 98580325 98541307 98540026 98539478 98531216 98552155 98590243 98596334 98586220 98603344 98623568 98606175 98581976
2190.6I8581976M148n656m4340l7456k759j1242l8171k2304J771k1279m8292k6828
$$ 98581976 98586124 98580468 98536128 98498672 98495913 98484671 98446500 98424196 98425967 98404688 98356396 98329568
2215I8329568o044k7406l5525k789R030k1470l1602q267j1486l9518l0780K909m518
$$ 98329568 98323524 98296118 98260593 98257804 98266834 98245364 98213762 98205495 98194009 98154491 98123711 98126620 98122102
2241.6I8122102l7932l4303j3727l1119o0714m9323k2923k4266j8721J9991M1694J9061
$$ 98122102 98084170 98049867 98036140 98005021 97944307 97894984 97872061 97847795 97829074 97849065 97890759 97909820
2266I7909820M399K3186K2757j0186k0057K002O122j5265j7041L76j0395l8070l3814
$$ 97909820 97914219 97937405 97960162 97949976 97929919 97931921 97938043 97922778 97905737 97906113 97895718 97857648 97823834
2292.5I7823834j6164k9111m9871m1527l2538n7304q0842n9730k3013j3292j4156j4073
$$ 97823834 97807670 97778559 97728688 97687161 97654623 97597319 97516477 97456747 97433734 97420442 97406286 97392213
2317I7392213l5900o6727o2847l5817l7252n6696m5717k2006l4720n9682m6629p569
$$ 97392213 97356313 97289586 97226739 97190922 97153670 97096974 97051257 97029251 96994531 96934849 96888220 96880651
2341.5I6880651K6589P8482J04856L1942q6611j50931j22625o3574k0093J5885N2613
$$ 96880651 96907240 96985722 97090578 97122520 97035909 96884978 96762353 96698779 96678686 96694571 96747184
2363.9I6747184P3176P8375R3847J14387J16444J10477J13285J11669Q9175N9598L9518
$$ 96747184 96820360 96898735 96992582 97106969 97223413 97333890 97447175 97558844 97648019 97707617 97747135
2386.4I7747135K4152J1790Q774R679N234j151l594m279p016j0067r519p111p701r382
$$ 97747135 97771287 97783077 97791851 97801530 97806764 97805613 97802019 97797740 97790724 97780657 97771138 97764027 97756326 97746944
2414.9I7746944q142p450q315n817j824j985m476o968j1939j4997r387k641n585j3911
$$ 97746944 97738802 97731352 97723037 97717220 97715396 97713411 97708935 97701967 97690028 97675031 97665644 97663003 97657418 97643507
2443.5I7643507j4019n377l522p153k784N61p224j1987p319r203k1482k3407o544M655
$$ 97643507 97629488 97624111 97620589 97613436 97610652 97611213 97603989 97592002 97584683 97575480 97553998 97530591 97524047 97528702
2472I7528702k879o503J842j681j5640j3274j246n263j6183j2201n906j7071k9707
$$ 97528702 97525823 97519320 97521162 97519481 97503841 97490567 97489321 97484058 97467875 97455674 97449768 97432697 97402990
2498.5I7402990k1202r351j7310k3412r305l761j9282k0188l207p081l2282l7366j5407
$$ 97402990 97381788 97372437 97355127 97331715 97322410 97318649 97299367 97279179 97275972 97268891 97236609 97199243 97183836
2525.1I7183836o211j3590m822Q684p492l2866k8765j7149l2281m9055l9655l1352
$$ 97183836 97177625 97164035 97159213 97167897 97160405 97127539 97098774 97081625 97049344 97000289 96960634 96929282
2549.5I6929282m5836n5188m2355l9303o1411o9565n2690n6273q3780q7005o9672p5906
$$ 96929282 96883446 96828258 96785903 96746600 96685189 96615624 96562934 96506661 96422881 96335876 96266204 96190298
2574I6190298r6381r4575q0079p6538n8031O211P6127R9087R7584J08016R9808N1242
$$ 96190298 96093917 95999342 95919263 95842725 95784694 95790905 95867032 95966119 96063703 96171719 96271527 96322769
2598.5I6322769R847K706o515l7277n1921l6127l3706n4294n4801l1799k7513m0043
$$ 96322769 96332616 96335322 96328807 96291530 96239609 96203482 96169776 96115482 96060681 96028882 96001369 95961326
2623I5961326k9146j0747k6625n1469m1473j9628k2584l1608k2185j3971l0530m9460
$$ 95961326 95932180 95921433 95894808 95843339 95801866 95782238 95759654 95728046 95705861 95691890 95661360 95611900
2647.4I5611900m3684m1360o5380p6330n6314n1123p0578o6882l9524l7206n5104n0581
$$ 95611900 95568216 95526856 95461476 95385146 95328832 95277709 95207131 95140249 95100725 95063519 95008415 94957834
2671.9I4957834l7378n1319p2909p0232o3938q0782r4491q1581p3123r5880j20944
$$ 94957834 94920456 94869137 94796228 94725996 94662058 94581276 94486785 94405204 94332081 94236201 94115257
2694.3I4115257j15537r9928r1874o4308k0825j0980l5292m5335l8719n2255p8112
$$ 94115257 93999720 93899792 93807918 93743610 93722785 93711805 93676513 93631178 93592459 93540204 93462092
2716.8I3462092p6980n5456n2744o5792o9719p3588r3204j12969j04749q8155j00350
$$ 93462092 93385112 93329656 93276912 93211120 93141401 93067813 92974609 92861640 92756891 92668736 92568386
2739.2I2568386j13511r6083p7701q5586r5576q4442p7105q8608r1886q6898j03885
$$ 92568386 92454875 92358792 92281091 92195505 92099929 92015487 91938382 91849774 91757888 91670990 91567105
2761.6I1567105j33163j35004j12593j03552j03610r0999q7726j05834j18190j17153
$$ 91567105 91433942 91298938 91186345 91082793 90979183 90888184 90800458 90694624 90576434 90459281
2782I0459281j20336j27399j28305j33466j50895j68151j73992j75643j85054j93936
$$ 90459281 90338945 90211546 90083241 89949775 89798880 89630729 89456737 89281094 89096040 88902104
2802.4H8902104j91790j78510j62101j54900j41257j12629j06579j35297j65784j80245
$$ 88902104 88710314 88531804 88369703 88214803 88073546 87960917 87854338 87719041 87553257 87373012
2822.8H7373012j81079j73795j77145k20865l19642m59420n99045o52772m89265j00946
$$ 87373012 87191933 87018138 86840993 86620128 86300486 85841066 85242021 84589249 84099984 83999038
2843.2H3999038K53194L26968J83636L5661j9598j0407K0510M0275K1809l4743j11843
$$ 83999038 84252232 84579200 84762836 84798497 84778899 84768492 84789002 84829277 84851086 84816343 84704500
2865.7H4704500j87105k45159l02416l95310n17667o32179p39061q08841p33275m99123
$$ 84704500 84517395 84272236 83969820 83574510 83056843 82424664 81685603 80876762 80143487 79644364
2886.1G9644364l07852l55250n33556m98659p9465M52757O85823N49954K93148J31076
$$ 79644364 79336512 78981262 78447706 77949047 77869582 78322339 79008162 79558116 79851264 79982340
2906.5G9982340J02783J38479J55896J22511N9706J7852L2026Q6855J36650J60599
$$ 79982340 80085123 80223602 80379498 80502009 80561715 80579567 80611593 80698448 80835098 80995697
2926.8H0995697J65337J54781J60486J95199K09660J80095J26672P5340N2339O0999
$$ 80995697 81161034 81315815 81476301 81671500 81881160 82061255 82187927 82263267 82315606 82376605
2947.2H2376605P1425N5849K3103L695J5515M0365M7785M1920M2522M5573L6234J8668
$$ 82376605 82448030 82503879 82526982 82530677 82546192 82586557 82634342 82676262 82718784 82764357 82800591 82819259
2971.7H2819259m89l0535o0862q0198r8241j03265q9001p4804o8546q8364j36023j64259
$$ 82819259 82818770 82788235 82727373 82647175 82548934 82445669 82356668 82281864 82213318 82124954 81988931 81824672
2996.2H1824672j82122k17139k17015j44249k0701J02401J62607J22738p212j62607
$$ 81824672 81642550 81425411 81208396 81064147 81043446 81145847 81308454 81431192 81423980 81261373
3016.6H1261373k41721j70845J3977J64318J81222J23990O6632K4194P730L4768J07300
$$ 81261373 81019652 80848807 80862784 81027102 81208324 81332314 81398946 81423140 81430870 81465638 81572938
3039H1572938J54126J10131N740r7889j59907j78486j59216r6595n091J15878K38740
$$ 81572938 81727064 81837195 81842935 81745046 81585139 81406653 81247437 81150842 81145751 81261629 81500369
3061.5H1500369K70129J92081P7707k450J3429J46610L20679L95775L41910K65550
$$ 81500369 81770498 81962579 82040286 82037836 82051265 82197875 82518554 82914329 83256239 83521789
3081.9H3521789K12956J55705J04702O7597K5469q917j6063m828j5253o4754r5773
$$ 83521789 83734745 83890450 83995152 84062749 84088218 84079301 84063238 84058410 84043157 83978403 83882630
3104.3H3882630p6980n9986o2972k3889N3220P9656M5496L547j9741j9324p212j985
$$ 83882630 83805650 83745664 83682692 83658803 83712023 83791679 83837175 83840722 83820981 83801657 83794445 83792460
3128.8H3792460j4555l6443m1979k3294k2375o5881r4808p5548m8757k9540j9503l8773
$$ 83792460 83777905 83741462 83699483 83676189 83653814 83587933 83493125 83417577 83368820 83339280 83319777 83281004
3153.2H3281004p4422r0027q0448o1542n4073o8790q3810q3089q4281r7626j03552
$$ 83281004 83206582 83116555 83036107 82974565 82920492 82851702 82767892 82684803 82600522 82502896 82399344
3175.7H2399344r9724j02460j05888j01400r9754j13737j34737j45238j48398j56105
$$ 82399344 82299620 82197160 82091272 81989872 81890118 81776381 81641644 81496406 81348008 81191903
3196.1H1191903j66326j66721j58786j55777j50174j33580j16658j03218r0986q1694
$$ 81191903 81025577 80858856 80700070 80544293 80394119 80260539 80143881 80040663 79949677 79867983
3216.5G9867983p4858p0208n7202k9797o348P689K9058M1073O837l7355l8480k0856
$$ 79867983 79793125 79722917 79665715 79635918 79629570 79637259 79666317 79707390 79714227 79676872 79638392 79617536
3240.9G9617536j2803q571j9241m8303n6678k7430J532j789p551J2803L4207M0662
$$ 79617536 79604733 79596162 79576921 79528618 79471940 79444510 79446042 79444253 79436702 79449505 79483712 79524374
3265.4G9524374M7970N3012J6600n6487j30731k07085k89541l82209m74143n26315
$$ 79524374 79572344 79625356 79641956 79585469 79454738 79247653 78958112 78575903 78101760 77575445
3285.8G7575445m94402l28553j6362L87735P57420R22644Q36581O39724M61907L06880
$$ 77575445 77081043 76752490 76736128 77123863 77881283 78803927 79640508 80280232 80742139 81049019
3306.2H1049019J64491O8897L3224K8610K5922J7071N740M196k730n3978j14125j26994
$$ 81049019 81213510 81282407 81315631 81344241 81370163 81387234 81392974 81397170 81394440 81340462 81226337 81099343
3330.7H1099343j19781j16664j15395j43361j89537k18260k35289k24805j91284k12293
$$ 81099343 80979562 80862898 80747503 80604142 80414605 80196345 79961056 79736251 79544967 79332674
3351.1G9332674k78873l00514k73461k54708k70492k80046k48051k31493k77704l40670
$$ 79332674 79053801 78753287 78479826 78225118 77954626 77674580 77426529 77195036 76917332 76576662
3371.5G6576662l45707k95532k56729k49696k55322k53725k30885j86717j41513j50514
$$ 76576662 76230955 75935423 75678694 75428998 75173676 74919951 74689066 74502349 74360836 74210322
3391.9G4210322k06488k11132j46937j11515j61272k12473j76084j10447q6558r0092
$$ 74210322 74003834 73792702 73645765 73534250 73372978 73160505 72984421 72873974 72787416 72697324
3412.3G2697324j02944r7119n1195k2149l0577j2881L8535P3105O9022P1448R5934
$$ 72697324 72594380 72497261 72446066 72423917 72393340 72380459 72418994 72492099 72561121 72632569 72728503
3434.7G2728503Q7744N7763P1561J18601J53220J64187J56313J59067J79142J97547
$$ 72728503 72816247 72874010 72945571 73064172 73217392 73381579 73537892 73696959 73876101 74073648
3455.1G4073648K19340K39056K29078K21467K56444K74890K22099J60789J71608K20651
$$ 74073648 74292988 74532044 74761122 74982589 75239033 75513923 75736022 75896811 76068419 76289070
3475.5G6289070K58517K64507K20722J95784K28184K37537K13372K21181K52694K63834
$$ 76289070 76547587 76812094 77032816 77228600 77456784 77694321 77907693 78128874 78381568 78645402
3495.9G8645402K45023K40958K58356K26420J79047K01809K48265K61110K41745K19458
$$ 78645402 78890425 79131383 79389739 79616159 79795206 79997015 80245280 80506390 80748135 80967593
3516.3H0967593K29478K63995K94852K71201K16473K02280K08425K28596K68805K65116
$$ 80967593 81197071 81461066 81755918 82027119 82243592 82445872 82654297 82882893 83151698 83416814
3536.7H3416814K25806K54506L22050L11702K16490J67990K08878K29764K18004K44445
$$ 83416814 83642620 83897126 84219176 84530878 84747368 84915358 85124236 85354000 85572004 85816449
3557.1H5816449K82484K88683K90072L16924L07912K12127J64950K12031K64854K83134
$$ 85816449 86098933 86387616 86677688 86994612 87302524 87514651 87679601 87891632 88156486 88439620
3577.5H8439620L04114L32874L56573L71540L18181K24907K24411K82151L09515L06248
$$ 88439620 88743734 89076608 89433181 89804721 90122902 90347809 90572220 90854371 91163886 91470134
3597.9I1470134K91378K69371K72721L00026L13610K96044K86084K69217K37000K48110
$$ 91470134 91761512 92030883 92303604 92603630 92917240 93213284 93499368 93768585 94005585 94253695
3618.3I4253695K27416J50424J55753K40254K95401J85197P2545Q4251J05059J02151
$$ 94253695 94481111 94631535 94787288 95027542 95322943 95508140 95580685 95664936 95769995 95872146
3638.7I5872146J07545J32370J83743K35218J63602q4793j89066p9918O8873J32209
$$ 95872146 95979691 96112061 96295804 96531022 96694624 96609831 96420765 96340847 96409720 96541929
3659I6541929J35660J39922J71829K39580L07578K97034K70587K71517J20074j550
$$ 96541929 96677589 96817511 96989340 97228920 97536498 97833532 98104119 98375636 98495710 98494160
3679.4I8494160L4374J06156J81514K51949J72782l9625r0719k2149L3731N9706M7797
$$ 98494160 98528534 98634690 98816204 99068153 99240935 99201310 99110591 99088442 99122173 99181879 99229676
3701.9I9229676J9216N2446J23602J35106L2771p0578n8281R191O1768N9968J2183
$$ 99229676 99248892 99301338 99424940 99560046 99592817 99522239 99463958 99473149 99534917 99594885 99607068
3724.3I9607068j8376Q595Q5908J70035J46770M542q5318o1542J2463O2222K8091R650
$$ 99607068 99588692 99597287 99683195 99853230 100000000 100004542 99919224 99857682 99870145 99932367 99960458 99970108
3748.8I9970108m023q2749r1672k9451q178m1228l5620J5962L8004R865m0531n0193
$$ 99970108 99966085 99883336 99791664 99762213 99754035 99712807 99677187 99693149 99731153 99741018 99700487 99650294
3773.3I9650294M398O1208M3196k8551m3016k7275k6668n197K3901M5956P4023Q2695
$$ 99650294 99654692 99715900 99759096 99730545 99687529 99660254 99633586 99628389 99652290 99698246 99772269 99854964
3797.7I9854964O6054J9783m8673o2413o9779p4666r269Q1170J17987Q3256K8831o4385
$$ 99854964 99921018 99940801 99892128 99829715 99759936 99685270 99676001 99757171 99875158 99958414 99987245 99922860
3822.2I9922860j12647o2871j3882J7279N5600R0479R0349J2833p3946r2488o6388
$$ 99922860 99810213 99747342 99733460 99750739 99806339 99896818 99987167 100000000 99926054 99833566 99767178
3844.6I9767178k5356L9125J05178Q6737n6720j12158m9865L3903O4391K7102J0789
$$ 99767178 99741822 99780947 99886125 99972862 99916142 99803984 99754119 99788022 99852413 99879515 99890304
3867.1I9890304K4324q177n4658n4598k0915K8574M3947K5618j860m3118k2131J2201
$$ 99890304 99914628 99906451 99851793 99797195 99776280 99804854 99848801 99874419 99872559 99829441 99807310 99819511
3891.6I9819511j8793j1158O3246R9779M7415l4600q8454q7619m9305k223L9321N0384
$$ 99819511 99800718 99789560 99852806 99952585 100000000 99965400 99876946 99789327 99740022 99737799 99777120 99827504
3916I9827504J8257p886L487Q559o985O676L2407J1694k2948j6051J2457L2145M1455
$$ 99827504 99845761 99837875 99841362 99849921 99842936 99849612 99882019 99893713 99870765 99854714 99867171 99899316 99940771
3942.5I9940771L6621K2608P212q929j0746R00J3482K0266J4746o0j406J6689K9600
$$ 99940771 99977392 100000000 100007212 99998283 99987537 99988437 100001919 100022185 100036931 100036871 100035465 100052154 100081754
3969.1A00081754K0623Q285J5330J8442K754N579K5832J8454l505k14J6117J3852J728
$$ 100081754 100102377 100110662 100125992 100144434 100147188 100152767 100178599 100197053 100193548 100193334 100209451 100223303 100225031
3995.6A00225031O462
$$ 100225031 100231493
3997.6A00231493
$$ 100231493
##END=$$ End of the data block
