##TITLE=G3-Salen $$ Begin of the data block
##JCAMP-DX=5.00 $$ ACD/SpecManager v 10.08
##SPECTROMETER/DATA SYSTEM=Alpha
##DATE=08 Apr 2014 08:54:24
##DATA TYPE=INFRARED SPECTRUM
##DATA CLASS=XYDATA
##ORIGIN=
##OWNER=
##NPOINTS=1765
##FIRSTX=399.75695801
##LASTX=3997.56933594
##MAXX=3997.56933594
##MINX=399.75695801
##MAXY=0.85095364
##MINY=0.43978196
##XFACTOR=1.0000000000
##YFACTOR=1.000000000000000e-9
##FIRSTY=0.84761405
##DELTAX=2.03957629
##XUNITS=1/CM
##YUNITS=ARBITRARY UNITS
##XYDATA=(X++(Y..Y))
399.8H47614050p36833j357197M3153J430333K35796j913428k015472q21829l58820
418.1H42119753j184165k870023m385353m866957o298006r000540o522834L118336
434.4H10110211J1559725J1313617N658806J020431j31488J137376J459718p20739
450.7H41407657k725542k047062k20597r0241k366602m227996m190684n499899j0886312
469.1H09152722j3488412n232155O909490J0863900O521404K82883l541588l056050
485.4H08412194M335523J1553466J0202706N124152L365040K676904J05619k343476
501.7H43432128j685321R25779J664699m37320k310633j394630P91669J130462q01802
520.1H41315031j951516p54952J027584Q96633j016140k096713j023352M83215J98722
$$ y = [847614050, 846877217, 845520020, 845563173, 846993506, 847229302, 845315874, 843300402, 842478573, 842119753, 840935588, 838065565, 833680212, 828813255, 822515249, 813514709, 806991875, 810110211, 821669936, 832983553, 838642359, 839662790, 839531302, 840668678, 842128396, 841407657, 838682115, 836635053, 836414456, 836324215, 833957613, 829729617, 825538933, 820039034, 809152722, 795664310, 790432155, 797341645, 808205545, 814726949, 815009832, 811468244, 808412194, 812747717, 824301183, 834503889, 839628041, 842993081, 845669985, 845775604, 843432128, 841746807, 842672586, 844337285, 843899965, 841589332, 840194702, 840986371, 842116833, 841315031, 839363515, 838608563, 839636147, 840532780, 839516640, 837419927, 836396575, 836879790, 837078512]
538.4H37078512j529217k396226j550555q56459k346695n705178p891714o462693l343821
556.8H04995954l402591n405903k85625J0858118J5341759J0212541L272354q8334
573.1H35498273o4134P98464M78386p18355j183808j76310J043200P80762n30422j045585
593.5H34880471j97947P79927O47604m53651r70780j65344O96659L46005p68661j155257
613.9H33639026l05474O92487N29229n10871r96649m34339N9723o68346k230645l387987
634.3H26386154l615797m154265p160425j3558805k0969808j9470394K91109K4265647
650.6G82013416K8886259J8195748Q705795M359722J964390Q9109q91685r69768K77818
669H42630804R37163r6976r10521n92291K40624K84850p50303j551211j114249j89066
$$ y = [837078512, 835549295, 833153069, 831602514, 830746055, 828399360, 822694182, 814802468, 808339775, 804995954, 801593363, 796187460, 795901835, 806759953, 822101712, 832314253, 835586607, 835498273, 835434139, 836232603, 836710989, 835992634, 834808826, 834632516, 835675716, 836456478, 835926056, 834880471, 834682524, 835462451, 836110055, 835656404, 834685624, 834520280, 835216939, 835562944, 834794283, 833639026, 833333552, 834026039, 834555268, 834044397, 833047748, 832613409, 832673132, 832004786, 829774141, 826386154, 822770357, 818616092, 811455667, 797896862, 776927054, 757456660, 757747769, 782013416, 810899675, 829095423, 837801218, 842160940, 844125330, 844214439, 843322754, 842352986, 842630804, 843567967, 843470991, 842560470, 841968179, 842208803, 842493653, 841743350, 840192139, 839077890, 838888824]
689.4H38888824j65164j174927j960457j580953o12259o19590j796902k694964k283096
707.7H26000512j395226j622379l003955m000663l765941l254175l860951n820274
724G99276948p803082r007693j0838568j5123308k2174477l3211828n1816761o4950347
740.4E84350884l1402051K8395831J7206192l6114693j3179063M4646263L9809882
754.6F33713245Q596778J8342257M8480749N0740242K7669013M261553j3007999k5148570
771G53647268k4702251o105900J8240035L0642092K8732478K0757080J2729704O981909
787.3H40922415M115045L009975J633168o40214k375424k233624j099527j214564l295422
805.6H38821828n233883l979743k49147J484692k89619k532363k853513k012253k052784
$$ y = [838888824, 838723660, 837548733, 835588276, 834007323, 833395064, 832775474, 830978572, 828283608, 826000512, 824605286, 822982907, 819978952, 815978289, 812212348, 808958173, 805097222, 799276948, 791473866, 782466173, 771627605, 756504297, 734329820, 701117992, 649301231, 584350884, 552948833, 581344664, 598550856, 562436163, 549257100, 593903363, 633713245, 642310023, 660652280, 709133029, 759873271, 787542284, 791803837, 778795838, 753647268, 728945017, 722839117, 741079152, 771721244, 800453722, 821210802, 833940506, 840922415, 845037460, 848047435, 849680603, 849040389, 846664965, 844431341, 843331814, 842117250, 838821828, 833587945, 829608202, 829359055, 830843747, 830554128, 828021765, 825168252, 823155999, 821103215]
824H21103215l615498n168200n217373m456699m810870o769538q930981j0132432j1016905
842.3G60984719j3187349j6743541j9726395k0179809j7981469j4015198q631229j157940
858.7F49361789R695173K3141384L3568084L3741236K3264348J0026693K962471L720462
875G89481640N864501N355477M325867M156113L357887J096129j188516j948595k510071
893.3H07990432o162346j1021912n681216J1449158K1327018J5626967O248951J412452
909.6H41189504P78854J777172J783728J89960j194298q34227M05431N02527j047432
928H43551219l180385o101132j0726928r202838L772020J2658119Q866310L616274
944.3H43252659J609921l9398j261533j024067r7096k85327j919985l708244m742562
$$ y = [821103215, 817487717, 812319517, 807102144, 802645445, 797834575, 791065037, 782134056, 772001624, 760984719, 747797370, 731053829, 711327434, 691147625, 673166156, 659150958, 650519729, 649361789, 659056962, 682198346, 715766430, 749507666, 772772014, 782798707, 785761178, 789481640, 795346141, 800701618, 805027485, 809183598, 812541485, 813637614, 812449098, 810500503, 807990432, 801828086, 790806174, 785124958, 796574116, 817901134, 833528101, 839777052, 841189504, 841968358, 843745530, 845529258, 845719218, 844524920, 843690693, 844096124, 844598651, 843551219, 840370834, 834269702, 823542774, 814339936, 818111956, 830770075, 839636385, 843252659, 844862580, 844823182, 843561649, 842537582, 842440486, 842155159, 840235174, 836526930, 831784368]
962.7H31784368o162405j1736513k2667527k5393247r812236N534410M123926o159663
979G59511113n796790J3150394K7761579K1772265R325743K256751j62304n34594r81331
997.3H26302826k476632m173398m895449m901767n656242q140624j2059629j6879022
1013.7G67120063k3684323l3455669l4293056n169928M0526092N7774723L8117647
1027.9H06935549J1594116n475699j7100275k9740334m3960571m7483384k1667898
1042.2F53101504K4425685N2935481M9105645L1800866J7424941R065687N188644L249705
1058.5H46298158J469255k11835r82881p31528n00142j058281j799643j648843o54459
1076.9H40179801K0981m09305j341105j634121j166045q75950j478136k561629l447115
$$ y = [831784368, 825621963, 813885450, 791217923, 765824676, 756012440, 761546850, 765670776, 759511113, 753714323, 766864717, 794626296, 816398561, 825724304, 827981055, 827818751, 827284157, 826302826, 823826194, 819652796, 814757347, 809855580, 804199338, 796058714, 783999085, 767120063, 743435740, 709980071, 675687015, 670517087, 711043179, 768817902, 806935549, 818529665, 813053966, 795953691, 766213357, 722252786, 674769402, 653101504, 677527189, 730462670, 779568315, 811369181, 828794122, 837859809, 843048453, 846298158, 847767413, 847555578, 846572697, 845841169, 845341027, 844282746, 842483103, 840834260, 840179801, 840200782, 839791477, 838450372, 836816251, 835650206, 834774256, 833296120, 830734491, 827287376]
1095.2H27287376m263043n881787q632302j0623038q357286l003002k414465q441805
1111.6G75670648r054602M439831J9773245K1711469J3439595N366445J112700l77953
1127.9H32081378o20485r75907j978218l233671m482508o961763j3689458k8904319
1144.2G71235049m7541440m6943903q243620M6010911O4334035M0814877J5255928
1158.5H34921837M516661R48489p84457j706421j599789q80837n26906j022040j770974
1176.8H32095563k153337k205669k659739l979146n882204p852792j0377765j5181780
1193.1G81803131k2115528k4127186j2168824Q200287K0282209J8175841R141206Q64923
1209.5G80056059l807783o299436q628964q481324j776099R015798J5578986J4528513
$$ y = [827287376, 823024333, 817142546, 808510244, 797887206, 789529920, 786526918, 784112453, 775670648, 766616046, 771055877, 790829122, 812540591, 825980186, 831346631, 832459331, 832081378, 831460893, 830484986, 828506768, 825273097, 820790589, 813828826, 800139368, 771235049, 723693609, 676749706, 668506086, 714516997, 778851032, 819665909, 834921837, 839438498, 840386987, 839602530, 837896109, 836296320, 835415483, 834888577, 833866537, 832095563, 829942226, 827736557, 825076818, 821097672, 815215468, 807362676, 796984911, 781803131, 759687603, 735560417, 723391593, 731591880, 751874089, 770049930, 779191136, 780056059, 776248276, 769948840, 761319876, 752838552, 751062453, 760078251, 775657237, 790185750]
1225.8G90185750J0289073P247388N332470K900839k52247l049314m807711o249368
1242.1H01596880q379161r614170m926801O570161J5159011J2890160M676878j904309
1258.4H16068649m994929n376219m881323o106376r896994j5052974k0983458k8145551
1274.7G20630825l6611021m4404387m5426190k6720941J7236113N7408393N7280778
1289F99393570K8258026Q065760P876873J5234232J9425512J8654525J4251351Q533299
1305.3H19693148L942311R31799j959443n799532p751286j919210R347201J3791740
1321.6H30276728R149789L528655L97980j168310j797140j841784j749813j702547
1338H35093558j445651q03232l55721m81009j032353j534939j733780j820802k240181
$$ y = [790185750, 800474823, 807722211, 813054681, 815955520, 815703273, 812653959, 807846248, 801596880, 793217719, 783603549, 778676748, 785246909, 800405920, 813296080, 817972958, 816068649, 811073720, 805697501, 800816178, 794709802, 784812808, 769759834, 748776376, 720630825, 684019804, 639615417, 594189227, 567468286, 584704399, 642112792, 699393570, 727651596, 735717356, 743594229, 758828461, 778253973, 796908498, 811159849, 819693148, 823635459, 824567258, 822607815, 816808283, 809056997, 807137787, 816484988, 830276728, 839426517, 842955172, 843353152, 842184842, 840387702, 838545918, 836796105, 835093558, 833647907, 832844675, 832488954, 832007945, 830975592, 829440653, 827706873, 825886071, 823645890]
1356.3H23645890l179252m931391q082091j1777282j5471637j8128932j3660312j707196
1372.6G46707797R347737J1768103Q395731M724264J900435J69277j044572k272546
1388.9G79696226l306389m933774p222116q541286r106517q351266o666661n217731
1405.3G26350486l318250k365053l846764o980598r278834q329570n35012J1023641
1421.6G02720046J8889785K0885169J7482520J4580130J1414707O967783L372788K85328
1437.9G96598256k105415m271627o777405j0012210j5221059k0722807k3631036j9774794
1454.2F94081903r770275m238963k921760Q801997K9553950L6857724K2167802R882331
1470.5G84414709M283785O74963k117216m670262p611275j0850251j4000058j8981338
$$ y = [823645890, 820466638, 815535247, 807453156, 795675874, 780204237, 762075305, 748414993, 746707797, 756055534, 767823637, 776219368, 780943632, 782844067, 783013344, 781968772, 779696226, 776389837, 771456063, 764233947, 755692661, 746586144, 738234878, 731568217, 726350486, 723032236, 720667183, 716820419, 709839821, 700560987, 692231417, 691696405, 702720046, 721609831, 742495000, 759977520, 774557650, 785972357, 792940140, 796312928, 796598256, 794492841, 790221214, 783443809, 773431599, 758210540, 737487733, 713856697, 694081903, 684311628, 680072665, 677150905, 685952902, 715506852, 752364576, 774532378, 784414709, 788698494, 789373457, 787256241, 782585979, 774974704, 764124453, 750124395, 731143057]
1486.8G31143057k7212143l2811403k9164255k6254534j9057572Q095145L4094036
1501.1F38832331M1672945M4451832M7875047K6185036R058654M374624J345932j142144
1517.4H12654257k563775l427386k801895j211345L31044J699507K392113K498627
1533.7H09571147J485765j96338k416491l454983k845169l089070m013002n502581
1550.1G89539278o308020o382405o354034r936750j3721168r279192r819925j3144612
1566.4G14593172j8715918k6528895k5584280k2852004j7190993L316164K1310210
1580.7F28347456L0281067K9101134K0420074J0934949L603935j974284o063283q371174
1597G06279874r864807j1952102j4088095j4733493j2831509q087099k113938J856029
$$ y = [731143057, 703930914, 671119511, 641955256, 615700722, 596643150, 604738295, 638832331, 680505276, 724957108, 772832155, 799017191, 808075845, 812450469, 813796401, 812654257, 810090482, 806663096, 803861201, 802649856, 802980900, 804680407, 807072520, 809571147, 811056912, 810860574, 808444083, 804989100, 802143931, 799054861, 795041859, 789539278, 783231258, 776848853, 770494819, 760558069, 746836901, 737557709, 727737784, 714593172, 695877254, 669348359, 643764079, 620912075, 603721082, 607037246, 628347456, 658628523, 687729657, 708149731, 719084680, 722688615, 720714331, 714651048, 706279874, 696415067, 684462965, 670374870, 655641377, 642809868, 634722769, 632608831, 634464860]
1613.3F34464860L707528M299462J960993k894521j1547029k2436798l5107612m5367837
1629.6E27079046m3055773l4516424r724885M1192412O9721937O9758296N3876758
1643.9F74331367M2209148L3190489J7953515J3597369J6646028R294629M517675L178477
1660.2H14918697K028584J231254Q41796Q64088J083553R53853M05670L90648J380146
1678.6H24098289K845466M482448O011784L908038J328946L08573k47598m73022l23713
1696.9H41939211K19583O48976P51734N75542M23253J40488j44184k93076l28779k8253
1717.3H43904495N17726Q18849R17554J024067R39131P62641M86970L07381M60506
1735.7H50139320M27365K61545J25409q285j66715k24828k70725k51293l00527m64916
$$ y = [634464860, 638172388, 642471850, 644432843, 641538322, 629991293, 607554495, 572446883, 527079046, 484023273, 449506849, 439781964, 480974376, 550696313, 620454609, 674331367, 716540515, 749731004, 767684519, 781281888, 797927916, 807222545, 811740220, 814918697, 816947281, 818178535, 819020331, 819884419, 820967972, 821921825, 822327495, 822718143, 824098289, 826943755, 831426203, 837437987, 841346025, 842674971, 842983544, 842735946, 842262924, 841939211, 842158794, 842807770, 843559504, 844135046, 844558299, 844698787, 844554603, 844261527, 843932748, 843904495, 844422221, 845241070, 846158624, 847182691, 848121822, 848884463, 849371433, 849678814, 850139320, 850566685, 850828230, 850953639, 850945354, 850778639, 850553811, 850283086, 850031793, 849731266, 849266350]
1756.1H49266350m79221m19498m52578m06026m01378m74632n08964o57856o08862n24580
1776.5H44332755o47784p61628p90417r06706j059890j166343j547993j835286j345337
1794.8H34271371p18355k07484N01156J092732J192868J045465Q74877P27773N25653
1813.2H39306056K36631k1696r8407j12176k34723m07458m97579m86732j79827J81079
1833.6H37685168K00450Q2851M5120J9133m5061L577P629r8109j32263j01626r5129
1856H37571740j68383k57730l02315l38495n07653q22723r88006r36091p13647q0704
1876.4H32455993O34134Q21828N60999J84775j86861n18560o36936n25355m48048n29587
1896.8H31812382q43466j275241j432002j092672o02484k85506L1412M38094P27355
$$ y = [849266350, 848787129, 848367631, 847915053, 847509027, 847107649, 846633017, 846124053, 845466197, 844857335, 844332755, 843684971, 842923343, 842132926, 841226220, 840166330, 838999987, 837451994, 835616708, 834271371, 833553016, 833345532, 833846688, 834939420, 836132288, 837177753, 838052630, 838780403, 839306056, 839542687, 839520991, 839422584, 839310408, 839075685, 838668227, 838170648, 837683916, 837504089, 837685168, 837885618, 837968469, 838013589, 838032722, 837987661, 837991238, 837998867, 837900758, 837768495, 837666869, 837571740, 837403357, 837145627, 836843312, 836504817, 835997164, 835174441, 834186435, 833250344, 832536697, 832455993, 833090127, 833911955, 834472954, 834657729, 834470868, 833952308, 833315372, 832790017, 832341969, 831812382, 830968916, 829693675, 828261673, 827169001, 826566517, 826281011, 826312423, 826750517, 827477872]
1915.1H27477872Q63374Q09013M47214K6345k84850o29187j029134j357615j562893
1933.5H24760139j593113j462817j290918q42273M06325J819372K257169J737475R40919
1951.9H26732278L65972J38224P2658p0036l07441n02944n29587l97742l04281l73662
1972.3H24823439m22537k95997j23441j13189k59459l60489k86460j59085k06888m04536
1992.6H22191358m90547l59296j96219j82390k72691k88487j32382Q1837J07766p6533
2013H20382416k08318j32799N9m0233k08318k97904k20835j14858j89185l82007m42266
2035.5H18145752l09169j54555j73211l49105m55141m05669l60191m74870o40035o01828
2055.9H14221978k81036Q8036K00212J10090O4969J00315O8307q8632k58208k97785
$$ y = [827477872, 828341246, 829150259, 829597473, 829623818, 829338968, 828709781, 827680647, 826323032, 824760139, 823167026, 821704209, 820413291, 819571018, 819977343, 821796715, 824053884, 825791359, 826732278, 827098250, 827236474, 827309132, 827239096, 826931655, 826428711, 825899124, 825501382, 825197101, 824823439, 824400902, 824104905, 823981464, 823868275, 823608816, 823248327, 822961867, 822802782, 822595894, 822191358, 821700811, 821341515, 821145296, 820962906, 820690215, 820401728, 820269346, 820351183, 820458949, 820382416, 820174098, 820041299, 820041358, 820001125, 819792807, 819494903, 819274068, 819159210, 818970025, 818588018, 818145752, 817836583, 817682028, 817508817, 817159712, 816704571, 816298902, 815938711, 815463841, 814823806, 814221978, 813940942, 814028978, 814229190, 814339280, 814404249, 814504564, 814572871, 814484239, 814226031, 813928246]
2076.3H13928246k19821j68264k48373m35531n80192n76317m63903l16381j31309N4895
2096.7H10843050J54853J49191N1617r4175k02894k21729j87517j83284k27094k66730
2117.1H09815288k79189k65359k27035j95622j93298j97112j56403q0347p1645j76012
2137.5H07973266k81573k89261k23517j82569k33889k83659k13503r1970p5698k23160
2157.9H05874467l99709m13418l13699k83241l53277l99113k81274m2379J02401P1406
2178.2H03562164L2723J03474J66178P2539j45197k88010j97530O0J9014j75655l37541
2200.7H02812219k65539o0499n781j72913l48926l46601k30193k21253l86417n26487
2221.1H00247610m57168k79427k51352m39287o51538o64711m85778l57807l83794l65674
$$ y = [813928246, 813708425, 813540161, 813291788, 812856257, 812276065, 811699748, 811235845, 810919464, 810788155, 810843050, 810997903, 811147094, 811198711, 811104536, 810901642, 810679913, 810492396, 810309112, 810082018, 809815288, 809536099, 809270740, 809043705, 808848083, 808654785, 808457673, 808301270, 808220923, 808149278, 807973266, 807691693, 807402432, 807178915, 806996346, 806762457, 806478798, 806265295, 806173325, 806097627, 805874467, 805474758, 805061340, 804747641, 804464400, 804111123, 803712010, 803430736, 803388357, 803490758, 803562164, 803594887, 803698361, 803864539, 803937078, 803791881, 803503871, 803306341, 803306401, 803325415, 803149760, 802812219, 802546680, 802486181, 802480400, 802307487, 801958561, 801611960, 801381767, 801160514, 800774097, 800247610, 799790442, 799511015, 799259663, 798820376, 798168838, 797504127, 797018349, 796660542, 796276748, 795911074]
2241.5G95911074j63138M1246j2994k80738m53710l47436r1671P629j92165m24088
2261.9G93994009l94284j97172j10507k46346l86060l04997j26779p8380j40548j98900
2282.3G91810036j74284k9981O2584p2479k96712m14014m63485m93586m99368n21600
2302.7G88907111n51999n42283n25177o05165p37012p51853o54995o42538p55370p86007
2323.1G82354712o84499o32882o92130p55488q17836q84235p70628n00560k69890k5809
2343.5G76320755L67225N41508J07527o48558j242400j300633q45313k70962k5988
2361.8G73003161k7776P4089K67029M05073L62992J37031L6121J66773K56360P4863
2382.2G74755716k61485m58956m71592n03600o25610o98626n73039k59519k4974j33276
$$ y = [795911074, 795747936, 795789182, 795776188, 795495450, 795041740, 794694304, 794602633, 794610262, 794418097, 793994009, 793599725, 793402553, 793292046, 793045700, 792659640, 792354643, 792227864, 792149484, 792008936, 791810036, 791635752, 791605771, 791668355, 791595876, 791299164, 790885150, 790421665, 789928079, 789428711, 788907111, 788355112, 787812829, 787287652, 786682487, 785945475, 785193622, 784538627, 783896089, 783140719, 782354712, 781670213, 781037331, 780345201, 779589713, 778771877, 777887642, 777117014, 776616454, 776346564, 776320755, 776687980, 777229488, 777337015, 776688457, 775446057, 774145424, 773300111, 773029149, 773003161, 772975385, 773049474, 773316503, 773721576, 774084568, 774221599, 774257720, 774424493, 774680853, 774755716, 774494231, 774035275, 773563683, 773060083, 772434473, 771735847, 771162808, 770903289, 770878315, 770745039]
2402.6G70745039m50254n79237l94345j32203k6166r7335j57833l6359J22667N2690
2423G69046664k00033l54052k82466j34826j22666k84195m21941l59476k12967k13266
2443.4G66460776l80277n07295m39346l03865l08573m29392n00917m49300l74138m17889
2463.8G62349784n67317o31332m79937k59578j53184j87933k90990l16918k89381l89397
2484.2G58783817o29842q26061p84099n40495l42726l22879l53575k68340j40071j70648
2504.6G54405081l64899n25117n21899m06026l03626k93434l03447k15352r2387j04904
2525G51273990k99275n20408n61595m01914k24710j76907k05278j94848j80423k95222
2545.4G48213410n63621q41499q96394o23166j72019J85251K80082K15173J89066J82152
$$ y = [770745039, 770294785, 769715548, 769321203, 769189000, 769162834, 769065499, 768907666, 768871307, 768993974, 769046664, 768846631, 768492579, 768210113, 768075287, 767952621, 767668426, 767246485, 766887009, 766674042, 766460776, 766080499, 765573204, 765133858, 764829993, 764521420, 764092028, 763591111, 763141811, 762767673, 762349784, 761782467, 761151135, 760671198, 760411620, 760258436, 760070503, 759779513, 759462595, 759173214, 758783817, 758153975, 757327914, 756543815, 756003320, 755660594, 755337715, 754984140, 754715800, 754575729, 754405081, 754040182, 753515065, 752993166, 752587140, 752283514, 751990080, 751686633, 751471281, 751378894, 751273990, 750974715, 750454307, 749892712, 749490798, 749266088, 749089181, 748883903, 748689055, 748508632, 748213410, 747649789, 746808290, 745911896, 745288730, 745116711, 745301962, 745582044, 745797217, 745986283, 746168435]
2565.8G46168435L7789j98305l21388k97666k31862j92821j91152j57475l3200P2539
2586.2G44654894J8060q9586k2888K13981M39286M99964L75449J86801M7744m8280
2606.6G46275425j56105k27868j68681l5405N7816P8440k5749k18630l91603o05464
2626.9G44582176r07779j147389j052380m63962L21269Q03053Q75295P63237O39141
2645.3G44412661N08964L12805Q8692n7221p7724P271J40071K73168M33922O47187
2665.7G46689796Q49903R89795J021206R42886Q79169Q56280P61151N53310L25561
2684.1G53869057K09152K22981K72930K32935L9399k25306m72724p20501j022220j327038
2704.5G51078665j438081j249909r06825o34850m86552l68059j97351N96J05500P9871
$$ y = [746168435, 746206224, 746007919, 745686531, 745388865, 745157003, 744964182, 744773030, 744615555, 744582355, 744654894, 744672954, 744583368, 744560480, 744774461, 745213747, 745713711, 746089160, 746275961, 746323705, 746275425, 746119320, 745891452, 745722771, 745687366, 745745182, 745823622, 745797873, 745579243, 745187640, 744582176, 743674397, 742527008, 741474628, 741010666, 741331935, 742134988, 743010283, 743773520, 744412661, 744921625, 745234430, 745323122, 745265901, 745188177, 745195448, 745335519, 745608687, 746042609, 746689796, 747539699, 748529494, 749550700, 750493586, 751372755, 752229035, 752990186, 753543496, 753869057, 754078209, 754301190, 754574120, 754807055, 754846454, 754621148, 754148424, 753427923, 752405703, 751078665, 749640584, 748390675, 747483850, 746849000, 746362448, 745994389, 745797038, 745797634, 745903134, 745983005]
2724.8G45983005o617K444J50740J76669k7299k25604k03073K3723K88963N00858O22153
2747.3G47285962O52790O72937O84976O11663M86612M72725O13570P37011P28190O70135
2767.7G53616571O94931P84695O57082P8499o37531j033187j100421j004875q13186
2786G51242578n65469l39568j85251o9201L5763Q3506J22249K69353M01438L89516
2806.4G51384914L56555L90887M48227M26412K61426O9976l1233j08779k76446n58138
2826.8G52363801q13723q80658q08060p18594o72460p69853r74179j044213r80258
2845.2G44701803j036704j234889j367152j401543j537442j858652k253831k508342
2861.5G31503248k347171j740873r03368J13845J208246J947403K157211K089977J813770
$$ y = [745983005, 745976388, 745978832, 746129572, 746306241, 746278942, 746053338, 745850265, 745873988, 746162951, 746663809, 747285962, 747938752, 748611689, 749296665, 749908328, 750394940, 750867665, 751481235, 752218246, 752946436, 753616571, 754311502, 755096197, 755753279, 755831778, 755194247, 754161060, 753060639, 752055764, 751242578, 750677109, 750337541, 750152290, 750083089, 750118852, 750202358, 750324607, 750593960, 750995398, 751384914, 751741469, 752132356, 752580583, 753006995, 753268421, 753338397, 753307164, 753198385, 752921939, 752363801, 751550078, 750669420, 749861360, 749142766, 748470306, 747700453, 746726274, 745682061, 744701803, 743665099, 742430210, 741063058, 739661515, 738124073, 736265421, 734011590, 731503248, 729156077, 727415204, 726511836, 726625681, 727833927, 729781330, 731938541, 734028518, 735842288]
2879.9G35842288J295089O57022j15096j100779k256751l479838m660607n550146n126118
2898.2G15505064k066732K897739O560207O591320L978670J214921m17173j018762
2914.5G33245254r55821n58733l15130n86868j291394j872957j645624l42131J741290
2932.9G27417886L744960M702449M388094L330588K117336R47833j31369q89957j141607
2951.2G44486213r92835m11331P49289K103806K955377K977133K407849J665354R59992
2969.6G56900847L60787j46985o39022j039922j292109j490712j509548j178741o36637
2987.9G49327958j79887o4135k96354o20067q91149j124442j273095j318455j212001
3006.3G42348373p04050L80874J721561K636909K762556K315819J725495J259446Q37446
$$ y = [735842288, 737137377, 737794399, 737679303, 736578524, 734321773, 730841935, 726181328, 720631182, 715505064, 713438332, 716336071, 722896278, 729487598, 733466268, 734681189, 734264016, 733245254, 732289433, 731730700, 731415570, 730828702, 729537308, 727664351, 726018727, 725676596, 727417886, 731162846, 735865295, 740253389, 743583977, 745701313, 746649146, 746517777, 745627820, 744486213, 743493378, 743082047, 743831336, 745935142, 748890519, 751867652, 754275501, 755940855, 756900847, 757261634, 757114649, 756475627, 755435705, 754143596, 752652884, 751143336, 749964595, 749327958, 749148071, 749083936, 748787582, 748167515, 747276366, 746151924, 744878829, 743560374, 742348373, 741644323, 742025197, 743746758, 746383667, 749146223, 751462042, 753187537, 754446983, 755284429]
3024.7G55284429L53276M7446o4731l25680r08077j496017j610934j562953j875103
3043G47841656k301156k301514j597941m63605N43594J034915P66874L09765R26018
3061.4G44758606K612650L756166L299296K048433J220643R66191R34542R16421Q09610
3079.7G61322558O80566N43058L34382K32160K54392J36435k8252P15J21474J39594
3100.1G63737082O0142L0994Q3745O1154n9664m888J99914J45316j05917k91288m10080
3122.6G63446510l86775k48313j58190j49429j58131j29640p7308r9539k45274l52561
3143G61441350l47793l55423l69072l19778l13044m24326n13851m77731l96491l29196
3163.4G57594645k78473k86698l38197l39806k86579k98858l73244m01914m21524m66824
$$ y = [755284429, 755637705, 755685151, 755620420, 755294740, 754386663, 752890646, 751279712, 749716759, 747841656, 745540500, 743238986, 741641045, 741177440, 741721034, 742755949, 743522823, 743832588, 744758606, 747371256, 751127422, 754426718, 756475151, 757695794, 758661985, 759596527, 760512948, 761322558, 762003124, 762546182, 762880564, 763112724, 763367116, 763503551, 763475299, 763476014, 763597488, 763737082, 763797224, 763828218, 763911963, 763973117, 763913453, 763908565, 764108479, 764253795, 764147878, 763856590, 763446510, 763059735, 762811422, 762653232, 762503803, 762345672, 762216032, 762138724, 762039185, 761793911, 761441350, 761093557, 760738134, 760369062, 760049284, 759736240, 759311914, 758798063, 758320332, 757923841, 757594645, 757316172, 757029474, 756691277, 756351471, 756064892, 755766034, 755392790, 754990876, 754569352, 754102528]
3183.7G54102528m79221m56870m85480n51343n73992n98312o46531o80864o97494o75857
3204.1G48256564n93781n26667n69999o39081o19173n92292o29782o83606p33197p60734
3224.5G41908252p49290p17401o70910o66499q04901r82702j020670r91166r92119
3242.9G34312594r92537j055479j194358j147687p45296j61887K58863L05474J16646
3261.2G29696333q1658k40207l67820m32014m68076n15997n44190o11485p43031q57949
3281.6G24833906r08554q58545p36416o42836o94215q64863j004815j118243j149535
3300G16855884r13561o31869p67946j257777j630724j663863j500964j389742j394868
3318.4G05704570j446724j429796j383067j572191j887739j951158j831532j691877
$$ y = [754102528, 753623307, 753166437, 752680957, 752129614, 751555622, 750957310, 750310779, 749629915, 748932421, 748256564, 747662783, 747136116, 746566117, 745927036, 745307863, 744715571, 744085789, 743402183, 742668986, 741908252, 741158962, 740441561, 739770651, 739104152, 738299251, 737316549, 736295879, 735304713, 734312594, 733320057, 732264578, 731070220, 729922533, 729177237, 729015350, 729274213, 729579687, 729696333, 729614675, 729374468, 729006648, 728574634, 728106558, 727590561, 727046371, 726434886, 725691855, 724833906, 723925352, 723066807, 722330391, 721687555, 720993340, 720128477, 719123662, 718005419, 716855884, 715942323, 715310454, 714542508, 713284731, 711654007, 709990144, 708489180, 707099438, 705704570, 704257846, 702828050, 701444983, 699872792, 697985053, 696033895, 694202363, 692510486]
3334.7F92510486j559675j699865k028167k182842k271533k232313j969397k031266
3351F76535428k474666k613783k376080k220690k359032k493203k287328k090812k327740
3369.3F55292094k770305k817810k435088k192080k172351k154588k059698j871944
3385.7F36818230j618743j316368j321376j719296j810193j343310j000881j347720
3402F25340343j846672j682579j205564j045465j106799j223087j263619j059830q55446
3420.3F14051282q23676o94275l64125j24156k06113k43783m2796q0884l94344m19319
3440.7F10657811n6207K80559L84510L70025M13180M99308N95391P97510J008451R16660
3461.1F15867198P74621J057625J312852R79245M71532M56274Q11100J150191J220822
$$ y = [692510486, 690950811, 689250946, 687222779, 685039937, 682768404, 680536091, 678566694, 676535428, 674060762, 671446979, 669070899, 666850209, 664491177, 661997974, 659710646, 657619834, 655292094, 652521789, 649703979, 647268891, 645076811, 642904460, 640749872, 638690174, 636818230, 635199487, 633883119, 632561743, 630842447, 629032254, 627688944, 626688063, 625340343, 623493671, 621811092, 620605528, 619560063, 618453264, 617230177, 615966558, 614906728, 614051282, 613227606, 612533331, 612169206, 612045050, 611838937, 611595154, 611552358, 611471474, 611077130, 610657811, 610601604, 610882163, 611266673, 611636698, 612049878, 612549186, 613144577, 613942087, 614950538, 615867198, 616641819, 617699444, 619012296, 619991541, 620463073, 620919347, 621730447, 622880638, 624101460]
3479.5F24101460R32872P77364R57370J018345R59277J045704J158357J191914J130581
3497.8F33273244J091361J138806R90153P80761R05394J229525J465201J362622J054883
3516.2F43291950R72212J169860J446545J380920J039029J061141J330197J445413
3532.5F53137267J534581J528382J338720J393021J639902J601041J289069J162529
3548.8F64624512J274944J382350J460731J516760J572370J577735J362563J168727
3565.1F75940692J568616K065182J900851J645923J673877J832128K028882K146662
3581.5F90802813K006411J723647J725793K050936K036453J853764J942277K094805
3597.8G06236899K020836J904249J800358J602590J638711J841307J779675J658797
$$ y = [624101460, 625034332, 625811696, 626769066, 627787411, 628746688, 629792392, 630950749, 632142663, 633273244, 634364605, 635503411, 636493564, 637274325, 638179719, 639409244, 640874445, 642237067, 643291950, 644264162, 645434022, 646880567, 648261487, 649300516, 650361657, 651691854, 653137267, 654671848, 656200230, 657538950, 658931971, 660571873, 662172914, 663461983, 664624512, 665899456, 667281806, 668742537, 670259297, 671831667, 673409402, 674771965, 675940692, 677509308, 679574490, 681475341, 683121264, 684795141, 686627269, 688656151, 690802813, 692809224, 694532871, 696258664, 698309600, 700346053, 702199817, 704142094, 706236899, 708257735, 710161984, 711962342, 713564932, 715203643, 717044950, 718824625, 720483422]
3614.1G20483422J503945J459062J787901J800537J347601Q72970Q58784J508474J593649
3632.4G33216345J246572J046061R63629R67264R50575O93679L01599L96788R46820
3650.8G40729332Q18312M50850O46174R04321N19514Q2374O4909k98k44021k0802O5625
3673.2G44016290k58088J09911N66780N62310M56751L16441J77324R3281K43723M38214
3693.6G46722937L54170J31607l5047m0114J31428R9361j83463l57091n3108M05908
3714G47176588L26097k6703k81334l08335j51932J04129K65598L2783l33727l10897
3734.4G46492267J71423M59551N4062p10726p74503K8670m2736k75493L66926N45800
3754.8G46315241O2823j81794M3333Q9585q4817j05083j14620p7843M5776N9068l1054
$$ y = [720483422, 721987367, 723446429, 725234330, 727034867, 728382468, 729255438, 730114222, 731622696, 733216345, 734462917, 735508978, 736472607, 737439871, 738390446, 739084125, 739385724, 739782512, 740729332, 741547644, 741998494, 742644668, 743548989, 744068503, 744150877, 744215786, 744215488, 743971467, 743950665, 744016290, 743758202, 743868113, 744434893, 744997203, 745453954, 745770395, 745947719, 746041000, 746284723, 746722937, 747077107, 747208714, 747173667, 747133553, 747264981, 747364342, 747180879, 746823788, 746770680, 747176588, 747502685, 747475982, 747194648, 746886313, 746734381, 746838510, 747104108, 747136891, 746803164, 746492267, 746663690, 747123241, 747177303, 746466577, 745692074, 745720744, 745678008, 745402515, 745769441, 746315241, 746378064, 746196270, 746239603, 746329188, 746244371, 746139288, 746024668, 745946825, 745992601, 746051669, 746020615]
3777.3G46020615j49250k30968l07739k82466j17064m351l0279j96993l40700l05534
3797.7G44055271m01556l73245Q8334J21952N9962J82867K7597k82645l13580r3043
3818G43071914k40326j52707J69515N3346o7174j49906j80065m7446k02179m35352
3838.4G41819620j29163J90437K79784K20418p0512o37532j167595l08275O76453M56691
3858.8G41330326m3810l98755k65241m4643k48135k40206P391J26719Q4400k17437
3879.2G40090609k12968l1829j14619m0472j01685k82169j00493k2412k92658m77732
3899.6G38413572m16755k38479Q3387K54810Q3327j32262k54631l38257k64048r9123
3920G37091541r0956j55390j07526q3507j80482j76371p8499j23978k03013k48909
$$ y = [746020615, 745871365, 745640397, 745332658, 745050192, 744933128, 744928777, 744898498, 744701505, 744360805, 744055271, 743653715, 743280470, 743368804, 743490756, 743550718, 743733585, 743761182, 743478537, 743164957, 743071914, 742831588, 742678881, 742848396, 742901742, 742834568, 742684662, 742504597, 742457151, 742254972, 741819620, 741690457, 741880894, 742160678, 742381096, 742310584, 741673052, 740505457, 740197182, 740873635, 741330326, 741286516, 740887761, 740622520, 740577877, 740329742, 740089536, 740096927, 740223646, 740308046, 740090609, 739877641, 739845812, 739731193, 739690721, 739589036, 739306867, 739206374, 739183962, 738891304, 738413572, 737996817, 737758338, 737841725, 738096535, 738179862, 738047600, 737792969, 737454712, 737190664, 737091541, 737000585, 736845195, 736737669, 736654162, 736473680, 736297309, 736218810, 736094832, 735891819, 735642910]
3940.4G35642910k62260o4195J19925J00791Q8692J79410K47538J94609J26422Q9764
3960.8G36463606K0922l8445l6061j0193l7074j00374q7798l5166n2035n2214k3246
3983.2G36011922j10805k16841j80960p4267j9372o5803r4831
3997.5G35249043
$$ y = [735642910, 735380650, 735316455, 735436380, 735537171, 735625863, 735805273, 736052811, 736247420, 736373842, 736463606, 736484528, 736446083, 736410022, 736399829, 736362755, 736262381, 736174583, 736139417, 736087382, 736035168, 736011922, 735901117, 735684276, 735503316, 735429049, 735409677, 735343874, 735249043]
##END=$$ End of the data block
