##TITLE=G3-[Ni(Salen)] $$ Begin of the data block
##JCAMP-DX=5.00 $$ ACD/SpecManager v 10.08
##SPECTROMETER/DATA SYSTEM=Alpha
##DATE=16 Apr 2014 10:35:00
##DATA TYPE=INFRARED SPECTRUM
##DATA CLASS=XYDATA
##ORIGIN=
##OWNER=
##NPOINTS=1765
##FIRSTX=399.75695801
##LASTX=3997.56933594
##MAXX=3997.56933594
##MINX=399.75695801
##MAXY=0.78206098
##MINY=0.06795751
##XFACTOR=1.0000000000
##YFACTOR=1.000000000000000e-9
##FIRSTY=0.70786905
##DELTAX=2.03957629
##XUNITS=1/CM
##YUNITS=ARBITRARY UNITS
##XYDATA=(X++(Y..Y))
399.8 707869053 664849401 594285607 511757553 469662875 506314814 593973815 673879385
414 673879385 719514549 738620281 741656244 733582258 711419523 671834826 627686024 609199286
430.4 609199286 637178302 691293538 734954834 756366551 764568090 766889989 765995026 763603628
446.7 763603628 760877192 758017957 753872991 746302068 731249154 701311350 649647355 584656358
463 584656358 535532296 518213391 531153500 580423951 651546001 705537081 731397808 738972902
479.3 738972902 733216643 716912806 697317243 686787426 693995416 714778125 736613631 751949489
495.6 751949489 759995103 762137115 762080610 763388574 764742315 763377428 760316968 758096457 754496276
514 754496276 740745664 711573541 688626170 699913919 730277836 749428391 756237745 760563374
530.3 760563374 762985766 761623800 759000599 758668125 759202182 756880522 751968384 747684717 744196534
548.6 744196534 738392532 731405973 730105460 736511707 744115889 747306287 747890949 749414802 750638783
567 750638783 748940647 746007800 744985044 745011747 743018985 738874972 735557079 733727753 730427027
585.4 730427027 723705590 714694142 702815115 682648599 648975372 610005617 592273891 611147583
601.7 611147583 648015082 679953396 703300357 720705152 731895745 736824453 738331318 739014387
618 739014387 737777412 731629670 716910779 687363148 645732045 615456879 618651390 656207681
634.3 656207681 706539392 740794420 752714217 754616678 754854143 754442036 752285898 748601317
650.6 748601317 744455099 738882542 729031265 713445365 694494069 676117182 660790443 650847435
666.9 650847435 659385741 685206175 712021291 732653379 743916094 749049485 751539648 752608538
683.3 752608538 752206802 750811994 749343514 748162866 746455669 743760943 740725398 738003969 735161006
701.6 735161006 731356800 726733923 721925855 716674626 709741831 700690567 689829051 675960779
717.9 675960779 653959811 615224361 557022095 496119082 450770289 404011756 343392551
732.2 343392551 308724374 317349076 328927308 336716950 361400336 391707987 412894398 416022390
748.5 416022390 418181777 454431415 513473213 565912545 606174111 637205541 662420869 684137344
764.8 684137344 702621281 718232274 732365489 745267868 755383790 761973500 766559064 770566046
781.2 770566046 773135960 773026347 770951688 768310666 764120042 755816817 742148697 724877894
797.5 724877894 708950162 702451110 713248909 738442421 763385892 777602732 782060981 782059550
813.8 782059550 781592846 781369328 780022085 777375102 774720669 771782100 765080512 751545429 735306799
832.1 735306799 727081895 729899704 733473659 728013992 710686803 678185821 637365937 616563797
848.5 616563797 622380197 632076979 652026713 693436503 732680559 753808618 763313949 767193496
864.8 767193496 767669857 766738296 765332520 762912929 759263158 755280375 751931787 749036789 746082306
883.1 746082306 743144929 740388215 736818254 730185032 718516707 700060308 670450807 620484173
899.4 620484173 547089338 480572969 477035433 546475291 633864164 694161534 725902736 741691411
915.8 741691411 749171555 751719594 752166331 754071534 757766843 759718418 758397162 755263686 751718819
934.1 751718819 747404099 741038322 730521262 709659755 675509632 639360011 599518120 563637018
950.4 563637018 583888590 655263066 707360566 722033799 722013414 717196405 710615873 704534054
966.8 704534054 697963953 694142103 698037982 705147266 711025298 717721760 723785162 724446476 719302893
985.1 719302893 710205495 698300600 688030183 688960135 704071224 722322226 733143151 736352563
1001.4 736352563 736030698 734694839 732886851 730142415 726264060 721682072 716420650 709548712
1017.7 709548712 698703170 678046465 642445326 612658679 624636590 668245614 702229023
1032 702229023 715739727 719216943 718737900 716668189 714204073 711360037 707483470 702462852 696296453
1050.4 696296453 688286781 677327633 663951993 651012599 641310394 634567738 628257751 621055603
1066.7 621055603 615123749 613986611 616144180 615823567 609723270 597085238 575283349 539633214
1083 539633214 489939094 442830682 428300381 459074557 518170774 581052959 630197704 657978415
1099.3 657978415 668539882 670435369 669187188 666810215 663752377 659648657 652998686 641427636
1115.6 641427636 622275412 591960192 543590069 471206337 395200163 371416152 429392546
1129.9 429392546 525076747 595827520 617937803 590359390 526230812 472088099 466010809
1144.2 466010809 492190450 521969914 545233250 562330723 587061465 626835644 666675687
1158.5 666675687 693256021 707242370 713466108 715506315 715398312 714003980 711475849 707857430
1174.8 707857430 703279316 697697222 690731883 681808233 670147002 654921949 635537505 609915257
1191.1 609915257 572532117 518970609 457190782 411139578 405965358 446178168 509377301
1205.4 509377301 565520525 600546837 617089689 621257007 616937339 607239246 595837057 586762071
1221.7 586762071 584502280 592405260 607670009 620719790 622245133 608181179 582735002 563312948
1238 563312948 570466995 604953647 646334529 674196720 681222796 676967561 678389668 688715577
1254.3 688715577 700220227 707727373 710120499 709605634 708353460 706975043 705574334 703905165
1270.6 703905165 701714754 698987305 695877790 692349911 688344061 683972299 679401755 674454808
1287 674454808 668779254 662104130 654316843 645390689 635066867 622909367 608416021 591004491
1303.3 591004491 570012629 545463800 518141448 488517970 457363039 429340482 416280717
1317.6 416280717 431021303 466505587 492101163 482860357 447062880 424205065 440784544
1331.8 440784544 476326823 497703373 497723341 480723292 443674147 389164478 334666789 305621058
1348.1 305621058 326955885 405584335 515338778 612998545 674301147 705045164 718321025
1362.4 718321025 721776247 720000923 715562522 709439158 701470554 690956295 676885784 655059636
1378.7 655059636 619632244 576848447 555126369 576522529 617275298 641447604 647961259
1393 647961259 647129178 645566106 646072507 647873580 648906291 648359418 646487951 643505514 639519215
1411.4 639519215 634615541 628435850 619835079 608528495 596489489 582423866 564055324 541578114
1427.7 541578114 514848650 486943871 460705280 433323860 408737540 390036374 363457710
1442 363457710 319632769 261900127 199701533 157465681 156964183 195260406 259315491 323611975
1458.3 323611975 361405224 375507593 369964361 367281586 394509405 456403404 549434960 635070503
1474.6 635070503 683296561 705337584 713339269 714339852 712314546 708495378 703130066 697266936
1490.9 697266936 692471266 687506616 681065261 673794508 666735113 659171999 647877395 630281031
1507.2 630281031 613408744 597814858 580860794 562985539 543525398 521436334 492886394
1521.5 492886394 461205661 426107079 380444407 327939272 274354041 229412004 214044943
1535.8 214044943 250447899 373303324 524969518 609970927 644583881 656949937 665899456
1550.1 665899456 677165210 685547829 686767519 680905044 672869921 667318106 660718739 652415454
1566.4 652415454 642587602 631063521 619618714 605964363 587042987 567863047 549257100
1580.7 549257100 528003097 504206657 476734072 442818940 401067764 353282005 305114895
1594.9 305114895 267006487 248579130 253441811 280380636 320335388 354221821 362539530 338866919
1611.3 338866919 292222649 228909761 158537015 109088495 81597999 67957506 71640640
1625.5 71640640 97359672 148592621 219555080 311114758 432148546 540968955 610199630
1639.8 610199630 656092167 685738325 705840886 721134245 730647266 737112164 744336128 750059426
1656.1 750059426 753548980 755862832 757385433 758509398 758954942 758440495 757547617 756472468 754427791
1674.5 754427791 752140284 750177443 747708142 744614780 742761374 743185639 743259251 741999507 739764094
1692.8 739764094 736401081 732491732 728543580 725324571 725240290 727629900 731304765 734871566 737368464
1711.2 737368464 738766491 739127696 739049792 739687204 740679443 741196275 741138577 740540981 739608169 738457859
1731.6 738457859 737074375 736356974 735888422 735022902 734342813 733639240 732363403 730840981 729709685
1749.9 729709685 729203641 728605151 727382183 726029992 724594712 722636402 720705569 719165325 717884183
1768.3 717884183 716505408 715046167 714670777 715363741 716170907 716705680 716934204 716903329 716677308
1786.7 716677308 715876222 714200079 712753177 712468207 712188959 711079776 709735453 709001482 708751380
1805 708751380 708381295 707727551 707227468 707139432 706956148 706210434 705116928 704074144 703025281 701748490
1825.4 701748490 700165808 698534906 697637558 697113991 695751548 693574309 691881955 691604793 692644358
1843.8 692644358 694338858 695833623 696805179 697252929 697348833 697388232 697450995 697305322 696605504 695335209
1864.2 695335209 693882823 692788124 692328572 692000866 691396117 690716445 689860880 688265979 685859561
1882.5 685859561 683376014 681439757 679789782 678047895 676566124 676566422 678490222 680544078 681336462
1900.9 681336462 681476176 681623280 681403756 680562615 679605901 678964019 678349674 677400649 676372230
1919.2 676372230 675422966 674174547 672436893 670742095 669927418 669795692 669393361 668599725 667858422
1937.6 667858422 667445302 667722166 668900073 670366466 671461284 672256291 673096538 674043596 674897075
1955.9 674897075 675526917 675871074 675821602 675396502 674907863 674668789 674503028 674046814 673357308 672693908
1976.3 672693908 672049761 671234488 670266986 669473350 669041693 668756306 668300986 667748630 667360306 667020500
1996.7 667020500 666465044 665737331 665156722 664886892 664700985 664345145 663965642 663832307 663845241 663709819
2017.1 663709819 663392842 663133860 663069963 662997961 662649274 662148476 661815464 661624074 661263704 660659194
2037.5 660659194 660046101 659522355 658865154 657902062 656836808 655959070 655304313 654804170 654539287
2055.9 654539287 654639006 654943168 655040801 654785454 654496968 654438019 654389858 654037476 653491259 653099120
2076.3 653099120 652914107 652667046 652230501 651807904 651560068 651271880 650681496 649952769 649411201 649016738
2096.7 649016738 648468375 647774100 647311151 647192776 647060990 646677792 646273077 646129251 646123111 645934522
2117.1 645934522 645575702 645356357 645346224 645255089 644918144 644561470 644420207 644365907 644128561 643742263
2137.5 643742263 643468022 643289447 642891586 642221212 641650140 641436994 641409039 641319931 641240954 641352236
2157.9 641352236 641529679 641454220 641041219 640531719 640104353 639650285 639092028 638650417 638503253 638470173
2178.2 638470173 638287425 637962699 637704790 637558162 637323976 636882305 636399686 636080861 635848820 635479927
2198.6 635479927 634996116 634614885 634350538 634006202 633499742 632935703 632377207 631777167 631124258 630531669
2219 630531669 630105674 629770577 629372656 628907621 628589988 628564239 628647268 628570378 628267944 627803743
2239.4 627803743 627223432 626526773 625743449 625014961 624504030 624211371 624023139 623927414 623964846 624046326
2259.8 624046326 624002755 623765707 623398006 622957885 622412384 621768653 621222258 620994627 621069908 621213973
2280.2 621213973 621272027 621232748 621092319 620884895 620615125 620235562 619805872 619385421 618918419 618420124
2300.6 618420124 618009448 617712259 617383063 616859019 616155505 615453124 614777982 613892436 612666309
2319 612666309 611282349 609983683 608791173 607629895 606618524 606049120 605886161 605732262 605408490
2337.3 605408490 604944050 604421973 604106784 604418099 605129242 605285406 604342222 602614582 600912154
2355.7 600912154 599715889 599175870 599099398 599125743 599233925 599518418 599829137 600081623 600494981 601399064
2376.1 601399064 602778375 604242325 605436623 606235683 606620729 606548548 606029034 605242014 604468346
2394.4 604468346 603903055 603580773 603447914 603448808 603533566 603588223 603470862 603137434 602663577 602137804
2414.8 602137804 601598144 601112247 600781381 600597084 600444138 600248814 600034297 599845290 599683046 599515140
2435.2 599515140 599324763 599159002 599044085 598890960 598589778 598152101 597711802 597378910 597141683 596948564
2455.6 596948564 596799493 596703231 596608341 596426725 596113324 595735848 595374882 595007181 594620049 594262958
2476 594262958 593923390 593513608 592948020 592186928 591296017 590397358 589537084 588686109 587838531 587078452
2496.4 587078452 586518288 586233974 586301506 586746812 587388456 587892056 588039517 587863684 587527037 587111533
2516.8 587111533 586617470 586101830 585655332 585281730 584907532 584519923 584206581 583998024 583773851 583406508
2537.2 583406508 582914948 582376838 581803441 581198454 580639839 580239415 580031574 579895079 579685032 579449594
2557.6 579449594 579298019 579173028 578945458 578610122 578267395 577935874 577535272 577064455 576658905 576421857
2578 576421857 576274335 576047659 575723708 575396359 575061381 574693441 574383616 574252784 574273765 574292839
2598.4 574292839 574197888 573948503 573549211 573044479 572526038 572201192 572261333 572599173 572893679 572976649
2618.8 572976649 572974443 573008776 572954059 572646320 572126269 571538627 570917368 570204020 569379389 568482459
2639.2 568482459 567540228 566533267 565419436 564225137 563051343 561885655 560584068 559041321
2655.5 559041321 557254612 555316329 553438127 552004457 551476717 552019894 553282797 554716408 555997789
2673.9 555997789 557106256 558125019 559038699 559778869 560369849 560900033 561424136 561912894 562319577
2692.2 562319577 562689662 563090742 563464761 563677311 563693047 563574731 563345671 562953651 562389910 561743915
2712.6 561743915 561078787 560370088 559620798 558928370 558339715 557770014 557107389 556374669 555800915 555577695
2733 555577695 555656135 555832684 555915415 555855989 555674911 555367291 554966509 554527581 554078043 553644300
2753.4 553644300 553243339 552854896 552445114 551995039 551520348 551092982 550721884 550299346 549776733 549191892
2773.8 549191892 548554480 547879994 547221422 546591222 545995891 545515537 545174897 544833958 544412315 544022202
2794.2 544022202 543807268 543786108 543873131 544071674 544404566 544788063 545125365 545310855 545285344 545121491
2814.6 545121491 544888198 544582605 544218779 543840349 543464899 543039382 542505980 541886628 541215837 540458262
2835 540458262 539538562 538360238 536882401 535186410 533285558 531110346 528697848 526216805 523896813
2853.3 523896813 522005558 520915627 520954907 522059858 523704052 525307000 526634991 527640879 528202236
2871.7 528202236 528222919 527784050 527099192 526368201 525708139 525161505 524709105 524269998 523730695 522984684
2892.1 522984684 521962821 520666659 519073784 517125368 514867544 512456477 510023594 507588506
2908.4 507588506 505148232 502816439 500844300 499333978 497994274 496321827 494005919 491225570
2924.7 491225570 488597184 486835212 486330748 486903578 487865597 488394350 488037676 487166137 486943394
2943.1 486943394 488344878 491133243 494274110 497167885 499780029 502106547 504029751 505383074
2959.4 505383074 506113112 506280959 506031692 505585253 505071580 504540384 504027784 503611326 503524244 503835738
2979.8 503835738 504189968 504287183 504146218 503793359 503136039 502010882 500380397 498593658 496886879
2998.1 496886879 494969130 492497593 489241570 484898031 479273081 472862273 467428684 464788258
3014.5 464788258 464105159 462408990 458654165 455419928 456191480 462048620 471234709 480899215 488630325
3032.8 488630325 493035108 493729889 491214842 486801952 482291967 478800535 476041436 473641127
3049.1 473641127 472151548 472108155 473205864 474860400 477094740 480412096 484741420 488939464 491694927
3067.5 491694927 492517114 491785198 490537256 489793718 489707977 490008235 491138488 494303435 500052035
3085.8 500052035 506997406 512783706 516241968 517830789 518510997 518826425 518825769 518494427 518021464
3104.2 518021464 517572939 517047822 516285956 515454412 514845073 514345348 513665140 512707591 511586905
3122.6 511586905 510526299 509576797 508626044 507649958 506758511 506062388 505616844 505375504 505167007
3140.9 505167007 504894376 504560232 504161835 503771663 503427804 502976596 502333164 501648903 501037955 500456810
3161.3 500456810 499837220 499151230 498437256 497747630 497048080 496272743 495429933 494595975 493797570 492933244
3181.7 492933244 491958380 490987539 490105391 489258617 488362730 487447113 486595303 485792130 484968394 484161615
3202.1 484161615 483440042 482713610 481842548 480818361 479718268 478627056 477578312 476494849 475367963
3220.5 475367963 474326879 473382711 472415864 471393943 470365584 469393075 468532920 467762828 467040479
3238.8 467040479 466398984 465832561 465238661 464635283 464114249 463608831 463013321 462335289 461654752 460998684
3259.2 460998684 460315078 459559828 458743721 457922220 457119435 456263393 455319524 454373509 453435183 452449948
3279.6 452449948 451447189 450477123 449566215 448705435 447875381 447017998 446027428 444857746 443536669
3298 443536669 442223310 441157937 440352708 439413011 437968254 436160773 434381306 432793200 431270987
3316.3 431270987 429746419 428258836 426786691 425290108 423603445 421668440 419719845 417870343
3332.6 417870343 416089565 414408565 412662506 410647929 408460975 406226486 404112846 402263552
3348.9 402263552 400344491 398032457 395580709 393316478 391217917 389089137 386903912 384874165
3365.3 384874165 383007944 380950034 378510296 376034558 373914361 372068375 370260179 368437797
3381.6 368437797 366665453 365024120 363643020 362567008 361454785 359990180 358462125 357347339
3397.9 357347339 356514931 355330646 353731126 352314621 351267904 350304991 349285662 348227590 347214043
3416.3 347214043 346359521 345608562 344877750 344260812 343879193 343687117 343457282 343207359 343116671 342964351
3436.6 342964351 342563868 342237681 342233837 342413455 342657149 342964083 343312263 343705326 344181597 344761491
3457 344761491 345430762 346078098 346719712 347571075 348582536 349358439 349765599 350171268 350828439 351728082
3477.4 351728082 352694869 353467137 354186743 355069667 355950058 356756359 357617974 358559072 359577209
3495.8 359577209 360616744 361579150 362447441 363211036 363929272 364713997 365650564 366786182 367919803
3514.2 367919803 368859053 369746923 370737135 371819437 372813672 373598665 374392629 375415564 376622856
3532.5 376622856 377906799 379138350 380247533 381392688 382628828 383773297 384754032 385750026 386873454
3550.9 386873454 388082474 389350355 390656501 391986996 393282801 394375026 395230114 396332920
3567.2 396332920 398040622 399867088 401496470 403095692 404740036 406423748 408140451 409698188
3583.5 409698188 410912186 412092686 413739711 415547401 417108595 418586284 420219630 421937823
3599.8 421937823 423628986 425194591 426479220 427666157 429060131 430551112 432011604 433340818
3616.1 433340818 434506327 435910344 437586755 438964128 439596713 439865708 441002399 442698002 444059253
3634.5 444059253 445075333 445909023 446633041 447253972 447593957 447448432 447364599 448361844 449841619
3652.8 449841619 450818062 451605797 452670008 453601867 454187512 454557061 454497755 453991115 453791976 453738540
3673.2 453738540 453398019 453781784 454847604 455767304 456356049 456457525 456045091 455672175 455983788
3691.6 455983788 456672221 457148939 457248986 457032979 456737906 456731200 456798345 456415266 455598533 455158442
3712 455158442 455620110 456249118 456383914 456047416 455610514 455325007 455216259 455209076 454935431 454216570
3732.4 454216570 453572094 453634560 454229385 454499990 453799635 452753514 452588439 452439457 451875508 452066600
3752.8 452066600 452761233 452995300 452831805 452854156 452967256 452780038 452371597 451965332 451885700 452095985
3773.2 452095985 452124178 451820582 451384038 451083213 450901479 450770408 450776517 450806528 450657278 450244457
3793.6 450244457 449683785 449194789 448536903 447865158 447869360 447982788 447963238 448204219 448293895 447760969
3814 447760969 446892738 446338832 445891589 445722640 446106672 446358800 446264952 445934504 445528567 445170879
3834.4 445170879 444523275 443773866 443666041 444012046 444379717 444631159 444539160 443701655 442088604 441436172
3854.8 441436172 442277640 443004519 442996681 442498088 442096353 441872090 441431820 441078842 441070139 441155612
3875.2 441155612 441178113 440834641 440440089 440293252 440053880 439975202 439948052 439634621 439505100 439555079
3895.5 439555079 439210683 438493699 437843561 437501162 437586606 437866926 437909365 437651098 437202722 436605781
3915.9 436605781 436090022 435817987 435553342 435191661 435012043 435024589 434924364 434761345 434780955 434873611
3936.3 434873611 434789896 434471846 434056222 433751017 433557063 433413774 433399647 433472514 433524460 433550596
3956.7 433550596 433553249 433553487 433600932 433686674 433742583 433699310 433556050 433373123 433201373 433036119 432855457
3979.2 432855457 432709455 432629377 432505459 432300210 432143062 432064950 432002395 431914538 431762666
3997.5 431762666
##END=$$ End of the data block
