##TITLE=G2E1L - Pastilha com KBr $$ Begin of the data block
##JCAMP-DX=5.00 $$ ACD/SpecManager v 10.08
##SPECTROMETER/DATA SYSTEM=Alpha
##DATE=10 Oct 2013 09:32:22
##DATA TYPE=INFRARED SPECTRUM
##DATA CLASS=XYDATA
##ORIGIN=
##OWNER=
##NPOINTS=1765
##FIRSTX=399.75695801
##LASTX=3997.56933594
##MAXX=3997.56933594
##MINX=399.75695801
##MAXY=1.00061607
##MINY=0.49867123
##XFACTOR=1.0000000000
##YFACTOR=0.000000010000000
##FIRSTY=1.00000000
##DELTAX=2.03957629
##XUNITS=1/CM
##YUNITS=ARBITRARY UNITS
##XYDATA=(X++(Y..Y))
$$ plain form
399.8 100000000 100000000 99807072 99293590 98548502 97849500 97406334 97133899 96904361 96986169 97772980 98690444
422.2 98690444 99196297 99417681 99618173 99861914 100000000 99974084 99870598 99835569 99847859 99820626 99670720
444.6 99670720 99400902 99033260 98481548 97912329 97647190 97543335 97264886 96844244 96750683 97270358
465 97270358 98026747 98514521 98541284 98231757 97742158 97115982 96709406 96856552 97353357 97868347
485.4 97868347 98256969 98450381 98454380 98402530 98395461 98378712 98245865 98015326 97811961 97642380 97416198
507.9 97416198 97070742 96589178 95982355 95194477 94125760 92766613 91458237 90997112 91881216
526.2 91881216 93411100 94538444 94981128 94894856 94625932 94611275 94894117 95142603 95177644 95018381
546.6 95018381 94708121 94337600 93968517 93514603 92820209 91864562 90842354 90120327 90090054 90827984
$$ packed form
399.8A00000000Tj92928n13482p45088o99002m43166k72435k29538Q1808P86811R17464
422.2I8690444N05853K21384K00492K43741J38086k5916j03486l5029J2290k7233j49906
444.6I9670720k69818l67642n51712n69219k65139j03855k78449m20642r3561N19675
465I7270358P56389M87774K6763l09527m89599o26176m06576J47146M96805N14990
485.4I7868347L88622J93412L999n1850p069j6749j32847k30539k03365j69581k26182
507.9I7416198l45456m81564o06823p87878j068717j359147j308376m61125Q84104
526.2I1881216J529884J127344M42684q6272k68924j4657K82842K48486L5041j59263
546.6I5018381l10260l70521l69083m53914o94394r55647j022208p22027l0273P37930
$$ plain form
567 90827984 91968524 93064320 93890417 94384253 94557124 94482815 94278961 94035679 93725705 93281955
587.4 93281955 92751592 92306602 92151207 92380810 92919517 93590397 94219124 94675142 94897187 94936305
607.8 94936305 94903046 94848192 94723344 94491249 94214088 93986291 93819880 93662518 93502480 93381000
628.2 93381000 93327796 93313420 93280810 93235356 93239731 93308210 93396717 93468255 93512857 93553776 93615317 93666637
652.7 93666637 93642217 93525982 93367821 93200439 93021452 92818582 92605674 92711365 93150032 93507153
673.1 93507153 93726301 93883103 94049984 94217980 94314039 94295973 94220978 94156063 94062507 93865609 93574160
695.5 93574160 93251342 92926413 92577684 92240262 92097467 92321479 92833072 93357748 93706751 93894923
715.9 93894923 94014043 94105238 94137371 94052762 93828559 93424886 92677838 91291249 88788718 84553558
$$ packed form
567I0827984J140540J095796Q26097M93836J72871p4309k03854k43282l09974m43750
587.4I3281955n30363m44990j55395K29603N38707O70880O28727M56018K22045L9118
607.8I4936305l3259n4854j24848k32095k77161k27797j66411j57362j60038j21480
628.2I3381000n3204j4376l2610m5454M375O8479Q8507P1538M4602M0919O1541N1320
652.7I3666637k4420j16235j58161j67382j78987k02870k12908J05691M38667L57121
673.1I3507153K19148J56802J66881J67996R6059j8066p4995o4915r3556j96898k91449
695.5I3574160l22818l24929l48729l37422j42795K24012N11593N24676L49003J88172
715.9I3894923J19120R1195L2133q4609k24203m03673p47048j386589k502531m235160
$$ plain form
736.3 84553558 79270834 76479834 78756642 83548880 87396669 89551789 89710051 87195426 83232480
754.6 83232480 81270987 82753813 85215527 85960990 85631746 86915576 89878994 92074233 92466122
773 92466122 91850978 91399777 91718817 92395782 92853463 93196452 93813354 94727200 95603967 96221209
793.4 96221209 96645021 97016430 97375941 97674900 97902226 98124635 98393828 98662323 98855811 98986721
813.8 98986721 99136782 99333477 99512142 99615180 99668312 99744052 99858236 99947286 99956048 99925011 99929380
836.2 99929380 99954724 99908161 99743181 99498063 99201733 98762089 97947377 96521264 94742471 93798870
856.6 93798870 94558376 96211314 97565103 98382449 98790556 98825109 98570943 98158109 97701752 97244334
877 97244334 96759373 96239728 95757604 95417064 95240951 95145077 95031047 94921178 94985968 95299685 95658338
$$ packed form
736.3H4553558n282724k791000K276808M792238L847789K155120J58262k514625l962946
754.6H3232480j961493J482826K461714P45463l29244J283830K963418K195239L91889
773I2466122o15144m51201L19040O76965M57681L42989O16902R13846Q76767O17242
793.4I6221209M23812L71409L59511K98959K27326K22409K69193K68495J93488J30910
813.8I8986721J50061J96695J78665J03038N3132P5740J14184Q9050Q762l1037M369
836.2I9929380K5344m6563j64980k45118k96330m39644q14712j426113j778793r43601
856.6I3798870P59506J652938J353789Q17346M08107L4553k54166m12834m56357m57418
877I7244334m84961n19645m82124l40540j76113r5874j14030j09869O4790L13717L58653
$$ plain form
899.4 95658338 95876950 96057427 96376699 96836138 97318995 97738075 98084909 98380250 98581856 98610479
919.8 98610479 98436660 98087466 97683269 97495693 97631085 97691232 97265011 96662539 96420306 96479559
940.2 96479559 96809548 97638273 98683226 99436826 99796379 99931777 99987483 100000000 99950778 99797714
960.6 99797714 99507666 99004823 98285097 97639453 97325069 97232848 97297549 97481340 97530526 97325867
981 97325867 96999580 96755481 96776634 97054893 97362769 97487772 97342050 96856338 95915997 94495362
1001.4 94495362 93133533 92796230 93360734 93488401 92961562 93188787 94553745 95671546 95672220 94827628
1021.8 94827628 93452567 91724652 90067452 89058262 89054805 90021813 91491359 92864919 93842292
1040.2 93842292 94442850 94768244 94859171 94708180 94337982 93836808 93315834 92871433 92566228 92420197
$$ packed form
899.4I5658338K18612J80477L19272M59439M82857M19080L46834K95341K01606K8623
919.8I8610479j73819l49194m04197j87576J35392O0147m26221o02472k42233N9253
940.2I6479559L29989Q28725J044953P53600L59553J35398N5706J2517m9222j53064
960.6I9797714k90048n02843p19726o45644l14384r2221O4701J83791M9186k04659
981I7325867l26287k44099K1153K78259L07876J25003j45722m85712r40341j420635
1001.4I4495362j361829l37303N64504J27667n26839K27225J364958J117801O74q44592
1021.8I4827628j375061j727915j657200j009190l457R67008J469546J373560R77373
1040.2I3842292O00558L25394R0927j50991l70198n01174n20974m44401l05205j46031
$$ plain form
1060.6 92420197 92389464 92352796 92118376 91504407 90484840 89374936 88859302 89490992 91073757 92870545
1081 92870545 94339311 95362210 96014595 96395665 96609926 96733028 96780050 96715343 96502757 96140540
1101.4 96140540 95625782 94887877 93725395 92048842 90410244 89823401 90645355 92247432 93834567
1119.7 93834567 95015413 95746762 96125948 96267456 96253079 96114331 95802945 95159817 93719190 90295917
1140.1 90295917 84326136 79512882 80814672 86472529 91200352 93642569 94942719 95701510 96103644
1158.5 96103644 96286547 96324050 96253258 96096557 95869362 95574248 95186532 94664562 93934810 92887002
1178.9 92887002 91352338 89130032 86316210 83897096 83318764 84820259 87081224 88796759 89684367
1197.2 89684367 90087348 90362996 90651566 90905166 90967369 90677494 89958000 88809502 87263960 85524195
$$ packed form
1060.6I2420197l0733l6668k34420o13969j019567j109904n15634O31690J582765J796788
1081I2870545J468766J022899O52385L81070K14261J23102M7022o4707k12586l62217
1101.4I6140540n14758p37905j162482j676553j638598n86843Q21954J602077J587135
1119.7I3834567J180846P31349L79186J41508j4377j38748l11386o43128j440627l423273
1140.1I0295917n969781m813254J301790N657857M727823K442217J300150P58791M02134
1158.5I6103644J82903L7503p0792j56701k27195k95114l87716n21970p29752j047808
1178.9I2887002j534664k222306k813822k419114n78332J501495K260965J715535Q87608
1197.2H9684367M02981K75648K88570K53600O2203k89875p19494j148498j545542j739765
$$ plain form
1217.6 85524195 84265602 84423310 86256969 88952827 91472244 93333548 94511509 95121759 95301127
1236 95301127 95171463 94852662 94496381 94267619 94281739 94533169 94903934 95250237 95485073 95580125
1256.4 95580125 95534396 95355940 95047259 94598520 93973821 93121463 92007434 90669543 89229250
1274.7 89229250 87810421 86474943 85432696 85213888 86093473 87518853 88636488 89055753 88823873
1293.1 88823873 88061303 86800194 85031545 82927442 81130642 80531758 81370002 82911557 84354162
1311.4 84354162 85539073 86670405 87976927 89532328 91099077 92395383 93359029 94035578 94468701
1329.8 94468701 94704145 94767153 94651741 94383097 94099104 93935752 93899232 93946046 94001055 93961495 93754387
1352.2 93754387 93347776 92739958 92013693 91372311 90989757 90714306 90258807 89665473 89088839 88401306
$$ packed form
1217.6H5524195j258593J57708J833659K695858K519417J861304J177961O10250J79368
1236I5301127j29664l18801l56281k28762J4120K51430L70765L46303K34836R5052
1256.4I5580125m5729j78456l08681m48739o24699q52358j114029j337891j440293
1274.7H9229250j418829j335478j042247k18808Q79585J425380J117635M19265k31880
1293.1H8823873p62570j261109j768649k104103j796800n98884Q38244J541555J442605
1311.4H4354162J184911J131332J306522J555401J566749J296306R63646O76549M33123
1329.8I4468701K35444O3008j15412k68644k83993j63352l6520M6814N5009l9560k07108
1352.2I3754387m06611o07818p26265o41382l82554k75451m55499n93334n76634o87533
$$ plain form
1372.6 88401306 87463427 86316597 84904480 83150905 81105316 78955925 77169192 76294023 76053524
1391 76053524 75887716 75948203 76500738 77284956 77829236 77764869 77025610 75868094 74747241 74245852
1411.4 74245852 74711174 75864297 77418232 79454333 81569505 83437192 84981072 85831952 85914046
1429.7 85914046 85621047 85317534 84883541 83855182 82229137 81081045 81753963 83960670 86183244
1448.1 86183244 87474221 87815857 87383461 86112756 84292954 82635069 81625384 82360923 84682232
1466.4 84682232 86458325 86960417 86669058 86170375 85588449 84784997 83728051 82505810 81177694
1484.8 81177694 79609716 77808291 76200831 75100470 74320722 74153870 75181735 76830363 77994210
1503.2 77994210 77806526 76021534 74480206 74277121 74946058 75170720 73667866 71104568 70123571
$$ packed form
1372.6H8401306r37879j146830j412117j753575k045589k149391j786733q75169k40499
1391G6053524j65808O0487N52535P84218N44280o4367p39259j157516j120853n01389
1411.4G4245852M65322J153123J553935K036101K115172J867687J543880Q50880Q2094
1429.7H5914046k92999l03513m33993j028359j626045j148092O72918K206707K222574
1448.1H6183244J290977L41636m32396j270705j819802j657885j009685P35539K321309
1466.4H4682232J776093N02092k91359m98683n81926q03452j056946j222241j328116
1484.8H1177694j567978j801425j607460j100361p79748j66852J027865J648628J163847
1503.2G7994210j87684j784992j541328k03085O68937K24662j502854k563298r80997
$$ plain form
1521.5 70123571 72757465 77445203 81891108 84840918 86521125 87611187 88214678 88113046 87496781
1539.9 87496781 87097341 86937916 86627209 86038595 85173798 84183341 83102727 81838518 80133462
1558.2 80133462 78535497 77492517 76135266 74439716 72836941 71732819 71307731 71146387 71115500
1576.6 71115500 71210074 71088344 70527965 69502777 68136334 66733140 65639251 65053445 64927679
1594.9 64927679 65011865 64922142 64289165 62807947 60264194 56778866 53198069 50714129 49867123
1613.3 49867123 50951314 54158193 57681185 60262656 61876994 62079334 60910678 59441048 58777511
1631.6 58777511 58716583 58382690 57316697 55757856 54080105 52799702 52489752 53689903 55731410
1650 55731410 58956510 64168209 68286771 71008366 73256123 75278163 77118307 78534031 79749358
$$ packed form
1521.5G0123571K633894M687738M445905K949810J680207J090062O03491j01632o16265
1539.9H7496781l99440j59425l10707n88614q64797r90457j080614j264209j705056
1558.2H0133462j597965j042980j357251j695550j602775j104122m25088j61344l0887
1576.6G1115500R4574j21730n60379j025188j366443j403194j093889n85806j25766
1594.9F4927679Q4186q9723o32977j481218k543753l485328l580797k483940q47006
1613.3D9867123J084191L206879L522992K581471J614338K02340j168656j469630o63537
1631.6E8777511o0928l33893j065993j558841j677751j280403l09950J200151K041507
1650E5731410L225100N211699M118562K721595K247757K022040J840144J415724J215327
$$ plain form
1668.4 79749358 81175911 82598716 83990067 85547960 86937433 87925518 88640153 89623952 90788507
1686.7 90788507 91633970 92261636 92637622 92748696 92820162 92975867 93365055 93841362 94113249 94369662
1707.1 94369662 94681227 94911879 95015782 95059878 95362240 96076816 96750098 97173464 97456414 97617447
1727.5 97617447 97649336 97553360 97495341 97773969 98068589 98190278 98319900 98456353 98486763 98425972 98432910
1749.9 98432910 98655725 98890024 98969597 99002326 99027574 99087220 99223006 99260217 99142665 98974806 98935860
1772.4 98935860 99146855 99358994 99404758 99380475 99385244 99395269 99383825 99270689 99025339 98917842 99072802
1794.8 99072802 99221510 99261147 99329603 99495566 99642467 99677885 99637890 99633461 99701053 99750441 99737030
1817.2 99737030 99704289 99651748 99564916 99510676 99488568 99484998 99621391 99808323 99885815 99899101 99881971
$$ packed form
1668.4G9749358J426553J422805J391351J557893J389473R88085P14635R83799J164555
1686.7I0788507Q45463O27666L75986J11074P1466J55705L89188M76307K71887K56413
1707.1I4369662L11565K30652J03903M4096L02362P14576O73282M23366K82950J61033
1727.5I7617447L1889r5976n8019K78628K94620J21689J29622J36453L0410o0791O938
1749.9I8432910K22815K34299P9573L2729K5248N9646J35786L7211j17552j67859l8946
1772.4I8935860K10995K12139M5764k4283M769J0025j1444j13136k45350j07497J54960
1794.8I9072802J48708L9637O8456J65963J46901L5418l9995m429O7592M9388j3411
1817.2I9737030l2741n2541q6832n4240k2108l570J36393J86932P7492J3286j7130
$$ plain form
1839.7 99881971 99768561 99633461 99685198 99838072 99935764 99982637 100000000 100000381 99980712 99963140 99950337
1862.1 99950337 99895597 99749339 99612331 99669677 99834102 99918461 99914914 99886155 99865723 99864554 99872226 99848026
1886.6 99848026 99789184 99785805 99829048 99840266 99834877 99822968 99794459 99759912 99712414 99634814 99564648 99566585
1911.1 99566585 99615139 99616051 99574661 99587387 99630594 99667215 99728990 99770397 99754697 99711561 99656427 99580622
1935.5 99580622 99483991 99367303 99274349 99317366 99482274 99636757 99729037 99779022 99806637 99819994 99822319
1958 99822319 99819225 99816197 99800426 99772567 99769092 99789530 99801475 99804807 99805313 99798882 99788177 99780458 99773169 99755651
1986.5 99755651 99721760 99676394 99658138 99681342 99696600 99683458 99664760 99652785 99648118 99645692 99638879 99627775
2011 99627775 99611586 99585927 99565053 99561369 99556535 99546176 99544936 99553204 99561960 99568301 99574465 99579686 99580711 99573976
$$ packed form
1839.7I9881971j13410j35100N1737J52874R7692M6873J7363L81j9669j7572j2803
1862.1I9950337n4740j46258j37008N7346J64425Q4359l547k8759k0432j169P672k4200
1886.6I9848026n8842l379M3243J1218n389j1909k8509l4547m7498p7600p0166J937
1911.1I9566585M8554R12m1390J2726M3207L6621O1775M1407j5700m3136n5134p5805
1935.5I9580622r6631j16688r2954M3017J64908J54483R2280M9985K7615J3357K325
1958I9822319l094l028j5771k7859l475K0438J1945L332N06o431j0705p719p289j7518
1986.5I9755651l3891m5366j8256K3204J5258j3142j8698j1975m667k426o813j1104
2011I9627775j6189k5659k0874l684m834j0359j240Q268Q756O341O164N221J025o735
$$ plain form
2039.6 99573976 99565876 99568021 99576777 99580371 99574590 99564558 99559230 99560893 99562210 99554187 99535996 99520606 99524456 99537534
2068.1 99537534 99536413 99524415 99513137 99503869 99493933 99479586 99462223 99449694 99444294 99440241 99438930 99442184 99445093
2094.6 99445093 99446017 99447280 99447978 99445873 99443758 99444109 99444389 99437994 99423099 99409902 99408758 99418044 99428791 99434155 99436927
2125.2 99436927 99441969 99447334 99447483 99440008 99429125 99419141 99411839 99406397 99400610 99392462 99382490 99372625 99361366 99346727
2153.8 99346727 99328321 99306607 99285126 99269074 99257743 99247277 99238312 99237084 99244440 99249727 99247712 99246883 99253798
2180.3 99253798 99260169 99255717 99242944 99229223 99218351 99209887 99196202 99173915 99150622 99132395 99120504 99110812
2204.8 99110812 99097264 99085057 99082339 99083346 99075425 99053270 99026376 99007124 98993981 98977655 98955381 98933089
2229.2 98933089 98917139 98906535 98893023 98872578 98858297 98864168 98879528 98883080 98869431 98849106 98833871 98822808
$$ packed form
2039.6I9573976q100K145Q756L594n781j0032n328J663J317q023j8191j5390L850J3078
2068.1I9537534j121j1998j1278r268r936j4347j7363j2529n400m053j311L254K909
2094.6I9445093R24J263O98k105k115L51K80o395j4895j3197j144R286J0747N364K772
2125.2I9436927N042N365J49p475j0883r984p302n442n787q148r972r865j1259j4639
2153.8I9346727j8406k1714k1481j6052j1331j0466q965j228P356N287k015q29O915
2180.3I9253798O371m452j2773j3721j0872q464j3685k2287k3293j8227j1891r692
2204.8I9110812j3548j2207k718J007p921k2155k6894j9252j3143j6326k2274k2292
2229.2I8933089j5950j0604j3512k0445j4281N871J5360L552j3649k0325j5235j1063
$$ plain form
2253.7 98822808 98804891 98778641 98757452 98749906 98750693 98749048 98742366 98740834 98749977 98761636 98765200 98763710 98771709 98791641
2282.3 98791641 98809385 98810077 98789525 98752755 98707789 98657495 98599106 98540252 98493302 98456639 98415017 98353851
2306.7 98353851 98276836 98200953 98140162 98087603 98009652 97893071 97768289 97663945 97580242 97496575 97406560
2329.2 97406560 97334731 97291052 97247952 97188014 97128737 97092664 97111702 97236168 97392154 97417510 97257888
2351.6 97257888 96985495 96724087 96547091 96479559 96512836 96612680 96748149 96908015 97085482 97272831
2372 97272831 97452950 97614360 97766048 97914696 98046619 98142248 98197490 98225868 98245615 98266852 98286301
2394.4 98286301 98297715 98303264 98311943 98325771 98335826 98340142 98345494 98352468 98355854 98353153 98346007 98343718 98351836 98363954
2423 98363954 98375481 98385859 98398888 98418665 98438227 98448247 98451793 98457700 98465049 98464400 98451304 98431534 98414129
$$ packed form
2253.7I8822808j7917k6250k1189p546P87j645o682j532R143J1659L564j490P999J9932
2282.3I8791641J7744O92k0552l6770m4966n0294n8389n8854m6950l6663m1622o1166
2306.7I8353851p7015p5883o0791n2559p7951j16581j24782j04344q3703q3667r0015
2329.2I7406560p1829m3679m3100n9938n9277l6073J9038J24466J55986K5356j59622
2351.6I7257888k72393k61408j76996o7532L3277R9844J35469J59866J77467J87349
2372I7272831J80119J61410J51688J48648J31923R5629N5242K8378J9747K1237J9449
2394.4I8286301J1414N549Q679J3828J0055M316N352O974L386k701p146k289Q118J2118
2423I8363954J1527J0378J3029J9777J9562J0020L546N907P349o49j3096j9770j7405
$$ plain form
2449.5 98414129 98400205 98382515 98359478 98338026 98326623 98324829 98320293 98307669 98296291 98294097 98295254 98290694 98284006
2476 98284006 98286557 98298490 98305106 98299551 98285532 98268241 98255754 98246771 98231655 98210353 98191559 98180026 98169297
2502.5 98169297 98151207 98129600 98114318 98105562 98092055 98067254 98038751 98015410 97994751 97966897 97926563 97881329
2527 97881329 97844881 97820216 97802293 97793591 97800654 97817618 97829658 97831029 97827005 97823685 97819048 97807628 97790241
2553.5 97790241 97773516 97765273 97767472 97772962 97776288 97783238 97798902 97811645 97808474 97794849 97780120 97768694 97762525
2580 97762525 97756338 97749430 97748959 97756457 97765464 97767174 97762722 97762507 97770262 97781098 97786343 97783732 97782844 97790742 97799093
2610.6 97799093 97794724 97778678 97763467 97754061 97741956 97721845 97697419 97673339 97653002 97635144 97621685 97623497
2635.1 97623497 97643793 97666943 97675854 97671342 97664976 97659636 97648233 97631127 97618812 97620016 97634083 97648984 97653782
$$ packed form
2449.5I8414129j3924j7690k3037k1452j1403j794m536j2624j1378k194J157m560o688
2476I8284006K551J1933O616n555j4019j7291j2487q983j5116k1302j8794j1533j0729
2502.5I8169297j8090k1607j5282q756j3507k4801k8503k3341k0659k7854m0334m5234
2527I7881329l6448k4665j7923q702P063J6964J2040J371m024l320m637j1420j7387
2553.5I7790241j6725q243K199N490L326O950J5664J2743l171j3625j4729j1426o169
2580I7762525o187o908m71P498R007J710m452k15P755J0836N245k611q88P898Q351
2610.6I7799093m369j6046j5211r406j2105k0111k4426k4080k0337j7858j3459J812
2635.1I7623497K0296K3150Q911m512o366n340j1403j7106j2315J204J4067J4901M798
$$ plain form
2661.6 97653782 97650474 97648489 97653306 97660869 97660851 97648132 97630268 97613209 97590590 97556770 97520578 97499329 97496879
2688.1 97496879 97499073 97493714 97481304 97465444 97442752 97406560 97359192 97317010 97292209 97276378 97256190 97230500
2712.6 97230500 97203547 97180241 97167045 97161460 97154093 97148335 97149032 97148359 97143877 97138387 97134072 97134161 97135055 97129053 97116882
2743.2 97116882 97108740 97109753 97114128 97112238 97105056 97103798 97109228 97115439 97119802 97118789 97115129 97115922 97117192 97109300 97091150
2773.8 97091150 97064841 97031158 96994758 96962655 96936882 96916455 96904522 96898371 96888363 96877325 96871787 96866220
2798.3 96866220 96855545 96842647 96832961 96827829 96826416 96825975 96820599 96805400 96776658 96741951 96711874 96683025 96651071
2824.8 96651071 96618217 96585774 96553993 96518934 96473449 96420163 96361870 96291858 96207458 96108359 95999295
2847.2 95999295 95896399 95817965 95775557 95767707 95782280 95808232 95839012 95861101 95858771 95835853 95811170 95794934
$$ packed form
2661.6I7653782l308j985M817P563j8j2719j7864j7059k2619l3820l6192k1249k450
2688.1I7496879K194n359j2410j5860k2692l6192m7368m2182k4801j5831k0188k5690
2712.6I7230500k6953k3306j3196n585p367n758O97o73m482n490m315Q9Q94o002j2171
2743.2I7116882q142J013M375j890p182j258N430O211M363j013l660P93J270p892j8150
2773.8I7091150k6309l3683l6400l2103k5773k0427j1933o151j0008j1038n538n567
2798.3I6866220j0675j2898r686n132j413m41n376j5199k8742l4707l0077k8849l1954
2824.8I6651071l2854l2443l1781l5059m5485n3286n8293p0012q4400r9099j09064
2847.2I5999295j02896p8434m2408p850J4573K5952L0780K2089k330k2918k4683j6236
$$ plain form
2871.7 95794934 95771742 95724684 95670813 95630300 95595461 95545793 95465159 95353878 95223194 95084673 94945341
2894.1 94945341 94805950 94680208 94592899 94540560 94481426 94388908 94306421 94314122 94424415 94558167 94644642
2916.6 94644642 94677407 94679749 94667238 94632179 94567454 94478607 94368774 94253856 94155967 94072229 93983167
2939 93983167 93877679 93760502 93656451 93615395 93682712 93843454 94015640 94130963 94190764 94221491 94233692
2961.4 94233692 94223344 94187164 94129437 94055140 93973345 93878579 93742639 93550009 93300635 93003088 92726421
2983.9 92726421 92599386 92673659 92848730 92981648 93014616 92976087 92906433 92827702 92753476 92687166 92626345
3006.3 92626345 92572713 92527276 92476904 92405766 92313933 92211497 92103601 91984266 91852403 91722876 91612387
3028.7 91612387 91530329 91473955 91411614 91310722 91173083 91008365 90826398 90656281 90527374 90440917
$$ packed form
2871.7I5794934k3192m7058n3871m0513l4839m9668q0634j11281j30684j38521j39332
2894.1I4945341j39391j25742q7309n2339n9134r2518q2487P701J10293J33752Q6475
2916.6I4644642L2765K342j2511l5059o4725q8847j09833j14918r7889q3738q9062
2939I3983167j05488j17177j04051m1056O7317J60742J72186J15323N9801L0727J2201
2961.4I4233692j0348l6180n7727p4297q1795r4766j35940j92630k49374k97547k76667
2983.9I2726421j27035P4273J75071J32918L2968l8529o9654p8731p4226o6310o0821
3006.3I2626345n3632m5437n0372p1138r1833j02436j07896j19335j31863j29527j10489
3028.7I1612387q2058n6374o2341j00892j37639j64718j81967j70117j28907q6457
$$ plain form
3049.1 90440917 90363204 90254807 90123397 90009415 89904284 89749968 89541310 89370811 89331383 89408046
3069.5 89408046 89504737 89548314 89534938 89484137 89403582 89321160 89261943 89207178 89140445 89059275 88952756
3092 88952756 88825083 88696623 88573170 88443750 88306659 88173443 88054597 87949425 87842256 87736464
3112.4 87736464 87655145 87592638 87530363 87459123 87379879 87312859 87273180 87252951 87230271 87202269 87194037 87209696
3136.8 87209696 87223488 87218392 87203676 87194514 87190998 87189615 87189585 87181008 87162751 87149078 87141520 87135488 87129849 87121445
3165.4 87121445 87113029 87104267 87086838 87066674 87050748 87031764 87006879 86972481 86929291 86888236 86846370 86794102
3189.9 86794102 86731321 86658376 86577636 86496723 86416650 86329645 86233813 86136740 86037034 85927629 85812783
3212.3 85812783 85701662 85597581 85492969 85378271 85251838 85116333 84975755 84830052 84672415 84504247
$$ packed form
3049.1I0440917p7713j08397j31410j13982j05131j54316k08658j70499l9428P6663
3069.5H9408046R6691M3577j3376n0801q0555q2422n9217n4765o6733q1170j06519
3092H8952756j27673j28460j23453j29420j37091j33216j18846j05172j07169j05792
3112.4H7736464q1319o2507o2275p1240p9244o7020l9679k0229k2680k8002q232J5659
3136.8H7209696J3792n096j4716r162l516j383l0q577j8257j3673p558o032n639q404
3165.4H7121445q416q762j7429k0164j5926j8984k4885l4398m3190m1055m1866n2268
3189.9H6794102o2781p2945q0740q0913q0073q7005r5832r7073r9706j09405j14846
3212.3H5812783j11121j04081j04612j14698j26433j35505j40578j45703j57637j68168
$$ plain form
3232.7 84504247 84337312 84174430 84006572 83827728 83638489 83449864 83277929 83116573 82946187 82767802
3253.1 82767802 82598537 82438672 82271284 82088751 81898671 81709355 81518698 81320578 81114250 80906713
3273.5 80906713 80708456 80524933 80352998 80189091 80036205 79895550 79769158 79662156 79574180 79503125
3293.9 79503125 79449403 79409271 79376841 79350823 79327703 79301488 79271716 79234928 79187697 79138029 79085982 79020119
3318.4 79020119 78942245 78860909 78771126 78660434 78530812 78398114 78266233 78134376 78010041 77878296
3338.8 77878296 77718937 77547228 77377433 77213937 77064312 76903605 76704580 76486719 76285183 76105374
3359.1 76105374 75921464 75723761 75540626 75380790 75206351 74989301 74759132 74560976 74392474 74230838
3379.5 74230838 74069226 73916101 73780620 73671752 73593920 73506707 73376232 73240918 73150015 73085016
$$ packed form
3232.7H4504247j66935j62882j67858j78844j89239j88625j71935j61356j70386j78385
3253.1H2767802j69265j59865j67388j82533j90080j89316j90657j98120k06328k07537
3273.5H0906713j98257j83523j71935j63907j52886j40655j26392j07002q7976p1055
3293.9G9503125n3722m0132l2430k6018k3120k6215k9772l6788m7231m9668n2047o5863
3318.4G9020119p7874q1336q9783j10692j29622j32698j31881j31857j24335j31745
3338.8G7878296j59359j71709j69795j63496j49625j60707j99025k17861k01536j79809
3359.1G6105374j83910j97703j83135j59836j74439k17050k30169j98156j68502j61636
3379.5G4230838j61612j53125j35481j08868p7832q7213j30475j35314r0903o4999
$$ plain form
3399.9 73085016 72976226 72817457 72673255 72561979 72464931 72372216 72261518 72127843 72000682 71893239
3420.3 71893239 71802133 71731925 71678263 71627337 71567911 71520305 71503687 71477622 71415138 71363616 71367258 71411216
3444.8 71411216 71484917 71599191 71739382 71890998 72060728 72252578 72457474 72655869 72864920 73125094
3465.2 73125094 73417991 73677129 73877245 74072844 74310750 74577951 74834937 75068474 75318682 75603217
3485.6 75603217 75884676 76150441 76422566 76703775 76992881 77279842 77543563 77799577 78070110 78342760
3506 78342760 78616631 78921056 79262835 79597449 79894215 80173326 80450904 80731905 81015712 81297791
3526.4 81297791 81600028 81936771 82280141 82614845 82945234 83258504 83548307 83817571 84079397 84366316
3546.8 84366316 84680331 84987152 85293239 85615557 85927123 86213541 86478937 86677855 86802077 87044209
$$ packed form
3399.9G3085016j08790j58769j44202j11276r7048r2715j10698j33675j27161j07443
3420.3G1893239r1106p0208n3662n0926n9426m7606j6618k6065o2484n1522L642M3958
3444.8G1411216P3701J14274J40191J51616J69730J91850K04896J98395K09051K60174
3465.2G3125094K92897K59138K00116J95599K37906K67201K56986K33537K50208K84535
3485.6G5603217K81459K65765K72125K81209K89106K86961K63721K56014K70533K72650
3506G8342760K73871L04425L41779L34614K96766K79111K77578K81001K83807K82079
3526.4H1297791L02237L36743L43370L34704L30389L13270K89803K69264K61826K86919
3546.8H4366316L14015L06821L06087L22318L11566K86418K65396J98918J24222K42132
$$ plain form
3567.2 87044209 87516260 88000572 88367468 88685983 89012110 89351946 89687473 89954561 90128154 90363729
3587.6 90363729 90790170 91215104 91526824 91847789 92221224 92585748 92939395 93247241 93442136 93611348
3608 93611348 93869519 94165123 94454229 94698882 94909853 95252311 95672953 95920950 95906621 95863146
3628.4 95863146 96177083 96644813 96990645 97244781 97445548 97603279 97699153 97635984 97382808 97235221
3648.8 97235221 97545159 97993690 98234683 98414928 98670280 98860890 98936063 98911059 98728567 98478234
3669.2 98478234 98400080 98352081 98277491 98509681 98890579 99151438 99266130 99203050 98993838 98884451
3689.6 98884451 99069709 99359953 99549621 99592674 99520141 99468285 99545032 99587125 99431574 99190325 99183333
3712 99183333 99451590 99664378 99676877 99571818 99473506 99441832 99486357 99543601 99450767 99172509 98954010
$$ packed form
3567.2H7044209M72051M84312L66896L18515L26127L39836L35527K67088J73593K35575
3587.6I0363729M26441M24934L11720L20965L73435L64524L53647L07846J94895J69212
3608I3611348K58171K95604K89106K44653K10971L42458M20642K47997j4329m3475
3628.4I5863146L13937M67730L45832K54136K00767J57731R5874o3169k53176j47587
3648.8I7235221L09938M48531K40993J80245K55352J90610P5173k5004j82492k50333
3669.2I8478234p8154m7999p4590K32190L80898K60859J14692o3080k09212j09387
3689.6I8884451J85258K90244J89668M3053p2533n1856P6747M2093j55551k41249o992
3712I9183333K68257K12788J2499j05059r8312l1674M4525N7244r2834k78258k18499
$$ plain form
3734.4 98954010 99056143 99335915 99433082 99220103 98983717 98995936 98966587 98909116 99151868 99469191
3754.8 99469191 99578261 99588805 99688709 99781519 99755371 99692190 99677759 99774265 99920291 99959773 99872488
3777.3 99872488 99791622 99816173 99858928 99884206 99944204 100000000 99997574 99899954 99731946 99574035 99402750
3799.7 99402750 99312967 99417812 99513853 99629289 99831903 99899161 99722987 99484527 99353933 99246991
3820.1 99246991 99304765 99537569 99680942 99722517 99693274 99600363 99478406 99315327 99215955 99306262 99498516
3842.5 99498516 99704182 99842858 99776244 99420291 98979175 99045658 99465144 99692464 99652493 99504977
3862.9 99504977 99446446 99438065 99368197 99376583 99513292 99666071 99727577 99632365 99549013 99550903 99568212 99643707
3887.4 99643707 99668527 99634558 99701130 99754012 99626720 99407798 99279523 99327850 99542075 99776947 99899644
$$ packed form
3734.4I8954010J02133K79772R7167k12979k36386J2219k9349n7471K42752L17323
3754.8I9469191J09070J0544R9904R2810k6148o3181j4431R6506J46026L9482q7285
3777.3I9872488q0866K4551M2755K5278N9998N5796k426r7620j68008j57911j71285
3799.7I9402750q9783J04845R6041J15436K02614O7258j76174k38460j30594j06942
3820.1I9246991N7774K32804J43373M1575k9243r2911j21957j63079r9372R0307J92254
3842.5I9498516K05666J38676o6614l55953m41116O6483M19486K27320l9971j47516
3862.9I9504977n8531q381o9868Q386J36709J52779O1506r5212q3352J890J7309P5495
3887.4I9643707K4820l3969O6572N2882j27292k18922j28275M8327K14225K34872J22697
$$ plain form
3909.8 99899644 99913996 99848878 99736333 99674064 99703723 99740565 99744707 99764472 99774426 99736929 99738079 99821144
3934.3 99821144 99896085 99904650 99856991 99808532 99817562 99838877 99838483 99865371 99914533 99947244 99961519 99962384 99962622
3960.8 99962622 99979842 100000000 100005698 100007164 100007534 100002337 100007665 100027263 100040054 100045419 100054455 100061607 100059688 100053346
3989.4 100053346 100049889 100046182 100040984 100045955
3997.5 100045955
$$ packed form
3909.8I9899644J4352o5118j12545o2269K9659L6842M142J9765R954l7497J150Q3065
3934.3I9821144P4941Q565m7659m8459R030K1315l94K6888M9162L2711J4275Q65K38
3960.8I9962622J7220K0158N698J466L70n197N328J9598J2791N365R036P152j919o342
3989.4A00053346l457l707n198M971
3997.5A00045955
##END=$$ End of the data block
