##TITLE=623-52-SE $$ Begin of the data block
##JCAMP-DX=5.00 $$ ACD/SpecManager v 10.08
##SPECTROMETER/DATA SYSTEM=Alpha
##DATE=21 Oct 2013 11:04:12
##DATA TYPE=INFRARED SPECTRUM
##DATA CLASS=XYDATA
##ORIGIN=
##OWNER=
##NPOINTS=1765
##FIRSTX=399.75695801
##LASTX=3997.56933594
##MAXX=3997.56933594
##MINX=399.75695801
##MAXY=0.82652748
##MINY=0.28770053
##XFACTOR=1.0000000000
##YFACTOR=1.000000000000000e-9
##FIRSTY=0.55911952
##DELTAX=2.03957629
##XUNITS=1/CM
##YUNITS=ARBITRARY UNITS
##XYDATA=(X++(Y..Y))
399.8E59119523k485812k030194j008451K37048O61850L84450j5617n36680j050889
$$ 559119523 556633711 554603517 553595066 553832114 554493964 554878414 554862797 554326117 553275228
418.1E53275228r23992r08315j444399j545906j452387j677870j438082o84261m03047
$$ 553275228 552351236 551442921 549998522 548452616 547000229 545322359 543884277 543200016 542796969
436.5E42796969j88469N22732J073063J309037J391709Q39233l60906j335740j477003
$$ 542796969 542608500 543131232 544204295 545513332 546905041 547744274 547383368 546047628 544570625
454.8E44570625j199186j250803j762748k244115k276302k166390k123117j949788
$$ 544570625 543371439 542120636 540357888 538113773 535837471 533671081 531547964 529598176
471.1E29598176j762211j634657j555562j284004p69436m29392m26471o73890j153171
$$ 529598176 527835965 526201308 524645746 523361742 522592306 522162914 521736443 521062553 519909382
489.5E19909382j690745j899839j736760j539707j666487k192437k733052k915263
$$ 519909382 518218637 516318798 514582038 513042331 511375844 509183407 506450355 503535092
505.8E03535092k654553k155840j960307k297938k684146k578229k058148j410693
$$ 503535092 500880539 498724699 496764392 494466454 491782308 489204079 487145931 485735238
522.1D85735238q38012n57929m33952r5010N62132J378149K093732K390295K054990
$$ 485735238 484897226 484339297 483905345 483810335 484372467 485750616 487844348 490234643 492289633
540.5D92289633J261621M68910R9599Q762l51816j056254j610935j636356j323163
$$ 492289633 493551254 494020164 494119763 494128525 493776709 492720455 491109520 489473164 488150001
558.8D88150001j132220j395762j956225k441078k449304j636684l79860N44935R48161
$$ 488150001 487017781 485622019 483665794 481224716 478775412 477138728 476758868 477303803 478251964
577.2D78251964J347899K018482K569198K694369K516806J962334J056134K21700j33783
$$ 478251964 479599863 481618345 484187543 486881912 489398718 491361052 492417186 492638886 492505103
595.6D92505103M262K86847L95209J38372k21491j91092K20328N83202M64648n7876
$$ 492505103 492509365 492796212 493191421 493329793 493108302 492917210 493137538 493720740 494185388 494127512
616D94127512J30475J248031K093614K494841K633810K460361K081811J600266J335084
$$ 494127512 494257987 495506018 497599632 500094473 502728283 505188644 507270455 508870721 510205805
634.3E10205805J452923J483739J185536P86662K29716l30984j91868N46992P28607
$$ 510205805 511658728 513142467 514328003 515114665 515344381 515013397 514821529 515368521 516097128
652.7E16097128L76881K39074L96609P99120J064658r29177n419552k478242N594790
$$ 516097128 516474009 516713083 517109692 517908812 518973470 518044293 512624741 510146499 515741289
671E15741289M296064J522601J169383J515746J585543J416326J180351J160920J430451
$$ 515741289 520037353 521559954 522729337 524245083 525830626 527246952 528427303 529588223 531018674
689.4E31018674J461625Q10028j11401n11051j53541O50167J467824J904249J970709
$$ 531018674 532480299 533290327 533178926 532667875 532514334 533164501 534632325 536536574 538507283
707.7E38507283K006948K279877K758801L153325L145396L353417M178941M496634
$$ 538507283 540514231 542794108 545552909 548706234 551851630 555205047 559383988 563880622
724E63880622M174352L908515L715932L341198K586902J803934J412034J293123J199543
$$ 563880622 568054974 571963489 575679421 579020619 581607521 583411455 584823489 586116612 587316155
742.4E87316155J006067N67138K1577k91228l05712k71976l43442n01931o92129o08385
$$ 587316155 588322222 588889360 588910937 588619709 588313997 588042021 587698579 587196648 586504519 585896134
762.8E85896134M8101J237631K552688L534615L993452M160762M329920M466950M429698
$$ 585896134 585944235 587181866 589734554 593269169 597262621 601423383 605753303 610220253 614649951
781.2F14649951M046023L246665K352655J815141J737535K050817K413928K494037
$$ 614649951 618695974 621942639 624295294 626110435 627847970 629898787 632312715 634806752
797.5F34806752K415002K420604K607703K888918L035128K702236J889408R86993M73798
$$ 634806752 637221754 639642358 642250061 645138979 648174107 650876343 652765751 653752744 654226542
815.8F54226542N66422P45535L57628n99503j670480k217949j950562j384794j211941
$$ 654226542 654792964 655538499 655896127 655296624 653626144 651408195 649457633 648072839 646860898
834.2F46860898j620710k243758k553582k247333j513720r17613p62821r13024j070499
$$ 646860898 645240188 642996430 640442848 638195515 636681795 635764182 635001361 634088337 633017838
852.5F33017838r51886m57347L00169J305819K610981L870607M691183N228579N540073
$$ 633017838 632065952 631608605 631908774 633214593 635825574 639696181 644387364 649615943 655156016
870.9F55156016N213678M010678K140700K17438j282215k358317l168166l936112m629374
$$ 655156016 660369694 664380372 666521072 666738510 665456295 663097978 659929812 655993700 651364326
889.3F51364326m886031m571616l983677l549993l558099m089058m957735n747736
$$ 651364326 646478295 641906679 637923002 634373009 630814910 626725852 621768117 616020381
905.6F16020381o088078o080389o125629o332755o370842n789757m510820k933323
$$ 616020381 609932303 603851914 597726285 591393530 585022688 579232931 574722111 571788788
921.9E71788788j622379r53317q93593j004815q30710l79204l9876q8572m95434j241386
$$ 571788788 570166409 569213092 568319499 567314684 566483974 566104770 566064894 565976322 565480888 564239502
942.3E64239502k487838m204214o013930p550239q708597r528398r988844j0077894
$$ 564239502 561751664 557547450 551533520 543983281 535274684 525746286 515757442 505679548
958.6E05679548r912461r716094r698301r826213r795547r312689q308143p026106
$$ 505679548 495767087 486050993 476352692 466526479 456730932 447418243 439110100 432083994
974.9D32083994n857408m928291m112720l311992k563178j933009j503616j403362
$$ 432083994 426226586 421298295 417185575 413873583 411310405 409377396 407873780 406470418
991.2D06470418j542598j553208j166641m76391J98722N09292K21938n17577j270056
$$ 406470418 404927820 403374612 402207971 401731580 401930302 402439594 402661532 402143955 400873899
1009.6D00873899j727819j847267j799554j798630j905292k044827k120226k088696
$$ 400873899 399146080 397298813 395499259 393700629 391795337 389750510 387630284 385541588
1025.9C85541588k009422j992732k081513k259106k404064k367496k197415k093166
$$ 385541588 383532166 381539434 379457921 377198815 374794751 372427255 370229840 368136674
1042.2C68136674k111643k106011j900047j385779n99920K07066P79569J170278J538455
$$ 368136674 366025031 363919020 362018973 360633194 360033274 360240340 361019909 362190187 363728642
1060.6C63728642J980216K433151K475917J610696K325j290619j343429k33800J342208
$$ 363728642 365708858 368142009 370617926 372228622 372230947 370940328 369596899 369363099 370705307
1078.9C70705307K786844L819883M389793M588068M576146M462153M202396L701984
$$ 370705307 373492151 377312034 381701827 386289895 390866041 395328194 399530590 403232574
1095.2D03232574K964259K139955J483232J210362J386106J842946K215504K378345
$$ 403232574 406196833 408336788 409820020 411030382 412416488 414259434 416474938 418853283
1111.6D18853283K513558K685070K772510K654969K315909J903832J701206J914412
$$ 418853283 421366841 424051911 426824421 429479390 431795299 433699131 435400337 437314749
1127.9D37314749K526968L092438L064126K414495J457989N67138P064k23548k69740
$$ 437314749 439841717 442934155 445998281 448412776 449870765 450437903 450444967 450221419 449951679
1146.2D49951679l00974l80576l37690M7505Q24183J801700K686202L358930L894181
$$ 449951679 449650705 449270129 448932439 448979944 449804127 451605827 454292029 457650959 461545140
1164.6D61545140M365921M846572N422861O023764O458134O636143O655007O664396
$$ 461545140 465911061 470757633 476180494 482204258 488662392 495298535 501953542 508617938
1180.9E08617938O685972O556630O056189N123020L937959K770663J792431R77516
$$ 508617938 515303910 521860540 527916729 533039749 536977708 539748371 541540802 542518318
1197.2E42518318K27511m44174r61065j151026r27984m71652r7215m4286k93673o22749
$$ 542518318 542745829 542301655 541340590 540189564 539261580 538789928 538692713 538648427 538354754 537732005
1217.6E37732005q31187r21428j070201j422286j866877k183497k229154j946748j459777
$$ 537732005 536900818 535979390 534909189 533486903 531620026 529436529 527207375 525260627 523800850
1236E23800850j000345o51061l09527J69456Q36074J531482K048909K292097K265036
$$ 523800850 522800505 522149444 521839917 522009373 522845447 524376929 526425838 528717935 530982971
1254.3E30982971K087653J995623K100646K285541K391338K327979K147257J979649
$$ 530982971 533070624 535066247 537166893 539452434 541843772 544171751 546319008 548298657
1270.6E48298657J870871J724660J458228J105308Q42333Q08537R71079J215935J315295
$$ 548298657 550169528 551894188 553352416 554457724 555300057 556108594 557079673 558295608 559610903
1289E59610903J054228M34279k79307q51095j219213j417518j576364j822591k056717
$$ 559610903 560665131 561099410 560820103 559969008 558749795 557332277 555755913 553933322 551876605
1307.4E51876605k014339j670599j162768n90026r5844J76429K14577N5134l14414
$$ 551876605 549862266 548191667 547028899 546438873 546343029 546519458 546734035 546789169 546474755
1325.7E46474755q91149j529873k026915k276898k193451j772940j141846o04153m37915
$$ 546474755 545583606 544053733 542026818 539749920 537556469 535783529 534641683 534037530 533599615
1344.1E33599615n90145q22366j022458j203596j404226j662612j982630k439618k996385
$$ 533599615 533009470 532187104 531164646 529961050 528556824 526894212 524911582 522471964 519475579
1362.4E19475579l334522l427207l414155l094792k912938l116251l230512l367126
$$ 519475579 516141057 512713850 509299695 506204903 503291965 500175714 496945202 493578076
1378.7D93578076l734439l933966l555715k653003j421392n20736l25144l90261k88516
$$ 493578076 489843637 485909671 482353956 479700953 478279561 477758825 477433681 477043420 476754904
1397.1D76754904m7505L86864Q83311J346260J679450J739234J673907J633555J684129
$$ 476754904 476707399 477094263 477977574 479323834 481003284 482742518 484416425 486049980 487734109
1415.5D87734109J922339K460599K623469K435178K257794J861602J332402P74383
$$ 487734109 489656448 492117047 494740516 497175694 499433488 501295090 502627492 503401875
1431.8E03401875J31190n09977n27442M9651M15683N46336N81920N71430M70817K44200
$$ 503401875 503533065 503023088 502495646 502545297 502960980 503507316 504089236 504660666 505131483 505375683
1452.2E05375683K83182J199305K863407L292561K955019L151059L785670M430413
$$ 505375683 505658865 506858170 509721577 513014138 515969157 519120216 522905886 527336299
1468.5E27336299N714834Q132756R128630P788181O081105M463613K979815J426041
$$ 527336299 533051133 541183889 550312519 558100700 564181805 568645418 571625233 573051274
1484.8E73051274k14696j918495l247499l813267m778206o132305o198227n651653
$$ 573051274 572836578 570918083 567670584 563857317 559079111 552946806 546748579 541096926
1501.1E41096926n782604p896364j1209667r790778q076608q171439p515491n773872
$$ 541096926 535314322 527417958 516208291 506417513 498340905 490169466 482653975 476880103
1517.4D76880103l845483l248542l148943l074378l338516l130645l054469l185928
$$ 476880103 473034620 469786078 466637135 463562757 460224241 457093596 454039127 450853199
1533.7D50853199k486289k005487k256632j354099J00375R16868J619637K412081L096580
$$ 450853199 448366910 446361423 444104791 442750692 442851067 443767935 445387572 447799653 450896233
1552.1D50896233L481388L505350M322618N678594M500419L553927L325343L073394
$$ 450896233 454377621 457882971 462205589 467884183 472384602 475938529 479263872 482337266
1568.4D82337266K966702K400756J802385J742423J572698J013785M35681P7396k03371
$$ 482337266 485303968 487704724 489507109 491249532 492822230 493836015 494271696 494349092 494145721
1586.8D94145721n70029j129299j761139k473205l143519l802061m590154n372643
$$ 494145721 493575692 492446393 490685254 488212049 485068530 481266469 476676315 471303672
1603.1D71303672o106764o924421p906884q503109q657128r797722j1564046j0446191
$$ 471303672 465196908 458272487 450365603 441862494 433205366 423407644 411843598 401397407
1619.4D01397407j0128498j2073457j2149990j1264950j0749519r410441q792579r187072
$$ 401397407 391268909 379195452 367045462 355780512 345030993 335620552 326827973 317640901
1635.7C17640901o580413l219038j597792o04242L17782J412243J833647K305001L891796
$$ 317640901 311060488 307841450 306243658 305639416 305957198 307369441 309203088 311508089 315399885
1654.1C15399885M343987M304200N160183O576091P648259P523626Q233786R567559
$$ 315399885 319743872 324048072 329208255 335784346 343432605 350956231 359190017 368757576
1670.4C68757576R077817R276688J0218889R701907R168267J0324508J3515950J3255745
$$ 368757576 377835393 387112081 397330970 407032877 416201144 426525652 440041602 453297347
1686.7D53297347J1839628J3007820J3622015J5956760J8107712J7506778J8481613
$$ 453297347 465136975 478144795 491766810 507723570 525831282 543338060 561819673
1701E61819673J5214502J2113572J1619150R754181P852376O477773N598604N639792
$$ 561819673 577034175 589147747 600766897 610521078 618373454 624851227 630449831 636089623
1717.3F36089623N368471M262984L461718K998233K404452J956820J599968J744687
$$ 636089623 641458094 645721078 649182796 652181029 654585481 656542301 658142269 659886956
1733.6F59886956K221585K059459K091825K634764L248513L897428M702032N775094
$$ 659886956 662108541 664168000 666259825 668894589 672143102 676040530 680742562 686517656
1749.9F86517656O542325O116330N803347N818367N522251N534172N129338M365086
$$ 686517656 693059981 699176311 704979658 710798025 716320276 721854448 726983786 731348872
1766.3G31348872L936172L660798L835022L907502L228247K638161K390921K277792
$$ 731348872 735285044 738945842 742780864 746688366 749916613 752554774 754945695 757223487
1782.6G57223487K211571K102613J796484J459897J573085J753092J640082J525342
$$ 757223487 759435058 761537671 763334155 764794052 766367137 768120229 769760311 771285653
1798.9G71285653J564980J520693J322627J194418J171588J269758J323462J223862
$$ 771285653 772850633 774371326 775693953 776888371 778059959 779329717 780653179 781877041
1815.2G81877041J073360J005054R26792Q94130R82046R19938Q11994R60350J037300
$$ 781877041 782950401 783955455 784882247 785776377 786758423 787678361 788490355 789450705 790488005
1833.6G90488005Q92937Q29756P52151N17726M29928P02620Q42512P56025O59287N57124
$$ 790488005 791380942 792210698 792962849 793480575 793910503 794613123 795455635 796211660 796870947 797428071
1854G97428071N09918M99070N17309N14090M24981K75492L02554N43296O31809N40853
$$ 797428071 797937989 798437059 798954368 799468458 799893439 800168931 800471485 801014781 801646590 802187443
1874.4H02187443M68135M62830M56631M30882L96132L61026L58402M58181N21124M38750
$$ 802187443 802655578 803118408 803575039 804005921 804402053 804763079 805121481 805579662 806100786 806539536
1894.7H06539536L69250L64423L54230L19660L13103K81573K13206K16901K40922J83642
$$ 806539536 806908786 807273209 807627439 807947099 808260202 808541775 808754981 808971882 809212804 809396446
1915.1H09396446J78218K86698K59459J94669K54929K71678K31683K00152J43469Q8394
$$ 809396446 809574664 809861362 810120821 810315490 810570419 810842097 811073780 811273932 811417401 811505795
1935.5H11505795Q3506O5863Q4519J96934K42531J63436J03831J11103J46389J98663
$$ 811505795 811589301 811655164 811739683 811936617 812179148 812342584 812446415 812557518 812703907 812902570
1955.9H12902570K03013J64449J23501P9513P2479J33038J63734J44600J42217J17541
$$ 812902570 813105583 813270032 813393533 813473046 813545525 813678563 813842297 813986897 814129114 814246655
1976.3H14246655Q2850R1553J24931R4712L6001j550l6835L814R5070J24693R2268
$$ 814246655 814329505 814421058 814545989 814640701 814676702 814675152 814638317 814642131 814737201 814861894 814954162
1998.8H14954162K4080n7757r0361q3625o7830o0618r6619j90020k47359k09272j81734
$$ 814954162 814978242 814920485 814830124 814746499 814678669 814618051 814521432 814331412 814084053 813874781 813693047
2021.2H13693047j78457j75237j91451k46167k79665k44617j81616j69277k15113k26974
$$ 813693047 813514590 813339353 813147902 812901735 812622070 812377453 812195837 812026560 811811447 811584473
2041.6H11584473j97649j50085r5963n9367o0141o6995o3479m3810J2815O2168N8055
$$ 811584473 811386824 811236739 811140776 811081409 811021268 810954273 810890794 810846984 810859799 810921967 810980022
2064H10980022K8491L3557M2618M0531M6313O2644O1095N2273O1095M8935M2558Q3685
$$ 810980022 811008513 811042070 811084688 811125219 811171532 811234176 811295271 811347544 811408639 811457574 811500132 811583817
2088.5H11583817J21892R2983N0604N6982J01626J50979J76668J56939J00851N1319
$$ 811583817 811705709 811798692 811849296 811906278 812007904 812158883 812335551 812492490 812593341 812644660
2108.9H12644660L3737O9201J30415J53064J03712M5598L4869M2796P7724J27375J07766
$$ 812644660 812678397 812747598 812878013 813031077 813134789 813180387 813215256 813258052 813335776 813463151 813570917
2131.3H13570917L7372L3796P7605J17779J51991J44363J03831O7115L4332N4300J57714
$$ 813570917 813608289 813642085 813719690 813837469 813989460 814133823 814237654 814304769 814339101 814393401 814551115
2153.8H14551115K40922K20358J67907J76727K14100K53558L01660L39210L51905L41833
$$ 814551115 814792037 815012395 815180302 815357029 815571129 815824687 816126347 816465557 816817462 817159295
2174.2H17159295L22521L10242L15845L48747L79681L38376K63095K34544K79367L54529
$$ 817159295 817481816 817792058 818107903 818456650 818836331 819174707 819437802 819672346 819951713 820306242
2194.6H20306242L69131L25918K66075K33651K71201L47316L63112L22461K78949K28882
$$ 820306242 820675373 821001291 821267366 821501017 821772218 822119534 822482646 822805107 823084056 823312938
2215H23312938K14458K53439L06487L21626K72394J84953J10865J20639K11358K53439
$$ 823312938 823527396 823780835 824087322 824408948 824681342 824866295 824977160 825097799 825309157 825562596
2235.4H25562596J82331N4240o3956o7889M4167J40786J14202m5240k28285k71201
$$ 825562596 825744927 825799167 825735211 825667322 825711489 825852275 825966477 825921237 825692952 825421751
2255.8H25421751j12951M1067M9830j6868j07050j40727l9637J15931K14279K77221
$$ 825421751 825308800 825349867 825399697 825382829 825275779 825135052 825095415 825211346 825425625 825702846
2276.1H25702846L09765L12746K02119j80900o91116j022577j182496j313568j398742
$$ 825702846 826012611 826325357 826527476 826346576 825655460 824632883 823450387 822136819 820738077
2294.5H20738077j436293j509190j645207j950264k606094l351867l672898l404498
$$ 820738077 819301784 817792594 816147387 814197123 811591029 808239162 804566264 801161766
2310.8H01161766k786040k660811l816962n431891n761444m473985l202319l234982
$$ 801161766 798375726 795714915 791897953 786466062 780704618 776230633 773028314 769793332
2327.1G69793332l590465k786934j584173j522600j931072j822888q92580K108753
$$ 769793332 766202867 763415933 761831760 760309160 758378088 756555200 755662620 757771373
2343.5G57771373P301390P781088M71235q314729j2581766j1177003p538080l409565
$$ 757771373 765072763 772853851 773325086 765010357 752428591 741251588 733713508 730303943
2359.8G30303943N00322L891587O695330Q630454R670854R966314R647250R112418
$$ 730303943 730804265 734695852 741391182 750021636 759692490 769658804 779306054 788418472
2376.1G88418472Q662104Q060873O776035M818022K781808J274229M50551O7830j39058
$$ 788418472 797080576 805141449 811917484 816735506 819517314 820791543 821242094 821309924 821170866
2394.4H21170866k88963l94821m30226l60787k81930l02971l95834m88043n11587m28438
$$ 821170866 820881903 820487082 820056856 819696069 819414139 819111168 818715334 818227291 817715704 817287266
2414.8H17287266l39567l56853m52221n58078o15776o00934n31733m62234m55916n20229
$$ 817287266 816947699 816590846 816138625 815580547 814964771 814363837 813832104 813369870 812913954 812393725
2435.2H12393725n90742o19769o03139n59628n28515n23150n55098o12795o26445n66661
$$ 812393725 811802983 811183214 810580075 810020447 809491932 808968782 808413684 807800889 807174444 806607783
2455.6H06607783n08130n11169n74589o23643n98908n53250n15223m92930n21183n93484
$$ 806607783 806099653 805588484 805013895 804390252 803791344 803238094 802722871 802229941 801708758 801115274
2476H01115274o32524n97894n34475n01752n08189n15700n46276n97179n82814m94123
$$ 801115274 800482750 799884856 799350381 798848629 798340440 797824740 797278464 796681285 796098471 795604348
2496.4G95604348m07398l97145m83334n63920n57482n03242m18782l82007m82261o11722
$$ 795604348 795196950 794799805 794316471 793752551 793195069 792691827 792273045 791891038 791408777 790797055
2516.8G90797055o22571n25355m20690l94940m84467o26146o98448o48498n52058n13673
$$ 790797055 790174484 789649129 789228439 788833499 788349032 787722886 787024438 786375940 785823882 785310209
2537.2G85310209n62489o44863o81281o42002n64873n13255n20289n75960o47962o59764
$$ 785310209 784747720 784102857 783421576 782779574 782214701 781701446 781181157 780605197 779957235 779297471
2557.6G79297471n86927n16653n25951n94259o37531o20902n55694m85122m82261n59211
$$ 779297471 778710544 778193891 777667940 777073681 776436150 775815248 775259554 774774432 774292171 773732960
2578G73732960o52909o60062n98431n62667n40793n23031n47528o12378o30975n69582
$$ 773732960 773080051 772419989 771821558 771258891 770718098 770195067 769647539 769035161 768404186 767834604
2598.4G67834604n28038n64992o42359p12812p55430p73251p87556q03709q28087q77559
$$ 767834604 767306566 766741574 766099215 765386403 764630973 763857722 763070166 762266457 761438370 760560811
2618.8G60560811r15826r08673r14037r74417j024782j035273j036644j038671j049995
$$ 760560811 759644985 758736312 757822275 756847858 755823076 754787803 753751159 752712488 751662493
2637.1G51662493j053274j051366j055956j028896j022160j069545j085162j048208
$$ 751662493 750609219 749557853 748501897 747473001 746450841 745381296 744296134 743247926
2653.5G43247926j024604j045823j079917j078128j057208j059711j030266r57907
$$ 743247926 742223322 741177499 740097582 739019454 737962246 736902535 735872269 734914362
2669.8G34914362r12368r31144r68396r67741r46105r11236q91804q93712r05931r38118
$$ 734914362 734001994 733070850 732102454 731134713 730188608 729277372 728385568 727491856 726585925 725647807
2690.2G25647807r48429r20832r26256r84729j016080j026273j061618j069665j079440
$$ 725647807 724699378 723778546 722852290 721867561 720851481 719825208 718763590 717693925 716614485
2708.5G16614485j137734j138866j101315j110196j101553j071871j062035j054823
$$ 716614485 715476751 714337885 713236570 712126374 711024821 709952950 708890915 707836092
2724.8G07836092j041472j040519j022160r63270r27806r24707r21249r25601r29832
$$ 707836092 706794620 705754101 704731941 703768671 702840865 701916158 700994909 700069308 699139476
2743.2F99139476r45449r57489r22382q72374q53359q81434r32455r57072r40084r01580
$$ 699139476 698194027 697236538 696314156 695441782 694588423 693706989 692774534 691817462 690877378 689975798
2763.6F89975798q81314r26852j021207j063108j034618j017749j055062j107037j155495
$$ 689975798 689094484 688167632 687146425 686083317 685048699 684030950 682975888 681868851 680713356
2782F80713356j223684j279354j285136j291990j361966j461029j510859j517117j536727
$$ 680713356 679489672 678210318 676925182 675633192 674271226 672810197 671299338 669782221 668245494
2800.3F68245494j552403j566469j651645j780868j841306j832903j827418j866222
$$ 668245494 666693091 665126622 663474977 661694109 659852803 658019900 656192482 654326260
2816.6F54326260j992524k134800k204358k244115k298057k372682k491892k703487
$$ 654326260 652333736 650198936 647994578 645750463 643452406 641079724 638587832 635884345
2832.9F35884345k978445l253936l625155m246950n135417o198823p055283p024050
$$ 635884345 632905900 629651964 626026809 621779859 616644442 610445619 603390336 596366286
2849.3E96366286n865514m139781k574086j561105j230717j509071k174556k957046
$$ 596366286 590500772 586360991 583786905 582225800 580995083 579486012 577311456 574354410
2865.6E74354410l595948l882766l690600l106237k374351j711368j256168j053989
$$ 574354410 570758462 566875696 563185096 560078859 557704508 555993140 554736972 553682983
2881.9E53682983j064599j205086j370848j486659j593887j776815k038538k340019
$$ 553682983 552618384 551413298 550042450 548555791 546961904 545185089 543146551 540806532
2898.2E40806532k614141k797842l014624l423154l992081m701614n537212o251991
$$ 540806532 538192391 535394549 532379925 528956771 524964690 520263076 514725864 508473873
2914.5E08473873o458104o019711n127341l979235k736509j501501k97576Q41200J925469
$$ 508473873 502015769 495996058 490868717 486889482 484152973 482651472 482353896 483195096 485120565
2932.9D85120565K957940L872037M546314M851938M701375M104794L256619K367794
$$ 485120565 488078505 491950542 496496856 501348794 506050169 510154963 513411582 515779376
2949.2E15779376J538217Q99613O82116R77814J600861K348781L140747L929139M600107
$$ 515779376 517317593 518217206 518899322 519877136 521477997 523826778 526967525 530896664 535496771
2967.6E35496771N062938N343437N458176N409301N233049M939914M520297M025340
$$ 535496771 540559709 545903146 551361322 556770623 562003672 566943586 571463883 575489223
2983.9E75489223L521979L047526K619922K153098J560033R32097L75212j21832n74172
$$ 575489223 579011202 582058728 584678650 586831748 588391781 589323878 589699090 589577258 589003086
3002.2E89003086r73821j282155j439631j429379j304627j184761j165569j243532
$$ 589003086 588029265 586747110 585307479 583878100 582573473 581388712 580223143 578979611
3018.5E78979611j408636j680255j969338k116978k101898k064109k095938k184629
$$ 578979611 577570975 575890720 573921382 571804404 569702506 567638397 565542459 563357830
3034.9E63357830k284467k331078k323091k350867k466142k590895k627253k558589
$$ 563357830 561073363 558742285 556419194 554068327 551602185 549011290 546384037 543825448
3051.2E43825448k487362k488732k524257k521396k406776k214551k030611j883447
$$ 543825448 541338086 538849354 536325097 533803701 531396925 529182374 527151763 525268316
3067.5E25268316j815855j833618j813471j663268j492143j452088j500785j496911
$$ 525268316 523452461 521618843 519805372 518142104 516649961 515197873 513697088 512200177
3083.8E12200177j419068j313865j216054j180947j197695j207352j228333j292347
$$ 512200177 510781109 509467244 508251190 507070243 505872548 504665196 503436863 502144516
3100.1E02144516j332403j316279j337975j406610j488626j561999j579494j591086
$$ 502144516 500812113 499495834 498157859 496751249 495262623 493700624 492121130 490530044
3116.4D90530044j630515j721114j869291j956701j949311j921385j922280j967102
$$ 490530044 488899529 487178415 485309124 483352423 481403112 479481727 477559447 475592345
3132.8D75592345k046764k127588k174616k213746k231806k218038k219618k214819
$$ 475592345 473545581 471417993 469243377 467029631 464797825 462579787 460360169 458145350
3149.1D58145350k217829k288520k386600k399862k352238k376198k422035k417356
$$ 458145350 455927521 453639001 451252401 448852539 446500301 444124103 441702068 439284712
3165.4D39284712k405167k367943k349436k403260k453297k446353k383024k342105
$$ 439284712 436879545 434511602 432162166 429758906 427305609 424859256 422476232 420134127
3181.7D20134127k352208k354175k349645k340853k316624k293765k274424k220601
$$ 420134127 417781919 415427744 413078099 410737246 408420622 406126857 403852433 401631832
3198D01631832k134532k084106k089441k099573k068818k000689j949281j943707j979798
$$ 401631832 399497300 397413194 395323753 393224180 391155362 389154673 387205392 385261685 383281887
3216.4C83281887j994521j936316j884938j902312j959592k006739k006710j966327
$$ 383281887 381287366 379351050 377466112 375563800 373604208 371597469 369590759 367624432
3232.7C67624432j996845k103836k153545k174020k230138k261102k279311k367079
$$ 367624432 365627587 363523751 361370206 359196186 356966048 354704946 352425635 350058556
3249C50058556k430886k404273k392322k427846k447128k425462k382428k316475k218246
$$ 350058556 347627670 345223397 342831075 340403229 337956101 335530639 333148211 330831736 328613490
3267.4C28613490k090126j983554j912891j810909j662433j499891j327694j194715
$$ 328613490 326523364 324539810 322626919 320816010 319153577 317653686 316325992 315131277
3283.7C15131277j096428r73343q75801p87735o74039n86123m98801l99709l20643
$$ 315131277 314034849 313061506 312185705 311397970 310723931 310137808 309639007 309239298 308918655
3302C08918655k68042k80142l21627l09139k38896j74850j81228k19643k44289k59281
$$ 308918655 308650613 308370471 308048844 307739705 307500809 307325959 307144731 306925088 306680799 306421518
3322.4C06421518k71022k91705k98947k90454k96890k90871k98053l97801n10335n33909
$$ 306421518 306150496 305858791 305559844 305269390 304972500 304681629 304383576 303985775 303475440 302941531
3342.8C02941531n45979n58197n15133n48542o96659p77483p02053o07342o42091o92993
$$ 302941531 302395552 301837355 301322222 300773680 300077021 299299538 298597485 297990143 297348052 296655059
3363.2B96655059n99533n15283o26653p97004p82340o17922n25117n30332n57303n26071
$$ 296655059 296055526 295540243 294913590 294116586 293334246 292716324 292191207 291660875 291103572 290577501
3383.6B90577501m08262k57432j65344k54482m19378m11034j84506j877j39743l50118
$$ 290577501 290169239 289911807 289746463 289491981 289072603 288661569 288477063 288475186 288335443 287985325
3404B87985325k51413l3378L6895M709j7196K5749J27167K30431L09140M38422O24180
$$ 287985325 287733912 287700534 287737429 287742138 287724942 287750691 287877858 288108289 288417429 288855851 289480031
3426.5B89480031P59959P58379P93308R09836Q45342O58751O59794Q72641J075089
$$ 289480031 290239990 290998369 291791677 292701513 293546855 294205606 294865400 295738041 296813130
3444.8B96813130J169205J198053J251191J339108J406729J466722J527637J513272
$$ 296813130 297982335 299180388 300431579 301770687 303177416 304644138 306171775 307685047
3461.1C07685047J561910J801491J947105J749098J447201J464874J717358J977951
$$ 307685047 309246957 311048448 312995553 314744651 316191852 317656726 319374084 321352035
3477.4C21352035K072394J917123J859308K013176K055049K036810K145708K221137
$$ 321352035 323424429 325341552 327200860 329214036 331269085 333305895 335451603 337672740
3493.8C37672740K221704K170920K153903K192617K153963K128005K201169K292306
$$ 337672740 339894444 342065364 344219267 346411884 348565847 350693852 352895021 355187327
3510.1C55187327K408802K467424K374768K342761K475381K633750K570838K385407
$$ 355187327 357596129 360063553 362438321 364781082 367256463 369890213 372461051 374846458
3526.4C74846458K440960K675563K814382K855092K837509K806127K952308L134459
$$ 374846458 377287418 379962981 382777363 385632455 388469964 391276091 394228399 397362858
3542.7C97362858L122836K977193K963692L106534L215164L254801L301025L385663
$$ 397362858 400485694 403462887 406426579 409533113 412748277 416003078 419304103 422689766
3559D22689766L420472L353268L321886L647178M072577M045486L826946L842652M008502
$$ 422689766 426110238 429463506 432785392 436432570 440505147 444550633 448377579 452220231 456228733
3577.4D56228733M155845M236757M156351L996641M031151M273415M260123M195273
$$ 456228733 460384578 464621335 468777686 472774327 476805478 481078893 485339016 489534289
3593.7D89534289M406511M627347M650444M676581M716456M630625M750669M985273
$$ 489534289 493940800 498568147 503218591 507895172 512611628 517242253 521992922 526978195
3610E26978195M885733M601121M291653M265488M654944M665255M290283M002273M312515
$$ 526978195 531863928 536465049 540756702 545022190 549677134 554342389 558632672 562634945 566947460
3628.4E66947460N193114N209506M880726M776061M647374M524350M373253M054129
$$ 566947460 572140574 577350080 582230806 587006867 591654241 596178591 600551844 604605973
3644.7F04605973L716111L915667M454017M265785L807903L970980M121066L669738
$$ 604605973 608322084 612237751 616691768 620957553 624765456 628736436 632857502 636527240
3661F36527240L240049L065169K778292K585888K919256K774597K343833K764344K991975
$$ 636527240 639767289 642832458 645610750 648196638 651115894 653890491 656234324 658998668 661990643
3679.4F61990643K703249K484798K246023J893520J564503J681447K005100J942396
$$ 661990643 664693892 667178690 669424713 671318233 672882736 674564183 676569283 678511679
3695.7F78511679J634479J432717J419544J596033J657904J500189J463711J829684
$$ 678511679 680146158 681578875 682998419 684594452 686252356 687752545 689216256 691045940
3712F91045940K115428J532615O60240K48015K63691M05848O91295J120031J222133
$$ 691045940 693161368 694693983 695354223 695602238 695865929 696271777 696963072 698083103 699305236
3730.3F99305236J097501J207947J619935J947701J699090R16660O11663J277566J150072
$$ 699305236 700402737 701610684 703230619 705178320 706877410 707794070 708405733 709683299 710833371
3748.7G10833371O04689J091897J557231J219511Q09014Q56698R20534P25329O19173
$$ 710833371 711438060 712529957 714087188 715306699 716115713 716972411 717892945 718618274 719237447
3767.1G19237447N95212P34687R35554Q79169P08997N98371O54578O42657N51761O11722
$$ 719237447 719832659 720567346 721502900 722382069 723091066 723689437 724344015 724986672 725538433 726150155
3787.5G26150155O90043O94811N16415K68042L28899K93731K49624P08759P16746O04630
$$ 726150155 726840198 727535009 728051424 728319466 728648365 728942096 729191720 729900479 730617225 731221855
3807.8G31221855Q53598P62403K90394K6881L05117K79009L47435Q03352P43568N56588
$$ 731221855 732075453 732837856 733128250 733155131 733460248 733739257 734086692 734890044 735633612 736190200
3828.2G36190200M20451K68698L20315J97053O4075M62651P75874P56025O21438L54648
$$ 736190200 736610651 736879349 737199664 737396717 737460792 737923443 738699317 739455342 740076780 740431428
3848.6G40431428k19345q25942O2406J290143J043618M10318J22249K69175L20911
$$ 740431428 740212083 739386141 739448547 740738690 741782308 742192626 742314875 742584050 742904961
3867G42904961j8358R4235N02825N80728N29349K44200J78396L18885K12252L26395
$$ 742904961 742886603 742980838 743483663 744064391 744593740 744837940 745016336 745335221 745547473 745873868
3887.4G45873868L29555J16527L05771M38571J07587j62840q7500J08660M39941O37711
$$ 745873868 746203423 746319950 746625721 747064292 747171879 747009039 746921539 747030199 747470140 748107851
3907.8G48107851M52876K49028J80065O2407K1040J36018J44124J14143K21133K40982
$$ 748107851 748560727 748809755 748989820 749052227 749073267 749209285 749353409 749467552 749688685 749929667
3928.2G49929667J01089Q4341K35378K80559J92583J06275Q5652J70886J83106J05619
$$ 749929667 750030756 750115097 750350475 750631034 750823617 750929892 751015544 751186430 751369536 751475155
3948.6G51475155J76370K52307J56522O9141J09196J61886J64568J76549J87397J42277
$$ 751475155 751651525 751903832 752060354 752129495 752238691 752400577 752565145 752741694 752929091 753071368
3969G53071368J00553J60336J88709J09076R8586J24931J17064J27316R0718N8889
$$ 753071368 753171921 753332257 753520966 753630042 753728628 753853559 753970623 754097939 754188657 754247546
3989.4G54247546J40548K43306K35856J64091
$$ 754247546 754388094 754631400 754867256 755031347
3997.5G55031347
$$ 755031347
##END=$$ End of the data block
