##TITLE=623-52-SE $$ Begin of the data block
##JCAMP-DX=5.00 $$ ACD/SpecManager v 10.08
##SPECTROMETER/DATA SYSTEM=Alpha
##DATE=21 Oct 2013 11:04:12
##DATA TYPE=INFRARED SPECTRUM
##DATA CLASS=XYDATA
##ORIGIN=
##OWNER=
##NPOINTS=1765
##FIRSTX=399.75695801
##LASTX=3997.56933594
##MAXX=3997.56933594
##MINX=399.75695801
##MAXY=0.82711607
##MINY=0.28646341
##XFACTOR=1.0000000000
##YFACTOR=1.000000000000000e-9
##FIRSTY=0.55925387
##DELTAX=2.03957629
##XUNITS=1/CM
##YUNITS=ARBITRARY UNITS
##XYDATA=(X++(Y..Y))
$$ plain form
399.8 559253871 556716621 554350317 553001702 553118348 553822994 554259241 554146469 553521097 552467763
418.1 552467763 551271975 550258517 549448669 548468769 546821594 544984102 543837607 543358028 542895019
436.5 542895019 542444527 542503536 543272972 544760466 546353519 547096908 546651661 545415759 544024110
454.8 544024110 542768419 541637063 540204287 537993550 535316706 532768965 530710399 529137671
471.1 529137671 527519703 525631189 523860753 522653639 522059381 521627188 521099806 520401835 519187272
489.5 519187272 517396450 515498221 513888240 512538433 510926545 508604586 505919635 503348410
505.8 503348410 501009166 498897791 496746242 494254917 491449684 488710165 486568063 485304624
522.1 485304624 484649330 484110117 483597338 483440250 483980954 485379189 487529874 489934981 491988540
$$ packed form
399.8E59253871k537250k366304j348615J16646P04646M36247j12772o25372j053334
418.1E52467763j195788j013458q09848r79900j647175j837492j146495m79579m63009
436.5E42895019m50492N9009P69436J487494J593053P43389m45247j235902j391649
454.8E44024110j255691j131356j432776k210737k676844k547741k058566j572728
471.1E29137671j617968j888514j770436j207114n94258m32193n27382o97971j214563
489.5E19187272j790822j898229j609981j349807j611888k321959k684951k571225
505.8E03348410k339244k111375k151549k491325k805233k739519k142102j263439
522.1D85304624o55294n39213n12779j57088N40704J398235K150685K405107K053559
$$ plain form
540.5 491988540 493327796 493892014 494052678 494154483 493833363 492628634 490901440 489286363 487988055
558.8 487988055 486880869 485535175 483559906 481044054 478542954 476822346 476365447 476940095 478040278
577.2 478040278 479547232 481501698 483934790 486732781 489369452 491252840 492227554 492451727 492306441
595.6 492306441 492343694 492809474 493279666 493277222 492950380 492737412 492978752 493597895 494056374 493998438
616 493998438 494196862 495515674 497589022 500039279 502669156 505118608 507194877 508827031 510139406
634.3 510139406 511452973 512849808 514081895 514820516 514920056 514655650 514626682 515192091 515868008 516202033
654.7 516202033 516396224 516788304 517583132 518649518 517664611 511807561 508870959 514675200 519298971
673.1 519298971 520995021 522156358 523537755 525073290 526620984 527995646 529280663 530720770
$$ packed form
540.5D91988540J339256N64218J60664J01805l21120j204729j727194j615077j298308
558.8D87988055j107186j345694j975269k515852k501100j720608m56899N74648J100183
577.2D78040278J506954J954466K433092K797991K636671J883388R74714K24173j45286
595.6D92306441L7253M65780M70192k444l26842k12968K41340O19143M58479n7936
616D93998438J98424J318812K073348K450257K629877K449452K076269J632154J312375
634.3E10139406J313567J396835J232087P38621R9540k64406k8968N65409O75917L34025
654.7E16202033J94191L92080P94828J066386r84907n857050k936602N804241M623771
673.1E19298971J696050J161337J381397J535535J547694J374662J285017J440107
$$ plain form
689.4 530720770 532123506 532919586 532939970 532600403 532478034 533109128 534615099 536524355 538471103
707.7 538471103 540518343 542847276 545637250 548823357 551940739 555308282 559578001 564031541
724 564031541 568053246 571926653 575719059 579087436 581686080 583558440 585015118 586281955 587419212
742.4 587419212 588361382 588886082 588897526 588637352 588412344 588195145 587779641 587208211 586592078 586039841
762.8 586039841 586009681 587135017 589639187 593210161 597232401 601322949 605575621 610108733 614691079
781.2 614691079 618820965 622051299 624326587 626048148 627745152 629809856 632229149 634736538
797.5 634736538 637195110 639629781 642234743 645135760 648149133 650829434 652705073 653696060 654278636
815.8 654278636 654937923 655656815 655959010 655320764 653669238 651497364 649507761 648071766 646884978
$$ packed form
689.4E30720770J402736P96080K0384l39567j22369O31094J505971J909256J946748
707.7E38471103K047240K328933K789974L186107L117382L367543M269719M453540
724E64031541M021705L873407L792406L368377K598644J872360J456678J266837J137257
742.4E87419212R42170N24700J1444k60174k25008k17199m15504n71430o16133n52237
762.8E86039841l0160J125336K504170L570974M022240M090548M252672M533112M582346
781.2F14691079M129886L230334K275288J721561J697004K064704K419293K507389
797.5F34736538K458572K434671K604962K901017L013373K680301J875639R90987N82576
815.8F54278636O59287P18892L02195o38246j651526k171874j989603j435995j186788
$$ plain form
834.2 646884978 645282507 643027306 640483856 638219774 636662900 635776401 635053813 634075046 632920682
852.5 632920682 631969452 631546021 631865561 633204818 635876238 639782786 644464850 649707794 655324221
870.9 655324221 660599649 664553463 666606843 666795313 665483236 663105428 659920216 655967534 651374638
889.3 651374638 646528006 641943097 637945354 634404540 630843461 626716256 621718347 615999877
905.6 615999877 609950125 603821874 597600102 591212571 584877372 579138815 574625313 571702242
921.9 571702242 570109010 569134355 568220258 567245424 566433072 566018045 565922499 565820634 565349579 564096510
942.3 564096510 561567783 557361484 551385522 543892145 535233021 525712371 515716553 505661666
958.6 505661666 495778948 486053407 476312757 466447532 456643850 447361648 439095557 432096750
$$ packed form
834.2F46884978j602471k255201k543450k264082j556874q86499p22588r78767j154364
852.5F32920682r51230m23431L19540J339257K671420L906548M682064N242944N616427
870.9F55324221N275428L953814K053380J88470j312077k377808l185212l952682m592896
889.3F51374638m846632m584909l997743l540814l561079m127205m997909n718470
905.6F15999877o049752o128251o221772o387531o335199n738557m513502k923071
921.9E71702242j593232r74655r14097r74834q12352m15027r5546j01865m71055j253069
942.3E64096510k528727m206299n975962p493377q659124r520650r995818j0054887
958.6E05661666r882718r725541r740650r865225r803682r282202q266091o998807
$$ plain form
974.9 432096750 426272810 421408176 417363346 414071351 411479533 409490138 407894790 406425506
991.2 406425506 404906064 403412938 402274936 401800364 402003497 402508676 402726591 402223051 400963902
1009.6 400963902 399244696 397406369 395620584 393836409 391921192 389857769 387712032 385597765
1025.9 385597765 383609712 381646395 379534274 377214670 374785155 372454554 370312095 368229419
1042.2 368229419 366097838 363962322 362035811 360644042 360025585 360226780 361062139 362265557 363768369
1060.6 363768369 365716785 368139207 370614737 372242570 372264117 370977670 369614691 369362056 370725751
1078.9 370725751 373554975 377390385 381776720 386345804 390882671 395335078 399585873 403348148
1095.2 403348148 406328022 408449143 409917235 411139220 412554145 414402544 416593462 418928862
$$ packed form
974.9D32096750n823940m864634m044830l291995k591818j989395j595348j469284
991.2D06425506j519442j493126j138002m74572K03133N05179K17915n03540j259149
1009.6D00963902j719206j838327j785785j784175j915217k063423k145737k114267
1025.9C85597765j988053j963317k112121k319604k429515k330601k142459k082676
1042.2C68229419k131581k135516j926511j391769o18457K01195Q35359J203418J502812
1060.6C63768369J948416K422422K475530J627833K1547j286447j362979k52635J363695
1078.9C70725751K829224L835410M386335M569084M536867M452407M250795L762275
1095.2D03348148K979874K121121J468092J221985J414925J848399K190918K335400
$$ plain form
1111.6 418928862 421419948 424133986 426932186 429587990 431939542 433891833 435579270 437451839
1127.9 437451839 439943790 442996323 446044892 448483139 449994296 450608552 450641751 450456381 450208336
1146.2 450208336 449886203 449481457 449154794 449249417 450090468 451848716 454501599 457863122 461731583
1164.6 461731583 466030478 470844775 476286262 482318908 488757223 495370984 502032518 508723199
1180.9 508723199 515404463 521935821 528003633 533154786 537089407 539855123 541663826 542650878
1197.2 542650878 542870522 542404532 541407645 540213466 539264917 538813412 538734674 538676620 538372099 537768960
1217.6 537768960 536964655 536049545 534971178 533555865 531708717 529539585 527327657 525389373 523910940
1236 523910940 522877634 522207320 521913588 522114694 522967756 524511874 526562750 528813541 531022787
$$ packed form
1111.6D18928862K491086K714038K798200K655804K351552J952291J687437J872569
1127.9D37451839K491951L052533L048569K438247J511157O14256L3199j85370k48045
1146.2D50208336l22133m04746l26663R4623Q41051J758248K652883L361523L868461
1164.6D61731583M298895M814297N441487O032646O438315O613761O661534O690681
1180.9E08723199O681264O531358O067812N151153L934621K765716J808703R87052
1197.2E42650878K19644m65990r96887j194179r48549m51505p8738n8054l04521o03139
1217.6E37768960q04305r15110j078367j415313j847148k169132k211928j938284j478433
1236E23910940j033306o70314k93732K01106Q53062J544118K050876K250791K209246
$$ plain form
1254.3 531022787 533101022 535137594 537298143 539629638 542007923 544281006 546405196 548404574
1270.6 548404574 550312638 552066565 553530455 554627717 555447280 556234062 557214439 558445334 559745371
1289 559745371 560768664 561183751 560908079 560088038 558899522 557470202 555860519 554019511 551958621
1307.4 551958621 549931705 548255444 547136366 546582997 546464860 546622336 546863019 546940088 546609819
1325.7 546609819 545704067 544180691 542147338 539837658 537609518 535818815 534680843 534092963 533684373
1344.1 533684373 533127367 532298267 531233490 530006349 528623223 526987255 524989605 522506833 519492507
1362.4 519492507 516177237 512743890 509306371 506219864 503305614 500188172 496994466 493649781
1378.7 493649781 489926517 486018389 482463002 479776591 478330553 477789074 477422386 477013469 476753175
$$ packed form
1254.3E31022787K078235K036572K160549K331495K378285K273083K124190J999378
1270.6E48404574J908064J753927J463890J097262Q19563P86782R80377J230895J300037
1289E59745371J023293M15087k75672q20041j188516j429320j609683j841008k060890
1307.4E51958621k026916j676261j119078n53369j18137J57476K40683P7069l30269
1325.7E46609819r05752j523376k033353k309680k228140j790703j137972n87880m08590
1344.1E33684373n57006q29100j064777j227141j383126j635968j997650k482772l014326
1362.4E19492507l315270l433347l437519l086507k914250l117442l193706l344685
1378.7D93649781l723264l908128l555387k686411j446038n41479l66688m08917k60294
$$ plain form
1397.1 476753175 476754606 477181077 478064060 479422361 481138110 482875705 484540552 486185968 487844646
1415.5 487844646 489684284 492110848 494779855 497252584 499534547 501383960 502669692 503423095
1431.8 503423095 503516436 502939045 502430379 502555132 503006518 503545702 504082143 504603326 505068421 505298257
1452.2 505298257 505463839 506486058 509350002 512790084 515818298 518975317 522793114 527231812
1468.5 527231812 532855690 540861249 549968898 557835340 563979924 568452179 571419001 572791100
1484.8 572791100 572450280 570425510 567225873 563504517 558682919 552452087 546274543 540680468
1501.1 540680468 534840643 526751816 515469909 505867958 497964442 489857256 482304066 476460367
1517.4 476460367 472591758 469384998 466333240 463338584 460060418 456971407 453891695 450688750
$$ packed form
1397.1D76753175J431M26471Q82983J358301J715749J737595J664847J645416J658678
1415.5D87844646J839638K426564K669007K472729K281963J849413J285732P53403
1431.8E03423095R3341n77391n08666J24753M51386N39184N36441N21183M65095K29836
1452.2E05298257J65582J022219K863944L440082L028214L157019L817797M438698
1468.5E27231812N623878Q005559R107649P866442O144584M472255K966822J372099
1484.8E72791100l40820k024770l199637l721356m821598o230832o177544n594075
1501.1E40680468n839825q088827j1281907r601951p903516q107186p553190n843699
1517.4D76460367l868609l206760l051758k994656l278166l089011l079712l202945
$$ plain form
1533.7 450688750 448217303 446118116 443745822 442497909 442788750 443842560 445505947 447877884
1550.1 447877884 450917929 454319239 457627922 461743891 467592508 472369522 476036787 479353726
1566.4 479353726 482339740 485266358 487676501 489415050 491127282 492802143 493913054 494398057
1582.7 494398057 494475484 494236588 493649840 492495149 490662754 488132983 484987766 481203705 476619512
1601.1 476619512 471243024 465123624 458173305 450246930 441739023 433043987 423162073 411579847
1617.4 411579847 401187152 391049713 378955036 366859943 355655253 344928056 335495502
1631.6 335495502 326626867 317374945 310835749 307715595 306192219 305587620 305864453 307299227 309145033
1650 309145033 311391771 315342605 319842070 324228376 329391867 335949570 343606472 351074308 359179974
$$ packed form
1533.7D50688750k471447k099187k372294j247913K90841J053810J663387K371937
1550.1D47877884L040045L401310L308683M115969N848617M777014L667265L316939
1566.4D79353726K986014K926618K410143J738549J712232J674861J110911M85003
1582.7D94398057P7427k38896n86748j154691j832395k529771l145217l784061m584193
1601.1D76619512n376488o119400o950319p926375q507907q695036r881914j1582226
1617.4D11579847j0392695j0137439j2094677j2095093j1204690j0727197r432554
1631.6C35495502q868635r251922o539196l120154j523376o04599K76833J434774J845806
1650C09145033K246738L950834M499465M386306N163491O557703P656902P467836Q105666
$$ plain form
1668.4 359179974 368729472 377879739 387171686 397439092 407242417 416386932 426526934 439980358
1684.7 439980358 453393638 465323627 478312463 491830111 507620096 525617361 543111086
1699 543111086 561703324 577044308 589191437 600874543 610741854 618650913 625073493 630519152
1715.3 630519152 636087954 641617596 646068335 649606228 652628124 655031621 656932950 658417106
1731.6 658417106 660086036 662409604 664552748 666633785 669300258 672609508 676497340 681113303
1747.9 681113303 686851561 693494797 699702561 705506623 711310983 716814101 722356498 727540970
1764.2 727540970 731883883 735697806 739229679 743055284 747107387 750452161 753093958 755463719
1780.5 755463719 757754266 760000288 762150943 763929665 765270531 766786575 768611193 770290017
$$ packed form
1668.4C59179974R549498R150267R291947J0267406R803325R144515J0140002J3453424
1684.7D39980358J3413280J1929989J2988836J3517648J5789985J7997265J7493725
1699E43111086J8592238J5340984J2147129J1683106R867311P909059O422580N445659
1715.3F30519152N568802N529642M450739L537893L021896K403497J901329J484156
1731.6F58417106J668930K323568K143144K081037K666473L309250L887832M615963
1747.9F81113303N738258O643236O207764N804062N804360N503118N542397N184472
1764.2G27540970M342913L813923L531873L825605M052103L344774K641797K369761
1780.5G55463719K290547K246022K150655J778722J340866J516044J824618J678824
$$ plain form
1796.9 770290017 771785259 773357868 774945617 776304424 777486086 778641522 779916108 781270504
1813.2 781270504 782516122 783574462 784560382 785486162 786355734 787298501 788187981 788976967 789972186
1831.5 789972186 791062713 791987777 792850137 793588102 794004679 794354320 795115829 796057701 796868622
1849.9 796868622 797562122 798135757 798628211 799103916 799605429 800082088 800445497 800632179 800868869 801473439
1870.3 801473439 802218914 802806854 803291559 803778887 804236650 804637372 805006385 805345953 805680871 806145072
1890.7 806145072 806679964 807125628 807524920 807916224 808277786 808600664 808901727 809159398 809374630 809618294
1911.1 809618294 809854925 809984207 810118794 810418129 810697258 810891926 811161220 811460972 811704636 811902523
1931.5 811902523 812053144 812152326 812226236 812250674 812277555 812469363 812774599 812991202 813100994 813201010
$$ packed form
1796.9G70290017J495242J572609J587749J358807J181662J155436J274586J354396
1813.2G81270504J245618J058340R85920R25780Q69572R42767Q89480P88986R95219
1831.5G89972186J090527R25064Q62360P37965M16577L49641P61509R41872Q10921
1849.9G96868622O93500N73635M92454M75705N01513M76659L63409J86682K36690O04570
1870.3H01473439P45475N87940M84705M87328M57763M00722L69013L39568L34918M64201
1890.7H06145072N34892M45664L99292L91304L61562L22878L01063K57671K15232K43664
1911.1H09618294K36631J29282J34587K99335K79129J94668K69294K99752K43664J97887
1931.5H11902523J50621R9182P3910K4438K6881J91808L05236K16603J09792J00016
$$ plain form
1951.9 813201010 813341498 813541889 813768148 813962400 814085186 814130366 814170778 814296842 814467311 814618409
1972.3 814618409 814753830 814851344 814929307 815032065 815171003 815292656 815344214 815311611 815218866 815192938 815298975
1994.7 815298975 815454006 815572083 815593004 815525055 815433025 815333903 815255463 815202951 815106273 814908803 814673960
2017.1 814673960 814487875 814318061 814155936 813993692 813774824 813496411 813238382 813033104 812854350 812677264
2037.5 812677264 812478483 812268496 812059462 811866343 811727345 811667085 811633527 811580718 811522245 811487317
2057.9 811487317 811497033 811553359 811619699 811650932 811674058 811709046 811754107 811798871 811841130 811905861 811989546 812059283
2082.4 812059283 812118649 812183201 812262952 812387586 812504828 812559485 812591851 812662601 812798738 812979043 813139677
2104.8 813139677 813241065 813302696 813343763 813409150 813549757 813720465 813821375 813855827 813876212 813894808 813962162
$$ packed form
1951.9H13201010J40488K00391K26259J94252J22786M5180M0412J26064J70469J51098
1972.3H14618409J35421R7514P7963J02758J38938J21653N1558l2603r2745k5928J06037
1994.7H15298975J55031J18077K0921o7949r2030r9122p8440n2512r6678j97470k34843
2017.1H14673960j86085j69814j62125j62244k18868k78413k58029k05278j78754j77086
2037.5H12677264j98781k09987k09034j93119j38998o0260l3558n2809n8473l4928
2057.9H11487317R716N6326O6340L1233K3126L4988M5061M4764M2259O4731Q3685O9737
2082.4H12059283N9366O4552P9751J24634J17242N4657L2366P0750J36137J80305J60634
2104.8H13139677J01388O1631M1067O5387J40607J70708J00910L4452K0385J8596O7354
$$ plain form
2127.3 813962162 814107955 814238727 814281225 814295411 814357102 814486086 814644516 814784110 814886153 814952374
2147.7 814952374 815005600 815099180 815270960 815482080 815678537 815851212 816018999 816200674 816438079 816756010
2168 816756010 817131460 817511082 817842305 818142474 818462074 818818569 819184482 819533527 819853485 820138931
2188.4 820138931 820405006 820679903 821003616 821377277 821727395 821982145 822189033 822453976 822791159 823150873
2208.8 823150873 823514879 823841691 824077427 824273169 824526668 824845314 825149715 825386226 825558007 825684488
2229.2 825684488 825810075 825999796 826231003 826402664 826475322 826455891 826413393 826457143 826579571 826655567
2249.6 826655567 826587498 826366365 826108038 825995743 826007307 825983584 825882614 825744569 825621128 825606823
2270 825606823 825746179 825971365 826244593 826552451 826886058 827116072 826918960 826144874 825005352 823725641
$$ packed form
2127.3H13962162J45793J30772M2498J4186O1691J28984J58430J39594J02043O6221
2147.7H14952374N3226R3580J71780K11120J96457J72675J67787J81675K37405L17931
2168H16756010L75450L79622L31223L00169L19600L56495L65913L49045L19958K85446
2188.4H20138931K66075K74897L23713L73661L50118K54750K06888K64943L37183L59714
2208.8H23150873L64006L26812K35736J95742K53499L18646L04401K36511J71781J26481
2229.2H25684488J25587J89721K31207J71661P2658j9431m2498M3750J22428P5996
2249.6H26655567o8069k21133k58327j12295J1564k3723j00970j38045j23441j4305
2270H25606823J39356K25186K73228L07858L33607K30014j97112p74086j139522j279711
$$ plain form
2290.4 823725641 822339773 820845723 819268167 817590415 815761387 813620090 810823560 807256818
2306.7 807256818 803311765 799601614 796539843 793658316 789572001 783704996 777437925 772544384
2323.1 772544384 768991590 765414238 761529446 758548975 756836414 755173683 753079236 751093924
2339.4 751093924 750127912 752492070 760510385 768985629 769504189 760505259 746876419 734714031
2355.7 734714031 726490676 722871840 723559618 727869213 735164285 744519353 755020916 765880227
2372 765880227 776382327 786290109 795682669 804390550 811721206 816978574 820057631 821479738
2388.3 821479738 821982145 822068274 821921825 821603894 821195543 820798934 820469558 820171118 819839239 819428205
2408.7 819428205 818946064 818443894 817997694 817618430 817229509 816778123 816248238 815667152 815087497 814572513
$$ packed form
2290.4H23725641j385868j494050j577556j677752j829028k141297k796530l566742
2306.7H07256818l945053l710151l061771k881527m086315n867005o267071m893541
2323.1G72544384l552794l577352l884792k980471j712561j662731k094447j985312
2339.4G51093924r66012K364158Q018315Q475244N18560q998930j3628840j2162388
2355.7G34714031q223355l618836O87778M309595P295072R355068J0501563J0859311
2372G65880227J0502100R907782R392560Q707881P330656N257368L079057J422107
2388.3H21479738N02407Q6129j46449l17931m08351l96609l29376k98440l31879m11034
2408.7H19428205m82141n02170m46200l79264l88921m51386n29885n81086n79655n14984
$$ plain form
2429.1 814572513 814116418 813617170 813039660 812418699 811788797 811221480 810733497 810253143 809724927 809126675
2449.5 809126675 808479786 807851434 807293117 806775391 806235909 805653214 805074990 804539144 804006517 803463936
2469.9 803463936 802930295 802403867 801838756 801211059 800600648 800077140 799598575 799093544 798560381 798001707
2490.3 798001707 797410786 796849906 796381176 795977294 795557976 795061707 794509411 793963611 793461502 793020070
2510.7 793020070 792599916 792107642 791512549 790913045 790408671 789987862 789569139 789062977 788443744 787770391
2531.1 787770391 787136495 786578238 786043108 785468936 784827769 784131229 783458292 782892227 782411933 781914055
2551.5 781914055 781317770 780618191 779913366 779336095 778882563 778404117 777815580 777173400 776545107 775968671
2571.9 775968671 775465250 774975061 774405003 773746729 773094893 772514105 771966994 771431386 770896375 770321190
$$ packed form
2429.1H14572513m56095m99248n77510o20961o29902n67317m87983m80354n28216n98252
2449.5H09126675o46889o28352n58317n17726n39482n82695n78224n35846n32627n42581
2469.9H03463936n33641n26428n65111o27697o10411n23508m78565n05031n33163n58674
2490.3G98001707n90921n60880m68730m03882m19318m96269n52296n45800n02109m41432
2510.7G93020070m20154m92274n95093n99504n04374m20809m18723n06162o19233o73353
2531.1G87770391o33896n58257n35130n74172o41167o96540o72937n66065m80294m97878
2551.5G81914055n96285o99579p04825n77271m53532m78446n88537o42180o28293n76436
2571.9G75968671n03421m90189n70058o58274o51836n80788n47111n35608n35011n75185
$$ plain form
2592.3 770321190 769711196 769115388 768562257 768018126 767415464 766751707 766048253 765301466 764539242 763760149
2612.7 763760149 762944698 762109160 761253178 760378301 759477317 758525252 757513344 756465554 755440056
2631 755440056 754446328 753428817 752371490 751316071 750277936 749231577 748190999 747156560 746068239
2649.4 746068239 744939327 743863940 742840111 741794765 740730882 739683509 738636494 737569928
2665.7 737569928 736530602 735563636 734643698 733712673 732754409 731778920 730815649 729924679 729065299
2684.1 729065299 728154659 727197707 726235092 725309610 724417806 723493338 722505152 721493900 720473230
2702.4 720473230 719420969 718356192 717295527 716207027 715086937 713953972 712812006 711676359
2718.7 711676359 710562110 709477007 708424270 707407057 706401706 705380857 704370439 703403294
$$ packed form
2592.3G70321190o09994n95808n53131n44131o02662o63757p03454p46787p62224p79093
2612.7G63760149q15451q35538q55982q74877r00984r52065j011908j047790j025498
2631G55440056r93728j017511j057327j055419j038135j046359j040578j034439j088321
2649.4G46068239j128912j075387j023829j045346j063883j047373j047015j066566
2665.7G37569928j039326r66966r19938r31025r58264r75489r63271q90970q59380
2684.1G29065299r10640r56952r62615r25482q91804r24468r88186j011252j020670
2702.4G20473230j052261j064777j060665j088500j120090j132965j141966j135647
2718.7G11676359j114249j085103j052737j017213j005351j020849j010418r67145
$$ plain form
2735 703403294 702475190 701558232 700639367 699731529 698816359 697881401 696970522 696081460 695169747 694263995
2755.4 694263995 693378508 692446768 691487908 690596402 689743221 688808739 687771201 686722577 685688734
2773.8 685688734 684624255 683555007 682484269 681325257 680049598 678736150 677463114 676207185
2790.1 676207185 674868226 673412621 671902299 670374572 668819189 667256534 665675521 663983107
2806.4 663983107 662178278 660363138 658551276 656715751 654841661 652861059 650747657 648543000
2822.7 648543000 646280468 643988848 641642153 639120519 636324883 633276939 630032301 626458824
2839.1 626458824 622244835 617120385 610913336 603830993 596788704 590910494 586750805 584173083
2855.4 584173083 582636893 581425786 579892099 577679217 574705124 571090102 567208946 563555658
$$ packed form
2735G03403294r28104r16958r18865r07838r15170r34958r10879q89062r11713r05752
2755.4F94263995q85487r31740r58860q91506q53181r34482j037538j048624j033843
2773.8F85688734j064479j069248j070738j159012j275659j313448j273036j255929
2790.1F76207185j338959j455605j510322j527727j555383j562655j581013j692414
2806.4F63983107j804829j815140j811862j835525j874090j980602k113402k204657
2822.7F48543000k262532k291620k346695k521634k795636l047944l244638l573477
2839.1F26458824m213989n124450o207049p082343p042289n878210m159689k577722
2855.4E84173083j536190j211107j533687k212882k974093l615022l881156l653288
$$ plain form
2871.7 563555658 560447216 558014750 556266427 555018842 553984344 552924931 551705599 550331473
2888 550331473 548866332 547287643 545504391 543443322 541091859 538505018 535732806 532705724 529256523
2906.4 529256523 525234997 520499289 514920950 508636713 502187550 496212482 491133451 487170130
2922.7 487170130 484427601 482932478 482669830 483559281 485504985 488451302 492302567 496842623 501682580
2941 501682580 506344974 510438919 513711631 516073525 517625570 518590033 519334912 520325899 521908820
2959.4 521908820 524264216 527431309 531363904 535960495 541036665 546396494 551866770 557287872
2975.7 557287872 562526822 567458630 571955323 575951993 579474807 582556903 585189760 587334216
2992 587334216 588921487 589917004 590330124 590174973 589538455 588547409 587297201 585900486 584503174
$$ packed form
2871.7E63555658l108442k432466j748323j247585j034498j059413j219332j374126
2888E50331473j465141j578689j783252k061069k351463k586841k772212l027082l449201
2906.4E29256523m021526m735708n578339o284237o449163n975068n079031l963321
2922.7D87170130k742529j495123k62648Q89451J945704K946317L851265M540056M839957
2941E01682580M662394M093945L272712K361894J552045R64463P44879R90987J582921
2959.4E21908820K355396L167093L932595M596591N076170N359829N470276N421102
2975.7E57287872N238950M931808M496693L996670L522814L082096K632857K144456
2992E87334216J587271R95517M13120j55151o36518r91046j250208j396715j397312
$$ plain form
3010.4 584503174 583205521 582020044 580870509 579623520 578154266 576398492 574426055 572387159
3026.7 572387159 570353448 568287015 566151261 563926697 561616361 559308469 557029247 554667771
3043 554667771 552156508 549545169 546920478 544370651 541893601 539390445 536833465 534290016 531851590
3061.4 531851590 529604733 527578175 525706828 523870409 522029102 520260274 518630087 517140985
3077.7 517140985 515692174 514168024 512615860 511159122 509862065 508696914 507550776 506342530
3094 506342530 505095541 503826380 502517104 501198292 499890417 498544633 497111559 495583951 493999690
3112.4 493999690 492410511 490811378 489155054 487392455 485491604 483530611 481618673 479733229
3128.7 479733229 477797180 475770831 473662347 471517384 469367236 467194527 464995056 462780088
$$ packed form
3010.4E84503174j297653j185477j149535j246989j469254j755774j972437k038896
3026.7E72387159k033711k066433k135754k224564k310336k307892k279222k361476
3043E54667771k511263k611339k624691k549827k477050k503156k556980k543449k438426
3061.4E31851590k246857k026558j871347j836419j841307j768828j630187j489102
3077.7E17140985j448811j524150j552164j456738j297057j165151j146138j208246
3094E06342530j246989j269161j309276j318812j307875j345784j433074j527608j584261
3112.4D93999690j589179j599133j656324j762599j900851j960993j911938j885444
3128.7D79733229j936049k026349k108484k144963k150148k172709k199471k214968
$$ plain form
3145 462780088 460532188 458272338 456025660 453747749 451410145 449042261 446652502 444252908 441849321
3163.4 441849321 439415962 436984062 434596986 432237685 429860383 427438557 424996495 422570795
3179.7 422570795 420167327 417792380 415446579 413087606 410700738 408349872 406066835 403833747
3196 403833747 401641041 399473429 397323310 395178944 393061608 391013265 389024973 387065023 385131210
3214.3 385131210 383211493 381258607 379281759 377316177 375356883 373391837 371421576 369449884
3230.7 369449884 367490858 365490735 363347799 361116439 358897358 356665671 354403973 352114618
3247 352114618 349768192 347382873 344972491 342531890 340080649 337643683 335237205 332884282 330614507
3265.3 330614507 328389198 326205343 324147075 322245985 320485711 318856329 317360878 316004664
$$ packed form
3145D62780088k247900k259850k246678k277911k337604k367884k389759k399594k403587
3163.4D41849321k433359k431900k387076k359301k377302k421826k442062k425700
3179.7D22570795k403468k374947k345801k358973k386868k350866k283037k233088
3196D03833747k192706k167612k150119k144366k117336k048343j988292j959950j933813
3214.3C85131210j919717j952886j976848j965582j959294j965046j970261j971692
3230.7C69449884j959026k000123k142936k231360k219081k231687k261698k289355
3247C52114618k346426k385319k410382k440601k451241k436966k406478k352923k269775
3265.3C30614507k225309k183855k058268j901090j760274j629382j495451j356214
$$ plain form
3281.6 316004664 314774334 313693285 312762856 311912298 311147064 310484946 309877008 309337616 308898270
3300 308898270 308526129 308217883 307961613 307678461 307374209 307112515 306878865 306660026 306471527 306279659
3320.4 306279659 306029439 305728912 305417001 305095255 304763347 304425538 304075569 303701729 303287268 302808076
3340.8 302808076 302251011 301629603 301009178 300449580 299866915 299169958 298439264 297781497 297161132 296495736
3361.2 296495736 295795411 295169622 294633031 293996096 293165326 292327732 291641742 291048318 290503323 289991021
3381.6 289991021 289499968 289078087 288781583 288590789 288313091 287867218 287479609 287338018 287333935 287174940
3402 287174940 286799699 286519229 286463410 286492527 286541730 286583811 286625087 286754251 286994845 287290722 287690103
3424.4 287690103 288260162 288987070 289801091 290692776 291662097 292523146 293177634 293815941 294637889 295682788
$$ packed form
3281.6C16004664j230330j081049r30429q50558p65234o62118o07938n39392m39346
3300C08898270l72141l08246k56270k83152l04252k61694k33650k18839j88499j91868
3320.4C06279659k50220l00527l11911l21746l31908l37809l49969l73840m14461m79192
3340.8C02808076n57065o21408o20425n59598n82665o96957p30694o57767o20365o65396
3361.2B96495736p00325o25789n36591o36935q30770q37594o85990n93424n44995n12302
3381.6B89991021m91053m21881k96504j90794k77698m45873l87609j41591m083j58995
3402B87174940l75241k80470n5819K9117M9203M2081M1276J29164K40594K95877L99381
3424.4B87690103N70059P26908Q14021Q91685R69321Q61049O54488O38307Q21948J044899
$$ plain form
3444.8 295682788 296864539 298075378 299303919 300567806 301936716 303457111 305037886 306578279
3461.1 306578279 308154523 309937894 311890244 313702285 315174371 316585004 318268239 320272207
3477.4 320272207 322381169 324316472 326180875 328212082 330290765 332319111 334443271 336678296
3493.8 336678296 338924617 341094017 343255609 345497549 347703904 349845678 352042675 354336888
3510.1 354336888 356749088 359225422 361645490 364042968 366511762 369122505 371729463 374177992
3526.4 374177992 376652360 379348546 382218271 385152638 388041466 390845239 393780023 396932572
3542.7 396932572 400091082 403089017 406074345 409210294 412457585 415744066 419067681 422475725
3559 422475725 425920427 429264963 432551742 436254114 440447420 444526225 448363751 452281326 456374943
$$ packed form
3444.8B95682788J181751J210839J228541J263887J368910J520395J580775J540393
3461.1C06578279J576244J783371J952350J812041J472086J410633J683235K003968
3477.4C20272207K108962J935303J864403K031207K078683K028346K124160K235025
3493.8C36678296K246321K169400K161592K241940K206355K141774K196997K294213
3510.1C54336888K412200K476334K420068K397478K468794K610743K606958K448529
3526.4C74177992K474368K696186K869725K934367K888828K803773K934784L152549
3542.7C96932572L158510K997935K985328L135949L247291L286481L323615L408044
3559D22475725L444702L344536L286779L702372M193306M078805L837526L917575M093617
$$ plain form
3577.4 456374943 460555553 464765728 468903780 472890824 476928532 481264383 485621095 489913344
3593.7 489913344 494376481 499029130 503766835 508567095 513305664 517860472 522573233 527637482
3610 527637482 532631040 537298679 541611969 545864642 550574780 555344105 559622109 563454986 567645907
3628.4 567645907 573011398 578491688 583527923 588357449 593029201 597586989 601953924 605901539
3644.7 605901539 609432101 613256335 617890239 622376204 626235008 630194604 634343386 638056457
3661 638056457 641340435 644391894 647045195 649486244 652332008 654999197 657285631 660235584 663448095
3679.4 663448095 666231334 668656826 670747042 672443092 673906624 675708294 677867889 679859579
3695.7 679859579 681441784 682725906 684033573 685671747 687373817 688802361 690208197 692131996
$$ packed form
3577.4D56374943M180610M210175M138052L987044M037708M335851M356712M292249
3593.7D89913344M463137M652649M737705M800260M738569M554808M712761N064249
3610E27637482M993558M667639M313290M252673M710138M769325M278004L832877M190921
3628.4E67645907N365491N480290N036235M829526M671752M557788M366935L947615
3644.7F05901539L530562L824234M633904M485965L858804L959596M148782L713071
3661F38056457L283978L051459K653301K441049K845764K667189K286434K949953L212511
3679.4F63448095K783239K425492K090216J696050J463532J801670K159595J991690
3695.7F79859579J582205J284122J307667J638174J702070J428544J405836J923799
$$ plain form
3712 692131996 694421947 696063101 696680844 696769655 696907580 697280228 697948217 699050844 700259507
3730.3 700259507 701230347 702334642 704137802 706298411 707970500 708746135 709353447 710692823 711766005
3748.7 711766005 712360322 713639557 715343595 716610074 717469931 718416750 719384372 720044196 720572233
3767.1 720572233 721207857 722085178 723116159 723977387 724587440 725117266 725757122 726383507 726938725
3785.4 726938725 727593601 728355527 729081273 729519367 729665399 729891479 730062723 730275929 731103122 731920063
3805.8 731920063 732615292 733567894 734293759 734389246 734267712 734549284 734802127 735239029 736181498 736935019
3826.2 736935019 737457812 737868488 738142967 738435686 738535762 738527477 739033878 739920318 740790486 741461337
3846.6 741461337 741723537 741317153 740415215 740637839 742093027 743171930 743508339 743516326 743736207 744054317
$$ packed form
3712F92131996K289951J641154O17743Q8811J37925L72648O67989J102627J208663
3730.3G00259507R70840J104295J803160K160609J672089P75635O07312J339376J073182
3748.7G11766005N94317J279235J704038J266479Q59857R46819R67622O59824N28037
3767.1G20572233O35624Q77321J030981Q61228O10053N29826O39856O26385N55218
3785.4G26938725O54876P61926P25746M38094J46032K26080J71244K13206Q27193Q16941
3805.8G31920063O95229R52602P25865R5487j21534K81572K52843M36902R42469P53521
3826.2G36935019N22793M10676K74479K92719J00076q285N06401Q86440Q70168O70851
3846.6G41461337K62200m06384r01938K22624J455188J078903L36409P987K19881L18110
$$ plain form
3867 744054317 744027257 744150043 744721770 745388329 745950937 746165097 746350288 746682584 746886373 747219265
3887.4 747219265 747502565 747586906 748022258 748553276 748526931 748165190 748015940 748223066 748847663 749671221
3907.8 749671221 750257671 750518918 750584543 750511467 750483751 750701666 750950336 751050532 751219451 751452386
3928.2 751452386 751529038 751596510 751890421 752280176 752523601 752552330 752535582 752698839 752941966 753093898
3948.6 753093898 753258348 753496885 753720284 753865540 753950655 754051685 754199147 754360437 754512250 754639566
3969 754639566 754761279 754907906 755038321 755128503 755237341 755435705 755695462 755860090 755882919 755919755
3989.4 755919755 756070554 756264091 756433487 756589234
3997.5 756589234
$$ packed form
3867G44054317k7060J22786N71727O66559N62608K14160J85191L32296K03789L32892
3887.4G47219265K83300Q4341M35352N31018k6345l61741j49250K07126O24597Q23558
3907.8G49671221N86450K61247O5625p3076k7716K17915K48670J00196J68919K32935
3928.2G51452386P6652O7472K93911L89755K43425K8729j6748J63257K43127J51932
3948.6G53093898J64450K38537K23399J45256Q5115J01030J47462J61290J51813J27316
3969G54639566J21713J46627J30415R0182J08838J98364K59757J64628K2829L6836
3989.4G55919755J50799J93537J69396J55747
3997.5G56589234
##END=$$ End of the data block
