##TITLE=623-52-SE $$ Begin of the data block
##JCAMP-DX=5.00 $$ ACD/SpecManager v 10.08
##SPECTROMETER/DATA SYSTEM=Alpha
##DATE=21 Oct 2013 11:04:12
##DATA TYPE=INFRARED SPECTRUM
##DATA CLASS=XYDATA
##ORIGIN=
##OWNER=
##NPOINTS=1765
##FIRSTX=399.75695801
##LASTX=3997.56933594
##MAXX=3997.56933594
##MINX=399.75695801
##MAXY=0.82874316
##MINY=0.28588757
##XFACTOR=1.0000000000
##YFACTOR=1.000000000000000e-9
##FIRSTY=0.55906582
##DELTAX=2.03957629
##XUNITS=1/CM
##YUNITS=ARBITRARY UNITS
##XYDATA=(X++(Y..Y))
399.8E59065819k859533k228916j015007J84417O72578N33998p8022p61330j141608
418.1E52372396r75251p19667q45194j110911j647413k060592j613557q41439n18322
436.5E42040050r1195N70118J096487J601041J481652N95629l80635j233757j672089
454.8E44007301j591265j267075j340509k096295k603710k344370j752674j418531
471.1E29592872j601637j939118j912713j323044o19233l17275m14252q40128j482248
489.5E19143224j881123j691878j310944j271010j734614k428830k752959k670348
505.8E03401518k513826k186418j990795k399921k875686k665520j908063j206756
522.1D85654533p89523n23448l92348k06500L89248J288533K106160K421171K096086
$$ y = [559065819, 556206286, 553977370, 552962363, 553146780, 553819358, 554353356, 554275334, 553514004, 552372396, 551397145, 550677478, 549832284, 548721373, 547073960, 545013368, 543399811, 542558372, 542040050, 541948855, 542518973, 543615460, 545216501, 546698153, 547293782, 546913147, 545679390, 544007301, 542416036, 541148961, 539808452, 537712157, 535108447, 532764077, 531011403, 529592872, 527991235, 526052117, 524139404, 522816360, 522197127, 521879852, 521465600, 520625472, 519143224, 517262101, 515570223, 514259279, 512988269, 511253655, 508824825, 506071866, 503401518, 500887692, 498701274, 496710479, 494310558, 491434872, 488769352, 486861289, 485654533, 484865010, 484341562, 483949214, 483742714, 484131962, 485420495, 487526655, 489947826, 492043912]
540.5D92043912J357884M75108K7210J06722k24799j188666j847922j754076j356601
558.8D87638772j134843j253218j748502k404541k522498j753777m79132O81996J168251
577.2D78192508J244962J684159K420903K837717K718002K059132J062393K00450p2926
595.6D92347300J48028L96788M15325J35988k12639k06828K02834N39989M47511J14084
616D94328380L35753J216501J947492K465844K749860K594173K154291J657248J365900
634.3E10815442J413405J523137J435816J109183N70655J01447J90437P02023P55489
652.7E18617034L26693K2471J57654O99878J045048m07398l629684j547694M127264
671E19411266L305554J583994J455426J562953J411676J218498J123667J182794J267016
$$ y = [492043912, 493401796, 493876904, 493904114, 494010836, 493786037, 492597371, 490749449, 488995373, 487638772, 486503929, 485250711, 483502209, 481097668, 478575170, 476821393, 476342261, 477024257, 478192508, 479437470, 481121629, 483542532, 486380249, 489098251, 491157383, 492219776, 492420226, 492347300, 492495328, 492892116, 493307441, 493443429, 493230790, 493023962, 493226796, 493766785, 494214296, 494328380, 494664133, 495880634, 497828126, 500293970, 503043830, 505638003, 507792294, 509449542, 510815442, 512228847, 513751984, 515187800, 516296983, 516867638, 516969085, 517159522, 517861545, 518617034, 518943727, 518966198, 519123852, 519823730, 520868778, 520461380, 516831696, 515284002, 519411266, 522716820, 524300814, 525756240, 527319193, 528730869, 529949367, 531073034, 532255828, 533522844]
689.4E33522844J096785N21362k33412o45697l35276N27203J333058J730800J878023
707.7E39395690J971662K233148K725184L153383L256560L449619M018068M290223
724E64493537M151523L949165L702820L323853K624273J840830J435339J349748J239597
742.4E88110685R26793M13477p8737l26932l13818k80202l84509n35071o70254o03199
762.8E86258233Q642J197934K521396L517211L992915M146099M325688M581749M598439
781.2F15148306M122019L193199K214909J741886J796007K156079K472401K474308
797.5F35319114K348602K356648K612054K999306L114998K649546J811564R95934N93662
815.8F54801428O77407P42734K62320p05600j704693k229393j998603j430154j253307
$$ y = [533522844, 534619629, 535140991, 534907579, 534261882, 533926606, 534453809, 535786867, 537517667, 539395690, 541367352, 543600500, 546325684, 549479067, 552735627, 556185246, 560203314, 564493537, 568645060, 572594225, 576297045, 579620898, 582245171, 584086001, 585521340, 586871088, 588110685, 589037478, 589450955, 589372218, 589045286, 588731468, 588451266, 588066757, 587531686, 586861432, 586258233, 586266875, 587464809, 589986205, 593503416, 597496331, 601642430, 605968118, 610549867, 615148306, 619270325, 622463524, 624678433, 626420319, 628216326, 630372405, 632844806, 635319114, 637667716, 640024364, 642636418, 645635724, 648750722, 651400268, 653211832, 654207766, 654801428, 655478835, 656221569, 656483889, 655778289, 654073596, 651844203, 649845600, 648415446, 647162139]
834.2F47162139j719653k330244k521455k181530j536429j002252p96676q88943j019478
852.5F33165479q58367m06325K45393J254439K634466L913939M737615N298138N591750
870.9F55576527N180001L897727K023578J21474j355052k393663l194094l941059m597366
889.3F51318073m876256m601419l980338l489554l538549m184663n074740n745411
905.6F15827143o028294o099344o217241o411195o357074n726397m478216k904296
921.9E71605086j598417r72689r24646j017869q27968l60131j9193q4341n09202j263499
942.3E64027131k484382m145145n940378p531106q740545r568512j0027409j0088563
958.6E05501091r831607r621143r739995r964287r872020r265661q227170p006198
$$ y = [647162139, 645442486, 643112242, 640590787, 638409257, 636872828, 635870576, 635073900, 634184957, 633165479, 632307112, 631900787, 632146180, 633400619, 636035085, 639949024, 644686639, 649984777, 655576527, 660756528, 664654255, 666677833, 666799307, 665444255, 663050592, 659856498, 655915439, 651318073, 646441817, 641840398, 637860060, 634370506, 630831957, 626647294, 621572554, 615827143, 609798849, 603699505, 597482264, 591071069, 584713995, 578987598, 574509382, 571605086, 570006669, 569033980, 568109334, 567091465, 566263497, 565903366, 565884173, 565799832, 565290630, 564027131, 561542749, 557397604, 551457226, 543926120, 535185575, 525617063, 515589654, 505501091, 495669484, 486048341, 476308346, 466344059, 456472039, 447206378, 438979208, 431973010]
974.9D31973010n842864m848272m016608l237754k487063j915545j634627j562119
991.2D06428158j541167j448363j119823m98712J81437N00679K18749m96000j241207
1009.6D00983751j702517j827807j796573j834571j972914k082825k087861k030075
1025.9C85648608k000570k020359k097637k277761k424449k363235k178132k068878
1042.2C68217587k097219k106100j890212j376123o06328K13325P99090J146078J488984
1060.6C63789082J955360K421677K480149J640707N4837j261026j356512k35379J337051
1078.9C70825946K753467L795683M375786M570990M575521M497797M259198L742010
1095.2D03396398K980560K150774J496345J244366J423418J822025K168268K367943
$$ y = [431973010, 426130146, 421281874, 417265266, 414027512, 411540449, 409624904, 407990277, 406428158, 404886991, 403438628, 402318805, 401820093, 402001530, 402502209, 402720958, 402224958, 400983751, 399281234, 397453427, 395656854, 393822283, 391849369, 389766544, 387678683, 385648608, 383648038, 381627679, 379530042, 377252281, 374827832, 372464597, 370286465, 368217587, 366120368, 364014268, 362124056, 360747933, 360141605, 360354930, 361154020, 362300098, 363789082, 365744442, 368166119, 370646268, 372286975, 372341812, 371080786, 369724274, 369488895, 370825946, 373579413, 377375096, 381750882, 386321872, 390897393, 395395190, 399654388, 403396398, 406376958, 408527732, 410024077, 411268443, 412691861, 414513886, 416682154, 419050097]
1111.6D19050097K517641K694130K807468K688140K327174J916468J702636J885653
1127.9D37589407K475738L047586L075182K475053J516253O04540M8757j66446k52694
1146.2D50413376l51220m25428l21776R0659Q28653J750887K633094L330440L865063
1164.6D61813748M340798M838973N402267N986392O432236O588876O581843O655574
1180.9E08640707O726861O546318O015360N098284L923833K775490J815677R99034
1197.2E42541564K31742m58777r86576j183450r39309m39883n8651l5405l00288o15180
1217.6E37755787q04901q79407j030504j415372j886189k194166k218664j950860j470983
1236E23904741r75192o04689k77758J81973Q46506J539588K042472K250135K205908
$$ y = [419050097, 421567738, 424261868, 427069336, 429757476, 432084650, 434001118, 435703754, 437589407, 440065145, 443112731, 446187913, 448662966, 450179219, 450783759, 450832516, 450666070, 450413376, 450062156, 449636728, 449314952, 449405611, 450234264, 451985151, 454618245, 457948685, 461813748, 466154546, 470993519, 476395786, 482382178, 488814414, 495403290, 501985133, 508640707, 515367568, 521913886, 527929246, 533027530, 536951363, 539726853, 541542530, 542541564, 542773306, 542314529, 541327953, 540144503, 539205194, 538765311, 538706660, 538671255, 538370967, 537755787, 536950886, 536071479, 535040975, 533625603, 531739414, 529545248, 527326584, 525375724, 523904741, 522929549, 522324860, 522047102, 522229075, 523075581, 524615169, 526657641, 528907776, 531113684]
1254.3E31113684K076268K033830K146483K304732K366424K282441K119541J999855
1270.6E48443258J927435J755417J448512J095473Q33095Q02397R96948J245260J302659
1289E59850454J025319M39406k55644q26061j179517j396238j579047j819729k069533
1307.4E52189410k056122j689792j129865n56589j09791J45793K25842Q7201l05116
1325.7E46800971q95262j545310k058625k297819k208650j808762j156509n90563m32968
1344.1E33806503n92590q34941j036883j207590j404583j667619k004743k480149l018975
1362.4E19558430l323376l435791l450036l096581k881884l093660l228486l383040
1378.7D93665576l725618l906638l577947k693951j414031m98444l33637m10289k84016
$$ y = [531113684, 533189952, 535223782, 537370265, 539674997, 542041421, 544323862, 546443403, 548443258, 550370693, 552126110, 553574622, 554670095, 555503190, 556305587, 557302535, 558547795, 559850454, 560875773, 561315179, 561059535, 560233474, 559053957, 557657719, 556078672, 554258943, 552189410, 550133288, 548443496, 547313631, 546757042, 546647251, 546793044, 547018886, 547106087, 546800971, 545905709, 544360399, 542301774, 540003955, 537795305, 535986543, 534830034, 534239471, 533806503, 533213913, 532378972, 531342089, 530134499, 528729916, 527062297, 525057554, 522577405, 519558430, 516235054, 512799263, 509349227, 506252646, 503370762, 500277102, 497048616, 493665576, 489939958, 486033320, 482455373, 479761422, 478347391, 477848947, 477515310, 477105021, 476821005]
1397.1D76821005m083M59522R39131J362920J677245J752794J711100J653552J658738
1415.5D88031924J855045K422452K661109K470076K253205J807213J259982P63119
1431.8E03524125J28269n74768n58495P3373M12405N21004N52416N61714M88996K27869
1452.2E05356908J76549J025617K825558L422439L031492L129483L779292M431367
1468.5E27178705N605936P976055R104133P835328O104231M474878K979696J369834
1484.8E72628796l50654k060592l275156l775537m819334o208718o170153n589366
1501.1E40379286n824328q078754j1269748r562611p869035q073926p525862n854994
1517.4D76320028l894239l180504k946913k887786l244996l088683l038883l121793
$$ y = [476821005, 476816922, 477276444, 478215575, 479578495, 481255740, 483008534, 484719634, 486373186, 488031924, 489886969, 492309421, 494970530, 497440606, 499693811, 501501024, 502761006, 503524125, 503652394, 503077626, 502519131, 502592504, 503004909, 503525913, 504078329, 504640043, 505129039, 505356908, 505533457, 506559074, 509384632, 512807071, 515838563, 518968046, 522747338, 527178705, 532784641, 540760696, 549864829, 557700157, 563804388, 568279266, 571258962, 572628796, 572278142, 570217550, 566942394, 563166857, 558347523, 552138805, 545968652, 540379286, 534554958, 526476204, 515206456, 505643845, 497774810, 489700884, 482175022, 476320028, 472425789, 469245285, 466298372, 463410586, 460165590, 457076907, 454038024, 450916231]
1533.7D50916231k377391k007634k336740j284540K77400J065016J656473K356827
1550.1D48265642L049910L425062L336221M123032N788415M724026L638685L290892
1566.4D79641885K964466K921760K428472J772225J747251J676917J061499M00543
1582.7D94615018K3842k35677n84870j157671j808763k507269l153563l816426m611432
1601.1D76763189n384982o106436o909281p881343q486987q694470r890198j1607617
1617.4D11801875j0421098j0145068j2080133j2061119j1167943j0692805r413660
1631.6C35820049q890986r289593o538361l100455j505762n88328K86967J443952J876622
1650C09514105K298594L991872M509449M374146N154997O588877P705331P512122Q133799
$$ y = [450916231, 448538840, 446531206, 444194466, 442909926, 443187326, 444252342, 445908815, 448265642, 451315552, 454740614, 458076835, 462199867, 467988282, 472712308, 476350993, 479641885, 482606351, 485528111, 487956583, 489728808, 491476059, 493152976, 494214475, 494615018, 494638860, 494403183, 493818313, 492660642, 490851879, 488344610, 485191047, 481374621, 476763189, 471378207, 465271771, 458362490, 450481147, 441994160, 433299690, 423409492, 411801875, 401380777, 391235709, 379155576, 367094457, 355926514, 345233709, 335820049, 326929063, 317639470, 311101109, 308000654, 306494892, 305906564, 306193531, 307637483, 309514105, 311812699, 315804571, 320314020, 324688166, 329843163, 336432040, 344137371, 351649493, 359783292]
1668.4C59783292R507805R080946R257734J0243833R790272R173333J0194064J3424784
1684.7D40456063J3316243J1886389J2998878J3558537J5802324J7943680J7452360
1699E43414474J8584251J5354633J2192011J1733353R903193P938504O467521N525947
1715.3F31113887N633712N523681M420936L510654L005207K435505J979828J545370
1731.6F59168780J670778K292931K135277K093791K696991L349066L932238M689336
1747.9F82029188N790472O610155O157577N781650N782545N474389N509793N160988
1764.2G28296757M350483L834307L523112L795922M048466L353954K648413K397120
1780.5G56248534K339661K261400K100110J724243J330197J536489J861632J714289
$$ y = [359783292, 369291097, 378372043, 387629777, 397873610, 407663882, 416837215, 427031279, 440456063, 453772306, 465658695, 478657573, 492216110, 508018434, 525962114, 543414474, 561998725, 577353358, 589545369, 601278722, 611181915, 619120419, 625587940, 631113887, 636747599, 642271280, 646692216, 650202870, 653208077, 655643582, 657623410, 659168780, 660839558, 663132489, 665267766, 667361557, 670058548, 673407614, 677339852, 682029188, 687819660, 694429815, 700587392, 706369042, 712151587, 717625976, 723135769, 728296757, 732647240, 736481547, 740004659, 743800581, 747849047, 751203001, 753851414, 756248534, 758588195, 760849595, 762949705, 764673948, 766004145, 767540634, 769402266, 771116555]
1796.9G71116555J503288J536608J537860J352012J208544J159608J254737J349330
1813.2G82018542J253665J066744R99153R28104Q69155R45925Q70824P69913R95160
1831.5G90717185J088857R12667Q47041P37071M37081L70085P76947R44733P86126
1849.9G97617793O72042N78285N03838M69506N00679N17249M12166K07960K35677N66065
1870.3H02281260O83189N58913M79281M76956M63784M20212L82364L55184L44456M58955
1890.7H06904554N37217M56810L96967L61919L39091L40343L22580K59101K08199K38538
1911.1H10365319K47717J62482J62661K99156K72215J85549K38001K62797K39551K29716
1931.5H12665164J74284Q9407O2406L4512K9861J68801K84433K04802R7513R9123J51991
$$ y = [771116555, 772619843, 774156451, 775694311, 777046323, 778254867, 779414475, 780669212, 782018542, 783272207, 784338951, 785338104, 786266208, 787135363, 788081288, 788952112, 789722025, 790717185, 791806042, 792718709, 793565750, 794302821, 794739902, 795109987, 795886934, 796831667, 797617793, 798289835, 798868120, 799371958, 799841464, 800342143, 800859392, 801271558, 801479518, 801715195, 802281260, 802964449, 803523362, 804002643, 804479599, 804943383, 805363595, 805745959, 806101143, 806445599, 806904554, 807441771, 807898581, 808295548, 808657467, 808996558, 809336901, 809659481, 809918582, 810126781, 810365319, 810613036, 810775518, 810938179, 811237335, 811509550, 811695099, 811933100, 812195897, 812435448, 812665164, 812839448, 812928855, 812991261, 813025773, 813055634, 813224435, 813508868, 813713670, 813811183, 813910306, 814062297]
1953.9H14062297K11478K15947J66416J18852P4864O5267J46925K08318J61231J00672
1974.3H15532267P9393R2984J13189J23560Q0884K2828p391l5882R418J12295J37448
1996.7H16260993Q2732J8179m8399q4519r5487p6353l0578p0393k03907k57492j94073
2019.2H15300703j58131j62184j80781k15352k71559k75671k07543j66476j74880k03371
2039.6H13284755k30134k36690j79052o5863l815n3465r9183q4400l8564L6836Q1360
2062H12411785N6803M232J908L9935P2598P8142O8784N8412M4167K3902L0458Q4877
2086.5H12976003J19149J20521J07229P3671N0306Q9825J59740J76489J38998R2447
2106.9H14104378N5909M7982J00374J54615J41620P7069L6776L5703L9459Q1360J42336
$$ y = [814062297, 814273775, 814489722, 814656138, 814774990, 814849854, 814915121, 815062046, 815270364, 815431595, 815532267, 815611660, 815704644, 815817833, 815941393, 816022277, 816045105, 816037714, 816001832, 816011250, 816123545, 816260993, 816343725, 816361904, 816313505, 816228986, 816133499, 816057146, 816026568, 815956175, 815752268, 815494776, 815300703, 815142572, 814980388, 814799607, 814584255, 814312696, 814037025, 813829482, 813663006, 813488126, 813284755, 813054621, 812817931, 812638879, 812573016, 812569201, 812515736, 812416553, 812332153, 812293589, 812330425, 812411785, 812468588, 812472820, 812474728, 812514663, 812587261, 812665403, 812734187, 812792599, 812836766, 812860668, 812891126, 812976003, 813095152, 813215673, 813322902, 813396573, 813446879, 813536704, 813696444, 813872933, 814011931, 814104378, 814160287, 814208269, 814308643, 814463258, 814604878, 814681947, 814718723, 814754426, 814793885, 814875245, 815017581]
2129.3H15017581J32024N8949J6690N2392J14799J32143J49369J59562R2208K2769
2149.7H15948486N6684J60873K30253K18391J69397J50978J84119K61843L24905L53694
2170.1H18059623L53813L21746L18289L40819L43264L58820L80873L32415K59281K45988
2190.5H21314931K91049L64066L92317L38078K54691K21908K63512L42905L72112L33190
2210.9H24488759K83957K31981K14875K84969L53694L04878K00272J38461J22488J52528
2231.3H26776862K25186K73645K13087P7903k4736j7106Q7619J79648J46866l219j55031
2253.7H27780724j80066l1114J01805P8082m828o7115p8201Q225J39058K03192K16186
2276.1H28165948K11716K11895J53601r4831m39465o77824q17776r13799r42230r44495
$$ y = [815017581, 815149605, 815208554, 815225244, 815277636, 815392435, 815524578, 815673947, 815833509, 815925717, 815948486, 816005170, 816166043, 816396296, 816614687, 816784084, 816935062, 817119181, 817381024, 817705929, 818059623, 818413436, 818735182, 819053471, 819394290, 819737554, 820096374, 820477247, 820809662, 821068943, 821314931, 821605980, 821970046, 822362363, 822700441, 822955132, 823177040, 823440552, 823783457, 824155569, 824488759, 824772716, 825004697, 825219572, 825504541, 825858235, 826163113, 826363385, 826501846, 826624334, 826776862, 827002048, 827275693, 827488780, 827566683, 827541947, 827524841, 827612460, 827792108, 827938974, 827935755, 827780724, 827600658, 827569544, 827671349, 827749431, 827744603, 827677488, 827599287, 827607512, 827746570, 827949762, 828165948, 828377664, 828589559, 828743160, 828648329, 828208864, 827531040, 826713264, 825799465, 824857235, 823912740]
2296.5H23912740j001358j130998j363218j801312k306819k545655k378225j957417
2312.9H09427738j869440k681017l858387m126549l185093k262533k336145k628028
2329.2G86480546k064347j214385j140595j407444j346290o75500J504481N158722
2345.5G85295188N453825K90037n935669q964837p955611n420208k562940K08378K690733
2363.8G63098896M764676O112694O786704O988824O762028O368219O024242N551875
2380.2H12458158M598081L198623J763285P43091K53379J7762j93000l52204l97920
2398.5H22089255l57688k83300k71023l47972m32491m86493m94719m21405l50296l81708
2418.9H18262160m84109n71668n92172n61536m89294m36425m93348n92470o19591n94735
$$ y = [823912740, 822911382, 821780384, 820417166, 818615854, 816309035, 813763380, 811385155, 809427738, 807558298, 804877281, 801018894, 796892345, 793707252, 791444719, 789108574, 786480546, 784416199, 783201814, 782061219, 780653775, 779307485, 778631985, 780136466, 785295188, 790749013, 791039050, 785103381, 776138544, 768182933, 762762725, 760199785, 760408163, 763098896, 767863572, 773976266, 780762970, 787751794, 794513822, 800882041, 806906283, 812458158, 817056239, 820254862, 822018147, 822761238, 823014617, 823032379, 822839379, 822487175, 822089255, 821731567, 821448267, 821177244, 820829272, 820396781, 819910288, 819415569, 818994164, 818643868, 818262160, 817778051, 817206383, 816614211, 816052675, 815563381, 815126956, 814633608, 814041138, 813421547, 812826812]
2439.3H12826812n47886n05387n02706n36799o10948o54757o17802n54562n12063n17428
2459.7H07266474n83112o19948n84603n48005n14746m99367n37336o06835o26087n62847
2480.1H01583588n03480n00679n29647n48303n58079n79178n52297m56929m05371m54187
2500.5G96495438n33343n47170n10395m81009m33505m29273n20765n96941n59449m57108
2520.9G91426480m10140m41193n21243o33299o87123o22809n46038n38110n84126o44803
2541.3G85797596o72460o49035n72025m99428n10335n83410o48022o38306n69045n22256
2561.7G79933274n43297o05523o34194o06417n28038m55081m93884n97477o67930o72519
2582.1G74128914n96047n26964n35131n77986o17802o20484n63205n04374n23925n95868
$$ y = [812826812, 812278926, 811773539, 811270833, 810734034, 810123086, 809468329, 808850527, 808295965, 807783902, 807266474, 806683362, 806063414, 805478811, 804930806, 804416060, 803916693, 803379357, 802772522, 802146435, 801583588, 801080108, 800579429, 800049782, 799501479, 798943400, 798364222, 797811925, 797354996, 796949625, 796495438, 795962095, 795414925, 794904530, 794423521, 793990016, 793560743, 793039978, 792443037, 791883588, 791426480, 791016340, 790575147, 790053904, 789420605, 788733482, 788110673, 787564635, 787026525, 786442399, 785797596, 785125136, 784476101, 783904076, 783404648, 782894313, 782310903, 781662881, 781024575, 780455530, 779933274, 779389977, 778784454, 778150260, 777543843, 777015805, 776560724, 776066840, 775469363, 774801433, 774128914, 773532867, 773005903, 772470772, 771892786, 771274984, 770654500, 770091295, 769586921, 769062996, 768467128]
2602.5G68467128o53207p21335p81537p77423p64549p75575p99477q55506r18329r44972
2622.9G60475218r41813r52959j006663j041889j022637j016795j047194j059354j036226
2641.2G51349688j031638j054763j071454j087546j089215j057565j023651j024842
2657.5G42909014j061499j085698j080812j070857j036226r69053r12010r26793r79125
2675.9G33786941r73463r27866r08911r18746r14395r00805r13262r26257q99255r07779
2696.3G24596202r95159j033604j024127j066327j084447j051605j070082j128733
2712.6G16142118j164079j145422j108468j115262j096905j030981j017809j051188
2728.9G07412004j038134r82642r25779q98481r33289r71913r54330r29773r27806
$$ y = [768467128, 767813921, 767092586, 766311049, 765533626, 764769077, 763993502, 763194025, 762338519, 761420190, 760475218, 759533405, 758580446, 757573783, 756531894, 755509257, 754492462, 753445268, 752385914, 751349688, 750318050, 749263287, 748191833, 747104287, 746015072, 744957507, 743933856, 742909014, 741847515, 740761817, 739681005, 738610148, 737573922, 736604869, 735692859, 734766066, 733786941, 732813478, 731885612, 730976701, 730057955, 729143560, 728242755, 727329493, 726403236, 725503981, 724596202, 723601043, 722567439, 721543312, 720476985, 719392538, 718340933, 717270851, 716142118, 714978039, 713832617, 712724149, 711608887, 710511982, 709481001, 708463192, 707412004, 706373870, 705391228, 704465449, 703566968, 702633679, 701661766, 700707436, 699777663, 698849857]
2747.3F98849857q96871q44896q44538q93951r37044r49622r15229q62658q67903r39071
2767.7F89898074j025558j066029j056135j041829j057506j113176j173318j223921
2784F81140602j271427j287699j288175j340628j456261j535415j530826j529158j553475
2802.3F68347538j598597j697004j787662j812399j830101j872480j901090j961708
2818.7F53886497k088845k211213k269864k286553k365649k559602k805114l016293
2835F34283364l229857l619611m277945n175471o247759p104039p053435n880654m145443
2853.3E87549150k578557j568317j228750j511216k183318k961636l612876l905832
2869.7E67998648l697396l129005k448618j765669j229882j023650j096368j242578
$$ y = [698849857, 697952986, 697108090, 696263552, 695369601, 694432557, 693482935, 692567706, 691705048, 690837145, 689898074, 688872516, 687806487, 686750352, 685708523, 684651017, 683537841, 682364523, 681140602, 679869175, 678581476, 677293301, 675952673, 674496412, 672960997, 671430171, 669901013, 668347538, 666748941, 665051937, 663264275, 661451876, 659621775, 657749295, 655848205, 653886497, 651797652, 649586439, 647316575, 645030022, 642664373, 640104771, 637299657, 634283364, 631053507, 627433896, 623155951, 617980480, 611732721, 604628682, 597575247, 591694593, 587549150, 584970593, 583402276, 582173526, 580662310, 578478992, 575517356, 571904480, 567998648, 564301252, 561172247, 558723629, 556957960, 555728078, 554704428, 553608060, 552365482]
2886E52365482j356304j462698j603603j792193k047062k337455k573192k764404l029943
2904.3E33398628l446221m026592m747748n536378o219268o461083o042242n127281
2920.6D91791815l981382k738953j451373k11119Q82476J910299K949715L881603M549742
2939D97582823M858166M716396M111290L245950K370775J579642R61363P28488R73225
2957.4E21128118J569212K373039L223300L986538M619836N093337N391597N515457
2973.7E52900434N464375N264520M942715M508078M026115L563941L120601K680004
2990E86470783K173483J566768R58919L94106j27613n69225r61303j277030j407862
3008.3E87221026j360476j249075j151979j128435j239478j477301j745880j936674
$$ y = [552365482, 551009178, 549546480, 547942877, 546150684, 544103622, 541766167, 539192975, 536428571, 533398628, 529952407, 525925815, 521178067, 515641689, 509422421, 502961338, 496919096, 491791815, 487810433, 485071480, 483620107, 483408988, 484291464, 486201763, 489151478, 493033081, 497582823, 502440989, 507157385, 511268675, 514514625, 516885400, 518465042, 519426405, 520154893, 521128118, 522697330, 525070369, 528293669, 532280207, 536900043, 541993380, 547384977, 552900434, 558364809, 563629329, 568572044, 573080122, 577106237, 580670178, 583790779, 586470783, 588644266, 590211034, 591169953, 591564059, 591436446, 590867221, 589905918, 588628888, 587221026, 585860550, 584611475, 583459496, 582331061, 581091583, 579614282, 577868402, 575931728]
3024.7E75931728k030790k078235k137005k200187k222478k214849k237141k317369
3041E58493674k412200k509356k602875k621055k559661k518595k518713k527535k526939
3059.3E35696745k451539k270758k050877j908958j868546j807868j706541j622498
3075.6E20009160j533329j494647j528203j532853j471758j345336j200616j145602
3092E08756816j195430j245320j266062j300395j321793j347303j396090j433253j501948
3110.3D96749222j579612j585961j566350j617998j768529j919568j954794j914322
3126.6D82842088j900047j954288k062708k135962k143443k132922k143413k199560
3143D66169745k255589k280444k284318k277255k300948k349675k373159k385318k405256
$$ y = [575931728, 573900938, 571822703, 569685698, 567485511, 565263033, 563048184, 560811043, 558493674, 556081474, 553572118, 550969243, 548348188, 545788527, 543269932, 540751219, 538223684, 535696745, 533245206, 530974448, 528923571, 527014613, 525146067, 523338199, 521631658, 520009160, 518475831, 516981184, 515452981, 513920128, 512448370, 511103034, 509902418, 508756816, 507561386, 506316066, 505050004, 503749609, 502427816, 501080513, 499684423, 498251170, 496749222, 495169610, 493583649, 492017299, 490399301, 488630772, 486711204, 484756410, 482842088, 480942041, 478987753, 476925045, 474789083, 472645640, 470512718, 468369305, 466169745, 463914156, 461633712, 459349394, 457072139, 454771191, 452421516, 450048357, 447663039, 445257783]
3161.3D45257783k411783k416134k445012k451390k399653k354324k380222k436817
3177.6D25962448k436995k426118k429754k394110k352178k339124k339244k324641
3193.9D06920284k279252k216458k179712k173513k148390k097339k046138k006888
3210.3C89772594j995593j982928j972139j991510j976490j927555j923590j970947
3226.6C74031842k004594j994282j990706k068996k178669k212346k211243k240240
3242.9C57130766k266675k275229k329737k402633k426505k435983k456098k460808
3259.2C38077098k415806k329320k264410k250969k188564k027481j868427j737029
3275.5C20995092j603901j486778j373112j249224j116425r67622q29607p40260o78867
$$ y = [445257783, 442846000, 440429866, 437984854, 435533464, 433133811, 430779487, 428399265, 425962448, 423525453, 421099335, 418669581, 416275471, 413923293, 411584169, 409244925, 406920284, 404641032, 402424574, 400244862, 398071349, 395922959, 393825620, 391779482, 389772594, 387777001, 385794073, 383821934, 381830424, 379853934, 377926379, 376002789, 374031842, 372027248, 370032966, 368042260, 365973264, 363794595, 361582249, 359371006, 357130766, 354864091, 352588862, 350259125, 347856492, 345429987, 342994004, 340537906, 338077098, 335661292, 333331972, 331067562, 328816593, 326628029, 324600548, 322732121, 320995092, 319391191, 317904413, 316531301, 315282077, 314165652, 313198030, 312368423, 311628163, 310949296]
3293.9C10949296o12825n42403m54574l64960k98291k82794l36528l62694k95342k20537
3314.3C07178348k01702k24352k63065k81781k92539l15965l27169l38972l64661l84689
3334.7C04183453l97265m23342m96953n82546o32853o42329n87642n80341p14481q26269
3355.1B98299432p82579o84858o50704o48319o07759n94497o93858q34584q27312o69688
3375.5B91305274n82844n96315n90295n04940m05431k96235j94967k74390m24564l75271
3395.9B87060022j48892k6584j88440l92049l23594r2894N6595O7115M3124P6472J47820
3418.3B86278695K01732K51978M06623O18756P46280P49111Q08299R59068R07123O81580
3438.7B92609245O79969R26048J110166J158834J168936J238466J336574J436323J552284
$$ y = [310949296, 310336471, 309794068, 309339494, 308974534, 308676243, 308393449, 308056921, 307694227, 307398885, 307178348, 306976646, 306752294, 306489229, 306207448, 305914909, 305598944, 305271775, 304932803, 304568142, 304183453, 303786188, 303362846, 302865893, 302283347, 301650494, 301008165, 300420523, 299840182, 299125701, 298299432, 297516853, 296831995, 296181291, 295532972, 294925213, 294330716, 293636858, 292802274, 291974962, 291305274, 290722430, 290126115, 289535820, 289030880, 288625449, 288329214, 288134247, 287859857, 287435293, 287060022, 286911130, 286884546, 286696106, 286304057, 285980463, 285887569, 285944164, 286011279, 286054403, 286130875, 286278695, 286480427, 286732405, 287139028, 287757784, 288504064, 289253175, 290061474, 291020542, 291927665, 292609245, 293289214, 294215262, 295325428, 296484262, 297653198, 298891664, 300228238, 301664561, 303216845]
3457C03216845J595318J511514J533002J799524J970947J776427J468867J492947J770765
3475.4C18136156K030879K099931J935601J866252K010762K092421K090931K150864
3491.7C34413797K214789K268761K259791K220750K221346K168626K125710K227873
3508C52121443K365738K472341K521813K423912K373874K520770K706259K648950K458274
3526.4C74613374K479822K693862K884686K993047K999276K912909K974987L135532
3542.7C97687495L141969K985835K952218L134877L308713L366739L414482L481745
3559D23474073L479243L400773L381639L759057M179358M093021L908128L976077M152000
3577.4D57803369M275113M325867M278928M144936M171104M466742M487962M369825
$$ y = [303216845, 304812163, 306323677, 307856679, 309656203, 311627150, 313403577, 314872444, 316365391, 318136156, 320167035, 322266966, 324202567, 326068819, 328079581, 330172002, 332262933, 334413797, 336628586, 338897347, 341157138, 343377888, 345599234, 347767860, 349893570, 352121443, 354487181, 356959522, 359481335, 361905247, 364279121, 366799891, 369506150, 372155100, 374613374, 377093196, 379787058, 382671744, 385664791, 388664067, 391576976, 394551963, 397687495, 400829464, 403815299, 406767517, 409902394, 413211107, 416577846, 419992328, 423474073, 426953316, 430354089, 433735728, 437494785, 441674143, 445767164, 449675292, 453651369, 457803369, 462078482, 466404349, 470683277, 474828213, 478999317, 483466059, 487954021, 492323846]
3593.7D92323846M528522M742891M787802M816235M800796M642069M719198M983187
3610E30344546M928469M675448M457593M522443M928947M885435M393041L958464M216015
3628.4E71310401N212128N306363M913807M695058M524708M459500M341483L968477
3644.7F08731925L566027L802836M518867M411041L879369L994822M176676L741086
3661F40822649L263712L026307K687692K461970K822816K675593K276719K908528L223538
3679.4F66169524K827108K524555K237618J806497J559616J910865K253711K090812
3695.7F83380306J701832J410365J379192J593291J597107J311421J207292J638055
3712F95218861K107144J673042Q29757M21345M70817O03795Q25882J170635J111865
$$ y = [492323846, 496852368, 501595259, 506383061, 511199296, 516000092, 520642161, 525361359, 530344546, 535273015, 539948463, 544406056, 548928499, 553857446, 558742881, 563135922, 567094386, 571310401, 576522529, 581828892, 586742699, 591437757, 595962465, 600421965, 604763448, 608731925, 612297952, 616100788, 620619655, 625030696, 628910065, 632904887, 637081563, 640822649, 644086361, 647112668, 649800360, 652262330, 655085146, 657760739, 660037458, 662945986, 666169524, 668996632, 671521187, 673758805, 675565302, 677124918, 679035783, 681289494, 683380306, 685082138, 686492503, 687871695, 689464986, 691062093, 692373514, 693580806, 695218861, 697326005, 698999047, 699828804, 700250149, 700720966, 701324761, 702150643, 703321278, 704433143]
3730.3G04433143P92384R25124J528978J851857J453102N55634K92361J132965J071096
3748.7G14036644O26802J238525J672208J257539Q05140R05156J014113P55310N77629
3767.1G22889066N76794P75993R90867R10163O84202N35488O07848O38247O14941P03871
3787.5G29927480P52568O93620M16338J23739J95146J39415J90139Q42095Q19206N91159
3807.8G34690905Q66532P78377K06947q1956K72453K65836L98577R13322P82311N50210
3828.2G39643514M41313L27527L54589R0658j02281M84943R15050Q08299O00636L04699
3848.6G43868947l28898r24349J67489J487851J125097L63112L2782K18511L23415
3867G46333957j669R6202N23686O53625N62310J69813J31131L61800K76685L67939
$$ y = [704433143, 705225527, 706150651, 707679629, 709531486, 710984588, 711540222, 711832583, 712965548, 714036644, 714663446, 715901971, 717574179, 718831718, 719636858, 720542014, 721556127, 722311437, 722889066, 723465860, 724241853, 725232720, 726142883, 726827085, 727362573, 727970421, 728608668, 729223609, 729927480, 730680048, 731373668, 731790006, 731913745, 732108891, 732248306, 732438445, 733280540, 734099746, 734690905, 735557437, 736335814, 736542761, 736460805, 736733258, 736999094, 737397671, 738310993, 739093304, 739643514, 740084827, 740412354, 740766943, 740857601, 740755320, 741240263, 742155313, 742963612, 743564248, 743868947, 743540049, 742615700, 742783189, 744271040, 745396137, 745759249, 745792031, 746010542, 746333957, 746332288, 746428490, 746952176, 747605801, 748168111, 748337924, 748469055, 748830855, 749107540, 749475479]
3887.4G49475479K84135O8069L87192N26607N4598k88070j25169J64747N45502Q00430
3907.8G51893520N78642K30849O3956n4538n3645J46151K17497J44601K11895K44736
3928.2G53623664N9188K2411K92063M18544K66075P4029L0160J61409J82331R4592
3948.6G55224466J56224K26796J55091J04964J75595K15292J58727J14382J10328J07527
3969G56749392J25587J87873J98126J13666Q8513J54734J73569J55508J35243J02878
3989.4G58185089J00016J43767J97649J70648
3997.5G58797169
$$ y = [749475479, 749759614, 749827683, 750214875, 750741482, 750796080, 750508010, 750382841, 750547588, 751093090, 751893520, 752472162, 752703011, 752766967, 752712429, 752658784, 752804935, 753022432, 753167033, 753378928, 753623664, 753682852, 753705263, 753997326, 754415870, 754681945, 754755974, 754786134, 754947543, 755129874, 755224466, 755380690, 755607486, 755762577, 755867541, 756043136, 756258428, 756417155, 756531537, 756641865, 756749392, 756874979, 757062852, 757260978, 757374644, 757463157, 757617891, 757791460, 757946968, 758082211, 758185089, 758285105, 758428872, 758626521, 758797169]
##END=$$ End of the data block
