##TITLE=G23-52-CE $$ Begin of the data block
##JCAMP-DX=5.00 $$ ACD/SpecManager v 10.08
##SPECTROMETER/DATA SYSTEM=Alpha
##DATE=17 Oct 2013 10:58:30
##DATA TYPE=INFRARED SPECTRUM
##DATA CLASS=XYDATA
##ORIGIN=
##OWNER=
##NPOINTS=1765
##FIRSTX=399.75695801
##LASTX=3997.56933594
##MAXX=3997.56933594
##MINX=399.75695801
##MAXY=0.78500873
##MINY=0.23160735
##XFACTOR=1.0000000000
##YFACTOR=1.000000000000000e-9
##FIRSTY=0.47809088
##DELTAX=2.03957629
##XUNITS=1/CM
##YUNITS=ARBITRARY UNITS
##XYDATA=(X++(Y..Y))
399.8D78090882l474593m879624l399491P82520L498375J920849j656770k801747n50657
418.1D67529744K136201J521170j704335m464835m018397j062303J365602O97553k046436
436.5D59953964k884805k98202L406047M663885K044588j691729k943545r77695J577139
454.8D62849647J325518k121628m836797m239679j615405K72811n94497l337383m845769
473.2D42856818l117919p0840J266271p8559k418101l087550j361221P35581P88897
491.5D35513377j671791m273623m108817j502633J94043r91583l509193m955024m058689
509.9D10636067j661390l51846j561493l824591m289031k219320M40449J436919J67310
528.3C98773074j389026r54777J553595M094749M516900K528965J50919m16845P89285
$$ plain form
399.8 478090882 474616289 469736665 466337174 467119694 470618069 472538918 470882148 468080401 467529744
418.1 467529744 469665945 471187115 469482780 465017945 460999548 459937245 461302847 462000400 459953964
436.5 459953964 457069159 456770957 460177004 464840889 466885477 465193748 462250203 461272508 462849647
454.8 462849647 464175165 462053537 457216740 452977061 451361656 451634467 451039970 447702587 442856818
473.2 442856818 439738899 439668059 440934330 440855771 438437670 435350120 433988899 434724480 435513377
491.5 435513377 433841586 429567963 425459146 423956513 424150556 423158973 419649780 414694756 410636067
509.9 410636067 408974677 408622831 407061338 403236747 398947716 396728396 397168845 398605764 398773074
528.3 398773074 397384048 396429271 397982866 402077615 406594515 409123480 409274399 408857554 409646839
546.6D09646839J703352N48392j933425l351301k503276n86063J30743j399338l781021
565C98474902m552960k734274K652J171232L74257o18398J96755K703905M772842M555255
585.4D04346168K280980J47820j9729J340151K155155J040548j024813j906514p86126
603.7D07573640J168073J989215P99805j072764j446814J31011K233982K987355K002627
622.1D16366130Q32319J104743K875507M320710L764660J597672r0420L50416K209008
640.4D33330745L250151K253175M7803j254976l79175J463384K067834O64472j240819
658.8D40202594j486987O2764J472890J986623J164496m23372o0260J742154L302664
677.1D47963566K916455R64075n67585j72406J536637K371222J053005j387506k714158
$$ plain form
546.6 409646839 411350191 411898583 409965158 406613857 404110581 403524518 403655261 402255923 398474902
565 398474902 393921942 391187668 391190320 392361552 392735809 392117411 392314166 395018071 399790913 404346168
585.4 404346168 406627148 406774968 406755239 408095390 410250545 411291093 410266280 408359766 407573640
603.7 407573640 408741713 410730928 411530733 410457969 409011155 409142166 411376148 414363503 416366130
622.1 416366130 417198449 418303192 421178699 425499409 429264069 430861741 430771321 431121737 433330745
640.4 433330745 436580896 438834071 438881874 437626898 437247723 438711107 440778941 441443413 440202594
658.8 440202594 438715607 438778371 440251261 442237884 443402380 442979008 442918748 444660902 447963566
677.1 447963566 450880021 451844096 451276511 451104105 452640742 455011964 456064969 454677463 451963305
695.5D51963305j768648M25577J801193J326769L6598M321J923054M211694M902602
713.8D64826465L707677K243340K506554M646778O497741O260514M090250J987457
730.2D96766776J918912L484458M458665L142894K45392j638651q55386J272857K018511
748.5E10814428K92659k320886l370106k020955J88828R51051k85089j572311o16550
766.9E02061069K596796N840599O739676N121768L250301L381967N306602O556987
783.2E40855765N248487K171278J312N65052L015399M670798L885448J751662Q56816
801.6E63022017K395154M832327N467951L094793l18170j562357J15752K233148J970410
819.9E81251025r14395l977120m551112k623856p44641j154482l525556n377590m722059
$$ plain form
695.5 451963305 450194657 450620234 452421427 453748196 453784794 453789115 455712169 459923863 464826465
713.8 464826465 468534142 470777482 473284036 477930814 484428555 490689069 494779319 496766776
730.2 496766776 498685688 502170146 506628811 509771705 510017097 508378446 507523060 508795917 510814428
748.5 510814428 511107087 508786201 505416095 503395140 503583968 504535019 504249930 502677619 502061069
766.9 502061069 504657865 510498464 517238140 522359908 525610209 528992176 534298778 540855765
783.2 540855765 546104252 548275530 548276842 548841894 551857293 556528091 560413539 562165201 563022017
801.6 563022017 565417171 570249498 575717449 578812242 578494072 576931715 577047467 579280615 581251025
819.9 581251025 580336630 576359510 571808398 569184542 568439901 567285419 563759863 558382273 553660214
838.3E53660214k270758n04494r83119k823770l711641k357900J41978J360298K22802
856.6E42733610j571298j175761K240360O364286Q159041O917596M554331L290951
872.9E71513116L529489L570795J480520k457678n803347o530046n097985l857077
889.3E56347787m399359o018340o852746n963326m272759l678143n071878p354200
905.6E12737036q622051q083492o675959n935013o284118o688207n848229l569990
921.9D61029977j150847j47909p57068j704216j676351n83410M99785M47720p45446
940.2D55212235k176046l292501m371554n926281p985115r927809j0970563j0828078
956.6C99734288j0029405r527087r848356j0560304j0701090r820134q368820p092625
$$ plain form
838.3 553660214 551389456 550884962 549901843 547078073 543366432 541008532 541150510 542510808 542733610
856.6 542733610 541162312 539986551 542226911 548591197 556750238 563667834 568222165 571513116
872.9 571513116 575042605 578613400 580093920 577636242 571832895 565302849 560204864 556347787
889.3 556347787 551948428 545930088 539077342 533114016 528841257 525163114 520091236 512737036
905.6 512737036 504114985 496031493 489355534 483420521 477136403 470448196 464599967 461029977
921.9 461029977 459879130 459731221 458974153 457269937 455593586 455010176 455509961 455957681 455212235
940.2 455212235 453036189 449743688 445372134 439445853 431460738 421532929 410562366 399734288
956.6 399734288 389704883 380177796 370329440 359769136 349068046 339247912 330879092 323786467
972.9C23786467o338805n800545m863381l412664j997680j237809j274616j634776
989.2B97226191j671881j181543n08547j06990j09464k38091j44928J18494J56283
1007.5B93539524l40104j187444j796067j815885j417339j092195j265198j851499
1023.9B82773793k314270k284288j861364j458675j515239j989961k344101k200902
1040.2B66804993j753151j418501j390875j466423j219332m97908M06146J053155J280665
1058.5B61798769J316488J570821K105832K339691J608968M6789j281380j357764k08021
1076.9B67940193J346469K619237L348291L683776L992051M359811M525065M232556
1093.2B96047449L473878K542794J875609J641929J634717J581758J476854J556367
$$ plain form
972.9 323786467 317447662 311647117 306783736 303371072 301373392 300135583 298860967 297226191
989.2 297226191 295554310 294372767 293864220 293757230 293647766 293409675 293264747 293383241 293539524
1007.5 293539524 293199420 292011976 290215909 288400024 286982685 285890490 284625292 282773793
1023.9 282773793 280459523 278175235 276313871 274855196 273339957 271349996 269005895 266804993
1040.2 266804993 265051842 263633341 262242466 260776043 259556711 259058803 259464949 260518104 261798769
1058.5 261798769 263115257 264686078 266791910 269131601 270740569 270787358 269505978 268148214 267940193
1076.9 267940193 269286662 271905899 275254190 278937966 282930017 287289828 291814893 296047449
1093.2 296047449 299521327 302064121 303939730 305581659 307216376 308798134 310274988 311831355
1109.5C11831355K016068K695173L094434K848953K132684J539857J481235J887738
1125.8C29527497K355188K514512K336293K036482J835555J623422J053184J55270
1142.2C43437403o40660r62198p07656j32799K81185L25054L94880J035989K231419
1160.5C45262617L430277M129946M236400M193932M652023N684436O722301P160664
1176.8C85472596O938934O585538O595493O871909O784677N830944M216820K622336
1193.1D31919247J587003J085133N74618l15427j262784j587064j066118j94013K67982
1211.5D31008577j0758o22392r33170p47562m74572o92368j473516k237826k401769
1229.9D21414644j946986j323313j003355j064240j047433m71324N84960J583606K001465
$$ plain form
1109.5 311831355 313847423 316542596 319637030 322485983 324618667 326158524 327639759 329527497
1125.8 329527497 331882685 334397197 336733490 338769972 340605527 342228949 343282133 343437403
1142.2 343437403 342796743 341834545 341126889 340994090 341275275 341600329 341995209 343031198 345262617
1160.5 345262617 348692894 352822840 357059240 361253172 365905195 371589631 378311932 385472596
1176.8 385472596 392411530 398997068 405592561 412464470 419249147 425080091 429296911 431919247
1193.1 431919247 433506250 434591383 435166001 434850574 433587790 432000726 430934608 430740595 431008577
1211.5 431008577 430997819 430375427 429442257 428694695 428220123 427527755 426054239 423816413 421414644
1229.9 421414644 419467658 418144345 417140990 416076750 415029317 414557993 415142953 416726559 418728024
1248.2D18728024J866102J705080J957894K536475K915383K700686K075046J648993
1264.5D36133683J838386K416312K695680K244800J352847P43181Q31782J341910J629144
1282.9D51227725J369684Q53330N99176P17282P72328L39537o31988j650124k094180
1301.2D51502770j868725j463294j435458j763910j939655j562178p01249J83076N20915
1319.6D41472292J66476m41671q75801j131147j456558j985521k508789k561033j989543
1338D28688705j144707n93543n82189r20325j211494j223237j132369j268059j747280
1356.3D18865502k305061k707988l007203l275484l519297l694385l475726l077298
1372.6C93803060k968371l022790l232866l710986l975451l405571k158910r18149
$$ plain form
1248.2 418728024 420594126 422299206 424257100 426793575 429708958 432409644 434484690 436133683
1264.5 436133683 437972069 440388381 443084061 445328861 446681708 447424889 448256671 449598581 451227725
1282.9 451227725 452597409 453450739 454049915 454767197 455539525 455879062 455247074 453596950 451502770
1301.2 451502770 449634045 448170751 446735293 444971383 443031728 441469550 440768301 440951377 441472292
1319.6 441472292 441638768 441197097 440321296 439190149 437733591 435748070 433239281 430678248 428688705
1338 428688705 427543998 426950455 426368266 425447941 424236447 423013210 421880841 420612782 418865502
1356.3 418865502 416560441 413852453 410845250 407569766 404050469 400356084 396880358 393803060
1372.6 393803060 390834689 387811899 384579033 380868047 376892596 373487025 371328115 370409966
1388.9C70409966k71798j72048l05862k07096K57164P53254J101434J298636J320154
1407.3C74183804J464546J826852K052277K024830K060145K258360K245277K353311
1423.6C90469402K418190J941026J134157L25083m7862p8887j54584j49459M4733K89083
1444C96190882O57290R41336P45565L08990M09037J617044K948940K897799K839297
1462.4D09556180L191859L439784M161209O271660R126931R406984P317484N513549
1478.7D57985640M196792L040344J638949p5936k214164m177213m746973n008102n943477
1497D44695860o496638o364852o048739o957501r620309r494662q314342p986754o784946
1515.4C76627117m695743k650559k077460k646834l045291l180265k723694k183705
$$ plain form
1388.9 370409966 370138168 369966120 369660258 369453162 369710326 370463580 371565014 372863650 374183804
1407.3 374183804 375648350 377475202 379527479 381552309 383612454 385870814 388116091 390469402
1423.6 390469402 392887592 394828618 395962775 396287858 396239996 396161109 396006525 395857066 395901799 396190882
1444 396190882 396848172 397789508 398535073 398844063 399253100 400870144 403819084 406716883 409556180
1462.4 409556180 412748039 416187823 420349032 426620692 435747623 445154607 452472091 457985640
1478.7 457985640 462182432 465222776 466861725 466785789 464571625 460394412 455647439 450639337 444695860
1497 444695860 438199222 431834370 425785631 418828130 409207821 399713159 391398817 383412063 376627117
1515.4 376627117 371931374 369280815 367203355 364556521 361511230 358330965 355607271 353423566
1531.7C53423566k163291j980782j411289j038790n90890K09987R59784J662731K474844
1550.1C51545870L291250M038453M566431N602836N567521L433258K961903L332109
1566.4C84339631L430128L057718K034575J593291J633257J222015P85648L69192o3628
1584.7C98401827l09080l86745n96166j025170j723438k467484l062456l607750m182011
1603.1C81041527m883588n803704o901651p546783p568926q280813j0031075r788423
1619.4C20236564r567887j0975063j1010378j0212750r803235q735120p961870q107677
1635.7B43862584o243527l467649j822844p21216K00733Q48800J098752J807571K660334
1654.1B38223538K367735K573490L712147N111084N948811N904019O648094P592708
$$ plain form
1531.7 353423566 351260275 349279493 347868204 346829414 346238524 346448511 347408295 349071026 351545870
1550.1 351545870 354837120 358875573 363442004 369044840 374612361 378045619 381007522 384339631
1566.4 384339631 387769759 390827477 392862052 394455343 396088600 397310615 398096263 398465455 398401827
1584.7 398401827 398092747 397706002 397109836 396084666 394361228 391893744 388831288 385223538 381041527
1603.1 381041527 376157939 370354235 363452584 355905801 348336875 340056062 330024987 320236564
1619.4 320236564 310668677 299693614 288683236 278470486 268667251 259932131 251970261 243862584
1635.7 243862584 237619057 234151408 232328564 231607348 231808081 232656881 233755633 235563204 238223538
1654.1 238223538 240591273 243164763 246876910 251987994 257936805 263840824 270488918 278081626
1670.4B78081626P179618P650256Q484065P982910P688880Q925259J1432409J0987014
1686.7C48412037J0035455J1202008J1991977J4628649J7114997J7414629J8767447
1701D49567199J5444338J2613744J2312024J0735155R399950Q436263P572233O999135
1717.3E33080041N764127M596412M325986L944516L074825K427519K202749K560079
1733.6E61976254K467334J871228J862407K225280L067493M468203N862713O882429
1749.9E90683341P144272O734074P107198P698118P461787P007181N954028N285561
1766.3F45075560N559504N838394N732298M613578L336430L156960L578305L734946
1782.6F80625975L373504K648175K091169K198934K718509K746880K338886J854658
$$ plain form
1670.4 278081626 285261244 292911500 301395565 309378475 317067355 325992614 337425023 348412037
1686.7 348412037 358447492 369649500 381641477 396270126 413385123 430799752 449567199
1701 449567199 465011537 477625281 489937305 500672460 510072410 518508673 526080906 533080041
1717.3 533080041 538844168 543440580 547766566 551711082 554785907 557213426 559416175 561976254
1733.6 561976254 564443588 566314816 568177223 570402503 573469996 577938199 583800912 590683341
1749.9 590683341 597827613 604561687 611668885 619367003 626828790 633835971 639789999 645075560
1766.3 645075560 650635064 656473458 662205756 666819334 670155764 673312724 676891029 680625975
1782.6 680625975 683999479 686647654 688738823 690937757 693656266 696403146 698742032 700596690
1798.9G00596690J510799J619399K058148K331615K055168J428485J036048J317858
1815.2G13954210J908243K106905J690507J142859R51469J277149J819134J792550
1831.5G26643026J169741O22451N70596J048505J597345J635074R56178L21567L79801
1849.9G34944284R37104J370907J244247O85751K58804L80873R33648J337587J121641
1868.2G43214846M14967P093L25084R54985J252950R53614M13239J81139N03182J046181
1888.6G49267280J163304P43210K64585J34588M66466R15944R45568N25713Q4877L0518
1909G54542053M32789Q38697Q28087M30704M649J8060M75168Q22663O73771K08259
1929.4G59274900j11997J0967M31478P47800N99682J26422j68920K1339M66764O91533
$$ plain form
1798.9 700596690 702107489 703726888 705785036 708116651 710171819 711600304 712636352 713954210
1815.2 713954210 715862453 717969358 719659865 720802724 721754193 723031342 724850476 726643026
1831.5 726643026 727812767 728435218 729005814 730054319 731651664 733286738 734242916 734564483 734944284
1849.9 734944284 735881388 737252295 738496542 739182293 739441097 739821970 740755618 742093205 743214846
1868.2 743214846 743629813 743636906 743961990 744916975 746169925 747123539 747536778 747717917 748221099 749267280
1888.6 749267280 750430584 751173794 751438379 751572967 752039433 752955377 753900945 754426658 754511535 754542053
1909 754542053 754974842 755813539 756641626 757072330 757076979 757095039 757570207 758392870 759066641 759274900
1929.4 759274900 759162903 759173870 759605348 760353148 760952830 761079252 760910332 760931671 761398435 762089968
1949.8G62089968M78267P8142o1333J93357N70953O62089L85999J4723r6143J86682
1970.2G64502704N65231O11365K68042r5069j32502J96159N19216M58598J03891j30295
1990.6G66867340l3021K61843M56154L21448k3246k53439j32799J72615K72930M3213
2011G67953038k81036l99887k33531L0756Q6009j47521m37081m91262k78890q046m590
2033.4G65787959k90275n02824l98696p7963J30296L9935k42650m13597k56479J12772
2053.8G63888478L25561J85013j02640j99735n9K82585L65377J64509j15097j96457
2074.2G64597535K1160L10838L37660O1691j95444j39772J55389L96848L31819K9504
2094.6G65907228j82688n7996K53082M06861K77400P510j33872K921K97487M09186
$$ plain form
1949.8 762089968 762568235 762646377 762585044 762778401 763349354 764011443 764397442 764412165 764316022 764502704
1970.2 764502704 765067935 765679300 765947342 765852273 765719771 765915930 766435146 766893744 766997635 766867340
1990.6 766867340 766834319 767096162 767552316 767873764 767850518 767597079 767464280 767636895 767909825 767953038
2011 767953038 767672002 767272115 767038584 767069340 767155349 767007828 766570747 766079485 765800595 765792549 765787959
2033.4 765787959 765497684 764994860 764596164 764518201 764648497 764688432 764445782 764032185 763775706 763888478
2053.8 763888478 764214039 764399052 764296412 764096677 764096618 764379203 764744580 764909089 764793992 764597535
2074.2 764597535 764618695 764929533 765267193 765328884 765133440 764993668 765149057 765545905 765877724 765907228
2094.6 765907228 765724540 765666544 765919626 766326487 766603887 766611397 766477525 766480446 766777933 767187119
2115G67187119K06351p8559j53780K4199K52963L16798J30534j27256j61349Q8811
2135.4G67685831L63469L66389P6473j86682j40547J56879M06385L55064Q2434r7812
2155.8G69067883K4915L52979N79238M82678J90378N6266K62797N93901O87122M84705
2176.2G72782862K07722J36257L60310O49571O86407M27783J38521Q8870L40939O43671
2196.6G76462913O54399L51489P1346J10507M13597O62804O10828L17514P2896J13428
2217G79841721L88801N88119M56751J20639m4822J04546L61920M67419L06309L814
2237.4G82595217j19149P0154L65079M38034J97172j03593j69813M7684L26097L78608
2257.8G84025490J30296j33097j33157J11699L82722L61561K4200k66314k04742J38581
$$ plain form
2115 767187119 767393470 767314911 767161131 767185330 767438293 767755091 767885625 767758369 767597020 767685831
2135.4 767685831 768049300 768415689 768492162 768305480 768164933 768321812 768728197 769083261 769165695 769067883
2155.8 769067883 769092798 769445777 770025015 770507693 770698071 770754337 771017134 771611035 772298157 772782862
2176.2 772782862 772990584 773126841 773487151 774136722 774823129 775250912 775389433 775478303 775819242 776462913
2196.6 776462913 777117312 777468801 777540147 777650654 778064251 778727055 779337883 779655397 779728293 779841721
2217 779841721 780230522 780818641 781275392 781396031 781351209 781455755 781817675 782285094 782591403 782595217
2237.4 782595217 782476068 782546222 782911301 783349335 783546507 783442914 783273101 783320785 783646882 784025490
2257.8 784025490 784155786 784022689 783889532 784001231 784383953 784745514 784769714 784503400 784298658 784437239
2278.2G84437239L56138K15352r1196k86221j91987Q4043K01225K7776k66433l98338
2298.6G84087598k58863r060J19865k3782l31044m34160k25485Q703K6762j86980m58181
2321G82315373n32627l24011k741J06156k07186n30482m41193j85371k7656m8816k85209
2343.5G79836237n51104n55635l71575j84834j94728m21107n19455m49657l60012j67132
2363.8G76060998k9861k60652l68535r4116J44303Q5175k22564m69267m14491j64747
2384.2G74266243m77r8467m16219o83308o70075m14073j85609k80857o25611q10444
2404.6G70081103o63459m12882l33249n37396q35121r18746p43985m91619m22001o57081
2425G64065564r66788j019656p89762n39064n24760p67409j021088j016080p71701
$$ plain form
2278.2 784437239 784793377 785008729 784917533 784631312 784439325 784523368 784724593 784752369 784485936 784087598
2298.6 784087598 783828735 783819675 783939540 783915758 783584714 783150554 782925069 782933772 782960534 782773554 782315373
2321 782315373 781782746 781458735 781455994 781562150 781354964 780824482 780383289 780197918 780170262 780121446 779836237
2343.5 779836237 779285133 778729498 778357923 778173089 777978361 777557254 777037799 776588142 776228130 776060998
2363.8 776060998 776031137 775770485 775401950 775307834 775452137 775537312 775314748 774845481 774430990 774266243
2384.2 774266243 774265766 774167299 773751080 773067772 772397697 771983624 771798015 771517158 770891547 770081103
2404.6 770081103 769417644 769004762 768671513 768134117 767298996 766380250 765636265 765144646 764722645 764065564
2425 764065564 763098776 762079120 761289358 760750294 760225534 759458125 758437037 757420957 756649256
2443.4G56649256n54621n79060q30352j053572r85562o87063m98891o16193q96573
2461.7G49947369j021147q58009n88953m67837o46829r63569j072884q68559n67853
2480.1G42891729m80175o82473r35734r60648p23123m70460m72009p05778r12905q91626
2500.5G35656798o50048l96908m05192o93560r36448q55148n62668l84808m92394p86244
2520.9G29493380r62794q39532n84602m87030o59227r26197j015245q60990o28590
2539.2G22529173n52416p25627r73344j029670q06093n14448m81963p49290j022816
2557.6G15673506j012981p23719m43399m72844p84397j023829r42707o56664m75944
2576G09137022n68032q31067j013995r26196o53923m82082n84364q49545r96768q79765
$$ plain form
2443.4 756649256 756094635 755515575 754685223 753631651 752646089 751959026 751460135 750843942 749947369
2461.7 749947369 748926222 748068213 747479260 747011423 746364594 745401025 744328141 743459582 742891729
2480.1 742891729 742411554 741729081 740793347 739832699 739109576 738639116 738167107 737461329 736548424 735656798
2500.5 735656798 735006750 734609842 734204650 733511090 732574642 731719494 731156826 730772018 730279624 729493380
2520.9 729493380 728530586 727691054 727106452 726619422 725960195 725033998 724018753 723157763 722529173
2539.2 722529173 721976757 721251130 720277786 719248116 718442023 717927575 717445612 716696322 715673506
2557.6 715673506 714660525 713936806 713493407 713020563 712236166 711212337 710269630 709612966 709137022
2576 709137022 708568990 707737923 706723928 705797732 705143809 704661727 704077363 703227818 702231050 701351285
2596.4G01351285o30498n19633p00712j007081j129806r84788p54237p12156r54688
2614.7F93957686j251041j315952j126706r26257r59575j230657j505434j496554j248121
2633.1F82897389j080275j135051j352847j544296j494169j233519j044631j133799
2649.4F72878802j399517j536608j400530j156032j054228j184225j402616j484335
2665.7F62260711j310348j040399r72033j137197j329064j352191j175940r63569r18388
2684.1F52061582j078546j243771j233696j092434r50575r80795j220762j422823j405954
2702.4F41432226j231134j083791j152874j379311j521706j460254j266897j152277
2718.7F31183982j239538j412988j466155j328647j131475j032472j088679j225590
$$ plain form
2596.4 701351285 700720787 700201154 699500442 698493361 697363555 696378767 695624530 694912374 693957686
2614.7 693957686 692706645 691390693 690263987 689337730 688378155 687147498 685642064 684145510 682897389
2633.1 682897389 681817114 680682063 679329216 677784920 676290751 675057232 674012601 672878802
2649.4 672878802 671479285 669942677 668542147 667386115 666331887 665147662 663745046 662260711
2665.7 662260711 660950363 659909964 658937931 657800734 656471670 655119479 653943539 652979970 652061582
2684.1 652061582 650983036 649739265 648505569 647413135 646462560 645481765 644261003 642838180 641432226
2702.4 641432226 640201092 639117301 637964427 636585116 635063410 633603156 632336259 631183982
2718.7 631183982 629944444 628531456 627065301 625736654 624605179 623572707 622484028 621258438
2735F21258438j266718j128495r49025r14037j064778j236796j219094j038670q92938
2753.4F11547887q93593j035749j184762j161516j004934q96692r51588j158417j335382
2771.8F01925254j317442j148343j051843j184940j416147j543105j525282j414001
2788.1E91324151j362741j503706j724363j834988j779557j655876j626075j789927
2804.4E78046918k064586k200961k095163j934409j958251k175748k396167k490222
2820.7E60731411k460003k431393k556324k798259l021717l180385l313660l513873
2837E37455797l935456m679322n578101o364703o877721o908595o290227n094230l626228
2855.4D88101214k351671j721174j920551k727479l669083m340976m478097m047245
$$ plain form
2735 621258438 619991720 618863225 617914200 617000163 615935385 614698589 613479495 612440825 611547887
2753.4 611547887 610654294 609618545 608433783 607272267 606267333 605370641 604419053 603260636 601925254
2771.8 601925254 600607812 599459469 598407626 597222686 595806539 594263434 592738152 591324151
2788.1 591324151 589961410 588457704 586733341 584898353 583118796 581462920 579836845 578046918
2804.4 578046918 575982332 573781371 571686208 569751799 567793548 565617800 563221633 560731411
2820.7 560731411 558271408 555840015 553283691 550485432 547463715 544283330 540969670 537455797
2837 537455797 533520341 528841019 523262918 516898215 510020494 503111899 496821672 491727442 488101214
2855.4 488101214 485749543 484028369 482107818 479380339 475711256 471370280 466892183 462844938
2871.7D62844938l313243k550513j925826j496404j200468j057386j148164j405120
2888D48747814j651794j799524j884103j980424k165943k479166k837300l141195l427148
2906.4D27381217l789156m306436m953384n519480n756139n566836n020201m206091
2922.7C88263494l159076j945436o59585O11692J774580K812087L673673M261374M584402
2941D00217205M608751M202872L394395K469749J697659J192808J059681J354039J946211
2959.4D22143370K638698L378182M184097M933000N470812N801082N929500N864829
2975.7D60343570N742222N629658N368442M841655M217953L700465L280639K809972
2992D95934576K200961J497120P72595J38581l22283o82473j001090j194179j224488
$$ plain form
2871.7 462844938 459531695 456981182 455055356 453558952 452358484 451301098 450152934 448747814
2888 448747814 447096020 445296496 443412393 441431969 439266026 436786860 433949560 430808365 427381217
2906.4 427381217 423592061 419285625 414332241 408812761 403056622 397489786 392469585 388263494
2922.7 388263494 385104418 383158982 382499397 383111089 384885669 387697756 391371429 395632803 400217205
2941 400217205 404825956 409028828 412423223 414892972 416590631 417783439 418843120 420197159 422143370
2959.4 422143370 424782068 428160250 432344347 437277347 442748159 448549241 454478741 460343570
2975.7 460343570 466085792 471715450 477083892 481925547 486143500 489843965 493124604 495934576
2992 495934576 498135537 499632657 500405252 500543833 500221550 499539077 498537987 497343808 496119320
3010.4D96119320j136124r77933q97616j011879j293301j669675j978398k060055j993984
3028.7D83100355j989037k081722k158880k204240k280891k352982k406925k487153
3045.1D65138525k556354k566516k518356k494067k553076k609044k570987k423614
3061.4D44846511k230078k079427j959920j842469j760900j694560j591474j509905
3077.7D30177778j533389j575112j509816j368612j229435j154274j164108j194060
3094D19448972j198292j171380j152635j219481j333952j380563j363546j368016j391112
3112.4D07869995j434029j534134j630038j675099j693934j723290j792073j863777
3128.7C94523621j900554j919746j922340j913517j925022j989752k055406k058596
$$ plain form
3010.4 496119320 494983196 494005263 493107647 492095768 490802467 489132792 487154394 485094339 483100355
3028.7 483100355 481111318 479029596 476870716 474666476 472385585 470032603 467625678 465138525
3045.1 465138525 462582171 460015655 457497299 455003232 452450156 449841112 447270125 444846511
3061.4 444846511 442616433 440537006 438577086 436734617 434973717 433279157 431687683 430177778
3077.7 430177778 428644389 427069277 425559461 424190849 422961414 421807140 420643032 419448972
3094 419448972 418250680 417079300 415926665 414707184 413373232 411992669 410629123 409261107 407869995
3112.4 407869995 406435966 404901832 403271794 401596695 399902761 398179471 396387398 394523621
3128.7 394523621 392623067 390703321 388780981 386867464 384942442 382952690 380897284 378838688
3145C78838688k048671k044410k041846k089560k154321k133757k077639k090335k098619
3163.4C60059530k067417k104491k159834k132058k109051k122075k122819k093613
3179.7C43148172k038717k011121k032816k039075k001494j966477j915484j851380
3196C27291608j852036j873970j826703j772583j740217j680881j632362j635105j641542
3214.3C11636209j601248j571239j579999j571298j577139j627505j641959j635879
3230.7B98829943j658052j690686j763642j862466j913309j912743j953632k035439
3247B84039974k051770k046407k104193k146125k138406k168476k209753k181113k070576
3265.3B64923155j932352j828015j735300j635999j531392j399159j258642j143604
$$ plain form
3145 378838688 376790017 374745607 372703761 370614201 368459880 366326123 364248484 362158149 360059530
3163.4 360059530 357992113 355887622 353727788 351595730 349486679 347364604 345241785 343148172
3179.7 343148172 341109455 339098334 337065518 335026443 333024949 331058472 329142988 327291608
3196 327291608 325439572 323565602 321738899 319966316 318226099 316545218 314912856 313277751 311636209
3214.3 311636209 310034961 308463722 306883723 305312425 303735286 302107781 300465822 298829943
3230.7 298829943 297171891 295481205 293717563 291855097 289941788 288029045 286075413 284039974
3247 284039974 281988204 279941797 277837604 275691479 273553073 271384597 269174844 266993731 264923155
3265.3 264923155 262990803 261162788 259427488 257791489 256260097 254860938 253602296 252458692
3281.6B52458692j035363q99076p58499o30513n10603m56631m49002l68446k47613
3300B47102946j69381q2478q524j2055k0757J4022N0172Q3044J23635J69382J89304
3322.4B47439310J55196J24439J32442J43319J40265J43990J33201Q6248L6150o407
3342.8B48528153l2515j0803K6882J1429n1633j07377j10850n2706p569j5304l308
3365.3B48174399l472p3999j58831j61782o0693l710l3453m7058J1161J13830K02283
3387.7B47958675K04384Q3745m6179n990J95086L30388K46361R3356J25274K62350
3408.1B49447450L29435L35976L38436L57836M04775M74066N37097O39379P58648Q22723
3428.5B54445821Q23855R05514J023531R34541P61331P45594Q50976R88841J122236
$$ plain form
3281.6 252458692 251423329 250524253 249765754 249135241 248624638 248168007 247719005 247350559 247102946
3300 247102946 246933565 246851087 246842563 246830508 246809751 246823773 246873945 246956989 247080624 247250006 247439310
3322.4 247439310 247594506 247718945 247851387 247994706 248134971 248278961 248412162 248498410 248534560 248528153
3342.8 248528153 248495638 248484835 248511717 248523146 248471513 248364136 248253286 248200580 248193011 248177707 248174399
3365.3 248174399 248170927 248096928 247938097 247776315 247715622 247711912 247678459 247631401 247642562 247756392 247958675
3387.7 247958675 248163059 248246804 248200625 248194635 248389721 248720109 248966470 249059826 249185100 249447450
3408.1 249447450 249776885 250112861 250451297 250809133 251213908 251687974 252225071 252864450 253623098 254445821
3428.5 254445821 255269676 256175190 257198721 258133262 258894593 259640187 260491163 261480004 262602240
3446.8B62602240J137554J101971J130223J190782J285344J378268J353264J306266
3463.2B72485912J432866J591742J509011J291036J292050J481235J682133J744270
3479.5B84510255J630306J624912J783252J832217J752674J742214J808644J898616
3495.8B98583090J932711J930058J938730J852125J793265J945258K106756K129972
3512.1C14211965K049058J941204K008260K202898K390653K390891K172232K077162
3528.4C31444323K202511K378732K529025K533317K414584K467602K672583K800524
3544.7C51443201K695680K513349K555996K706200K785772K896458L013253K994657
3561.1C73604566K951413L113717L450841L472596L209204L157139L339827L544151
$$ plain form
3446.8 262602240 263739794 264841765 265971988 267162770 268448114 269826382 271179646 272485912
3463.2 272485912 273918778 275510520 277019531 278310567 279602617 281083852 282765985 284510255
3479.5 284510255 286140561 287765473 289548725 291380942 293133616 294875830 296684474 298583090
3495.8 298583090 300515801 302445859 304384589 306236714 308029979 309975237 312081993 314211965
3512.1 314211965 316261023 318202227 320210487 322413385 324804038 327194929 329367161 331444323
3528.4 331444323 333646834 336025566 338554591 341087908 343502492 345970094 348642677 351443201
3544.7 351443201 354138881 356652230 359208226 361914426 364700198 367596656 370609909 373604566
3561.1 373604566 376555979 379669696 383120537 386593133 389802337 392959476 396299303 399843454
3577.4C99843454L704965L792078L802836L834933L884762L865898L828943L945350
3593.7D30503219M055053M052967M090309M151464M162311M172832M261673M257351
3610D63707179M213929M294783M333377M411578M483789M210740L980995M169851M716486
3628.4E02522707M776061M148483L976464M123986M201352M243017M185736M080653
3644.7E36258459M174531M475295M350484L785312L604233L812194L786445L569722
3661E67816675L484130L539800L525734L383935L268420L142953L056944K860903K582908
3679.4E96662402K544582K667248K788484K855719K568244K029121J830519J906097
3695.7F15852416J987755J984358J853585J665235J617670J719355J778543J598776
$$ plain form
3577.4 399843454 403548419 407340497 411143333 414978266 418863028 422728926 426557869 430503219
3593.7 430503219 434558272 438611239 442701548 446853012 451015323 455188155 459449828 463707179
3610 463707179 467921108 472215891 476549268 480960846 485444635 489655375 493636370 497806221 502522707
3628.4 502522707 507298768 511447251 515423715 519547701 523749053 527992070 532177806 536258459
3644.7 536258459 540432990 544908285 549258769 553044081 556648314 560460508 564246953 567816675
3661 567816675 571300805 574840605 578366339 581750274 585018694 588161647 591218591 594079494 596662402
3679.4 596662402 599206984 601874232 604662716 607518435 610086679 612115800 613946319 615852416
3695.7 615852416 617840171 619824529 621678114 623343349 624961019 626680374 628458917 630057693
3712F30057693J394331J317382J303971J325905J325846J261472J137972J183749J348853
3730.3F41657174J436889J367330J094401Q76963Q93891R00030R06289J176119J230836
3748.7F51539922Q37326N84602Q29458J041294R61363Q46147Q72851Q85010Q25941
3767.1F59223914P63834P25746P16030P55370Q20279P78735O99103P16626P22468O71327
3787.5F66593432O30081O66916P75517Q17596P93577O51359M29154N48243O82175N54204
3807.8F73142254N46873P03931P23243O02305O66618O17921L43204L14951M41014N86451
3828.2F78688765O66081O51360O67274N28276K74897K57074L46780L88921M38153N81265
3848.6F83488846O65188L39090P3016L37839M63903M62771M37796L87192L95059L24965
$$ plain form
3712 630057693 631452024 632769406 634073377 635399282 636725128 637986600 639124572 640308321 641657174
3730.3 641657174 643094063 644461393 645555794 646432757 647326648 648226678 649132967 650309086 651539922
3748.7 651539922 652377248 652961850 653791308 654832602 655793965 656640112 657512963 658397973 659223914
3767.1 659223914 659987748 660713494 661429524 662184894 663005173 663783908 664483011 665199637 665922105 666593432
3787.5 666593432 667223513 667890429 668665946 669483542 670277119 670928478 671357632 671905875 672588050 673142254
3807.8 673142254 673689127 674393058 675116301 675718606 676385224 677003145 677346349 677661300 678102314 678688765
3828.2 678688765 679354846 680006206 680673480 681201756 681476653 681733727 682080507 682469428 682907581 683488846
3848.6 683488846 684154034 684493124 684566140 684903979 685367882 685830653 686268449 686655641 687050700 687375665
3869F87375665K32815K49148L32832M62353M52757L62635L21567J82271J41501K52128
3889.4F90365672K06769J45614K67684L78490L97861L20255J23263N2869R3043P5758
3909.8F92427278J54793K99215K55525R4176N9962J26839J60336J63734K04086J91629
3930.2F94137573P0453L755R6440K39551K24054J05024J27256K13265J95503J32025
3950.6F95544899Q2790O6817J09315K00808K30968J44243R7037J19090Q8692N9604
3971F96744263J31548J89066J14679P5161J82689K33650J20997N543J2577J05917K07663
3993.4F98123753K58744K11596
3997.5F98594093
$$ plain form
3869 687375665 687608480 687857628 688190460 688652813 689105570 689468205 689789772 689972043 690113544 690365672
3889.4 690365672 690572441 690718055 690985739 691364229 691762090 692082345 692205608 692258477 692351520 692427278
3909.8 692427278 692582071 692881286 693136811 693230987 693290949 693417788 693578124 693741858 693945944 694137573
3930.2 694137573 694208026 694211781 694308221 694547772 694771826 694876850 695004106 695217371 695412874 695544899
3950.6 695544899 695627689 695694506 695803821 696004629 696235597 696379840 696476877 696595967 696684659 696744263
3971 696744263 696875811 697064877 697179556 697254717 697437406 697671056 697792053 697797596 697810173 697916090 698123753
3993.4 698123753 698382497 698594093
3997.5 698594093
##END=$$ End of the data block
