##TITLE=G23-52-CE $$ Begin of the data block
##JCAMP-DX=5.00 $$ ACD/SpecManager v 10.08
##SPECTROMETER/DATA SYSTEM=Alpha
##DATE=17 Oct 2013 10:58:30
##DATA TYPE=INFRARED SPECTRUM
##DATA CLASS=XYDATA
##ORIGIN=
##OWNER=
##NPOINTS=1765
##FIRSTX=399.75695801
##LASTX=3997.56933594
##MAXX=3997.56933594
##MINX=399.75695801
##MAXY=0.78542686
##MINY=0.23145966
##XFACTOR=1.0000000000
##YFACTOR=1.000000000000000e-9
##FIRSTY=0.47640938
##DELTAX=2.03957629
##XUNITS=1/CM
##YUNITS=ARBITRARY UNITS
##XYDATA=(X++(Y..Y))
399.8D76409376l376335n722046m162431O03855L924131K654672j228035l026127j061082
$$ 476409376 473033041 467310995 463148564 463752419 467676550 470331222 469103187 466077060 465015978
418.1D65015978J912474J546115j470000m151255l976136j257688J170755Q44270j495391
$$ 465015978 466928452 468474567 467004567 462853312 458877176 457619488 458790243 459634513 458139122
436.5D58139122k543629n15073L071874M609883K063185j719803k866000r24319J526624
$$ 458139122 455595493 455080420 458152294 462762177 464825362 463105559 460239559 459315240 460841864
454.8D60841864J363516j935422m761815m348964j643449M19259l00348l051757m828096
$$ 460841864 462205380 460269958 455508143 451159179 449515730 449934989 449634641 446582884 441754788
473.2D41754788l233731l1680J411975j23411k680809l209442j197993R58085Q85218
$$ 441754788 438521057 438489377 439901352 439777941 437097132 433887690 432689697 433647782 434533000
491.5D34533000j620680m141688m123122j705795K02834p92771l407777m886567m004419
$$ 434533000 432912320 428770632 424647510 422941715 423144549 422351778 418944001 414057434 410053015
509.9D10053015j726777m77880j633525l757447m157185k219230L24845J370907K00838
$$ 410053015 408326238 407848358 406214833 402457386 398300201 396080971 396405816 397776723 397977561
528.3C97977561j335830r30190J546771M077821M469663K415419M1693m19259R65357
$$ 397977561 396641731 395711541 397258312 401336133 405805796 408221215 408262908 407843649 408809006
546.6D08809006J940519N73933k120614l467202k441675m92424K10822j366079l843456
$$ 408809006 410749525 411323458 409202844 405735642 403293967 402801543 403012365 401646286 397802830
565C97802830m488498k602756j38372R36836L63141m91649K04116K600074M716039
$$ 397802830 393314332 390711576 390573204 391510040 391873181 391381532 391585648 394185722 398901761
583.3C98901761M531443K313137K75373L1561J260608K221108J244396j018763k064079
$$ 398901761 403433204 405746341 406021714 406053275 407313883 409534991 410779387 409760624 407696545
601.7D07696545q11666J270503K058088Q76189r14395j294375J83374K238453K980500
$$ 407696545 406884879 408155382 410213470 411089659 410175264 408880889 409064263 411302716 414283216
620D14283216J998723Q99612J154274K741724M121423L727615J688302L8296M40538
$$ 414283216 416281939 417181551 418335825 421077549 425198972 428926587 430614889 430653185 431093723
638.4D31093723K198934L208071K205759l218j283109l84719J450122K055704O72251
$$ 431093723 433292657 436500728 438706487 438703269 437420160 437035441 438485563 440541267 441213518
656.7D41213518j210987j417518J21087J448333J878709J154840l69579j34796J645983
$$ 441213518 440002531 438585013 438706100 440154433 442033142 443187982 442818403 442683607 444329590
675.1D44329590L276109K940744J054436m29183j12235J456886K272785J034230j383275
$$ 444329590 447605699 450546443 451600879 451171696 451059461 452516347 454789132 455823362 454440087
693.5D54440087k734214j766503M70340J845330J306296o974K6375J937807M175573
$$ 454440087 451705873 449939370 450409710 452255040 453561336 453554362 453580737 455518544 459694117
711.8D59694117M891038L717035K271593K586663M723817O532550O276935M098088
$$ 459694117 464585155 468302190 470573783 473160446 477884263 484416813 490693748 494791836
728.1D94791836K008646J975745L533215M427373L057480K34544j509130p46190J175284
$$ 494791836 496800482 498776227 502309442 506736815 509794295 510028839 508519709 507773519 508948803
746.5E08948803J855075K27034k356708l337145j904189K08020Q93951k67566j540661
$$ 508948803 510803878 511030912 508674204 505337059 503432870 503640890 504534841 504267275 502726614
764.8E02726614o56187K517402N801797O770790N157709L279865L407597N258799O464541
$$ 502726614 502070427 504587829 510389626 517160416 522318125 525597990 529005587 534264386 540728927
783.2E40728927N200028K151012m529N47766K972722M707039L984868J764596P78079
$$ 540728927 545928955 548079967 548075438 548623204 551595926 556302965 560287833 562052429 562830508
801.6E62830508K375960M877865N412221K974332l22879j483023J37806K213121J946330
$$ 562830508 565206468 570084333 575496554 578470886 578148007 576664984 576802790 579015911 580962241
819.9E80962241r80616m030228m567325k654433p28726j109720l568112n455256m756451
$$ 580962241 579981625 575951397 571384072 568729639 568000913 566891193 563323081 557867825 553111374
838.3E53111374k272844m75764r76503k870858l722250k321959J28687J273632J70111
$$ 553111374 550838530 550362766 549386263 546515405 542793155 540471196 540599883 541873515 542043626
856.6E42043626j468777j005769K273977O279826Q145928O952226M457057L149152
$$ 542043626 540574849 539569080 541843057 548122883 556268811 563221037 567678094 570827246
872.9E70827246L570556L715814J498341k543151n853892o572306n144954l790795
$$ 570827246 574397802 578113616 579611957 577068806 571214914 564642608 559497654 555706859
889.3E55706859m286468o038309o916523n945265m241109l696739n132676p394909
$$ 555706859 551420391 545382082 538465559 532520294 528279185 524582446 519449770 512054861
905.6E12054861q575917q002698o657064n963504o326795o739587n859077l532707
$$ 512054861 503478944 495476246 488819182 482855678 476528883 469789296 463930219 460397512
921.9D60397512j104206j21921p89226j793742j738518n53757N66572M86225p60645
$$ 460397512 459293306 459171385 458382159 456588417 454849899 454296142 454862714 455348939 454588294
940.2D54588294k229452l327519m361719n871683p920116r908468j0993272j0828525
$$ 454588294 452358842 449031323 444669604 438797921 430877805 420969337 409976065 399147540
956.6C99147540r997934r524196r882778j0577649j0672510r784549q365601p120639
$$ 399147540 389149606 379625410 369742632 359164983 348492473 338707924 330342323 323221684
972.9C23221684o361187n789250m847646l410309k005637j248479j263708j621932
$$ 323221684 316860497 311071247 306223601 302813292 300807655 299559176 298295468 296673536
989.2B96673536j682877j183123m81963p9959j09315k77162j83374J30177J82629l28094
$$ 296673536 294990659 293807536 293325573 293245614 293136299 292859137 292675763 292805940 292988569 292660475
1009.6B92660475j187146j827657j858205j448184j118064j260191j825780k311110
$$ 292660475 291473329 289645672 287787467 286339283 285221219 283961028 282135248 279824138
1025.9B79824138k255351j798749j475095j604051k019912k303242k165378j733094
$$ 279824138 277568787 275770038 274294943 272690892 270670980 268367738 266202360 264469266
1042.2B64469266j390010j352966j454830j250893n41508L81261J068085J329392J371384
$$ 264469266 263079256 261726290 260271460 259020567 258479059 258860320 259928405 261257797 262629181
1060.6B62629181J598925K094596K322167J598120J6183j309455j340300j50084J405626
$$ 262629181 264228106 266322702 268644869 270242989 270259172 268949717 267609417 267459333 268864959
1078.9B68864959K632976L312111L610164L906697M348069M606188M292547L476203
$$ 268864959 271497935 274810046 278420210 282326907 286674976 291281164 295573711 299049914
1095.2B99049914K555489J905829J664013J634687J561910J459122J554072K011120
$$ 299049914 301605403 303511232 305175245 306809932 308371842 309830964 311385036 313396156
1111.6C13396156K662837L042370K830387K188682J608938J499385J874417K342462
$$ 313396156 316058993 319101363 321931750 324120432 325729370 327228755 329103172 331445634
1127.9C31445634K511442K337188K060741J882463J647234J062990J67429o55800r81569
$$ 331445634 333957076 336294264 338355005 340237468 341884702 342947692 343115121 342459321 341477752
1146.2C41477752o86914j07646K60532K95639M05192J041979K205610L426314M139781
$$ 341477752 340790838 340683192 340943724 341239363 341644555 342686534 344892144 348318458 352458239
1164.6C52458239M213661M163354M634172N669951O711245P140994O920129O619513
$$ 352458239 356671900 360835254 365469426 371139377 377850622 384991616 391911745 398531258
1180.9C98531258O657571O878614O763041N829692M210949K616316J598269J091897
$$ 398531258 405188829 412067443 418830484 424660176 428871125 431487441 433085710 434177607
1197.2D34177607N61178l15756j227676j561761j066983j93119K71469l3796o75261
$$ 434177607 434738785 434423029 433195353 431633592 430566609 430373490 430644959 430611163 429935902
1215.6D29935902r71049p62760m90278o95140j446604k198220k371966j918137j300961
$$ 429935902 428964853 428202093 427711815 427016675 425570071 423371851 420999885 419081748 417780787
1233.9D17780787j017869j102000j062811m49687O09398J584113K002358J877189J707941
$$ 417780787 416762918 415660918 414598107 414148420 414757818 416341931 418344289 420221478 421929419
1252.3D21929419J954585K541185K933264K709508K054482J624167J839340K428412
$$ 421929419 423884004 426425189 429358453 432067961 434122443 435746610 437585950 440014362
1268.6D40014362K702982K258449J380057P61836Q17687J332283J646220J393736Q77797
$$ 440014362 442717344 444975793 446355850 447117686 447935373 449267656 450913876 452307612 453185409
1287D53185409N79000O63251P64697L61115o21021j628428k061338j859843j487911
$$ 453185409 453764409 454427660 455192357 455553472 454932451 453304023 451242685 449382842 447894931
1305.3D47894931j461238j779467j959830j557082o63132K00063N15700J69039m38333
$$ 447894931 446433693 444654226 442694396 441137314 440474182 440674245 441189945 441358984 440920651
1323.7D40920651q87275j164734j498342k009391k500594k528787j953691j120210
$$ 440920651 440033376 438868642 437370300 435360909 432860315 430331528 428377837 427257627
1340D27257627n82069n74171r10759j220614j256734j151771j244753j724035k329826
$$ 427257627 426675558 426101387 425190628 423970014 422713280 421561509 420316756 418592721 416262895
1358.3D16262895k741575l006518l258467l526330l724128l498882l108174k986312
$$ 416262895 413521320 410514802 407256335 403730005 400005877 396506995 393398821 390412509
1374.7C90412509k991676l197878l694147l961563l406346k181173r39428k86371j98066
$$ 390412509 387420833 384222955 380528808 376567245 373160899 370979726 370040298 369753927 369555861
1393C69555861l13699j72318K90782P77453J116186J289308J319856J486540J834929
$$ 369555861 369242162 369069844 369360626 370138079 371254265 372543573 373863429 375349969 377184898
1411.4C77184898K041131K032608K096057K295941K283811K413422K474547J944840
$$ 377184898 379226029 381258637 383354694 385650635 387934446 390347868 392822415 394767255
1427.7C94767255J103311L12060o2316j08361j32472j01119O2048K97785O63579R49502
$$ 394767255 395870566 396182626 396120310 396011949 395879477 395778358 395840406 396138191 396801770 397751272
1448.1C97751272P55816K84374L56138J574069K966494K960562K872974L193408L446877
$$ 397751272 398507088 398791462 399147600 400721669 403688163 406648725 409521699 412715107 416161984
1466.4D16161984M164160O227463R050757R382754P336498N523234M181028L003895
$$ 416161984 420326144 426553607 435604364 444987118 452323616 457846850 462027878 465031773
1482.8D65031773J576602j79380k318501m224271m739344m984736n936325o507248
$$ 465031773 466608375 466428995 464110494 459886223 455146879 450162143 444225818 437718570
1499.1D37718570o385445o115377p089168r653777r343773q182466p933080o773621
$$ 437718570 431333125 425217748 418128580 408474803 399131030 390948564 383015484 376241863
1515.4C76241863m709482k694190k098650k593159k999097l169686k709568k179771
$$ 376241863 371532381 368838191 366739541 364146382 361147285 357977599 355268031 353088260
1531.7C53088260k156139j945078j405567j096159n97060L08394J056642J693219K477646
$$ 353088260 350932121 348987043 347581476 346485317 345888257 346196651 347253293 348946512 351424158
1550.1C51424158L312260M052877M507661N470246N556017L554195L060073L360808
$$ 351424158 354736418 358789295 363296956 368767202 374323219 377877414 380937487 384298295
1566.4C84298295L383398K994478J987338J544058J641244J281768Q20666M01587k9773
$$ 384298295 387681693 390676171 392663509 394207567 395848811 397130579 397951245 398352832 398323059
1584.7C98323059l15219m15802o16193j051217j743496k471238l074378l608286m142881
$$ 398323059 398007840 397592038 396975845 395924628 394181132 391709894 388635516 385027230 380884349
1603.1C80884349m832208n778193o902963p557869p592440q316338j0019898r736002
$$ 380884349 376052141 370273948 363370985 355813116 348220676 339904338 329884440 320148438
1619.4C20148438r561002j0987163j0989338j0185748r779245q739650q062422q231640
$$ 320148438 310587436 299600273 288610935 278425187 268645942 259906292 251843870 243612230
1635.7B43612230o205887l375053j804576p67052J36718Q32558J092747J748562K658948
$$ 243612230 237406343 234031290 232226714 231459662 231596380 232428938 233521685 235270247 237929195
1654.1B37929195K452925K614826L713250N138263O019235N932391O585210P527948
$$ 237929195 240382120 242996946 246710196 251848459 257867694 263800085 270385295 277913243
1670.4B77913243P176667P650703Q473695P977575P673233Q886516J1417509J1031776
$$ 277913243 285089910 292740613 301214308 309191883 316865116 325751632 337169141 348200917
1686.7C48200917J0073126J1210918J1967570J4548719J7029374J7380238J8799812
$$ 348200917 358274043 369484961 381452531 396001250 413030624 430410862 449210674
1701D49210674J5509098J2634158J2328774J0788709R432137Q418322P518768O963790
$$ 449210674 464719772 477353930 489682704 500471413 509903550 518321872 525840640 532804430
1717.3E32804430N816936M688621M397392L984094L063917K384960K154470K490520
$$ 532804430 538621366 543309987 547707379 551691473 554755390 557140350 559294820 561785340
1733.6E61785340K440989J908183J911879K290130L119409M451930N793989O844699
$$ 561785340 564226329 566134512 568046391 570336521 573455930 577907860 583701849 590546548
1749.9E90546548P176578O785095P138848P717073P469953P022500N977749N271852
$$ 590546548 597723126 604508221 611647069 619364142 626834095 633856595 639834344 645106196
1766.3F45106196N506814N768657N688548M651248L410816L198624L571987L717303
$$ 645106196 650613010 656381667 662070215 666721463 670132279 673330903 676902890 680620193
1782.6F80620193L377200K669632K099633K178729K716124K776504K347171J848817
$$ 680620193 683997393 686667025 688766658 690945387 693661511 696438015 698785186 700634003
1798.9G00634003J528322J641691K054870K315283K047837J432955J052439J341880
$$ 700634003 702162325 703804016 705858886 708174169 710222006 711654961 712707400 714049280
1815.2G14049280J924932K115726J693547J119554R20653J280368J835227J799047
$$ 714049280 715974212 718089938 719783485 720903039 721823692 723104060 724939287 726738334
1831.5G26738334J160502O24061O06000J067758J570701J600743R48071L34144M10557
$$ 726738334 727898836 728522897 729128897 730196655 731767356 733368099 734316170 734650314 735060871
1849.9G35060871R63032J356363J210690O73115K53737L72887R49502J359760J121700
$$ 735060871 736023903 737380266 738590956 739264071 739517808 739890695 740840197 742199957 743321657
1868.2G43321657M09007J5676L35872R51350J246870R39309L88742J74224N15640J081228
$$ 743321657 743730664 743746340 744082212 745033562 746280432 747219741 747608483 747782707 748298347 749379575
1888.6G49379575J213610P47204K17855J14143M87089R28581R45389N33581R9897L2604
$$ 749379575 750593185 751340389 751558244 751672387 752159476 753088057 754033446 754567027 754666924 754699528
1909G54699528M16458Q30352Q32439M39405K0027K9624M72724Q07345O58631K07603
$$ 754699528 755115986 755946338 756778777 757218182 757238209 757267833 757740557 758547902 759206533 759414136
1929.4G59414136j00135L1113M49121P36535N76436J20402j68383L6180M95195O99341
$$ 759414136 759314001 759345114 759794235 760530770 761107206 761227608 761059225 761095405 761590600 762289941
1949.8G62289941M60029O1512o2347J93596N64635O70016L99828J2159q6009K23458
$$ 762289941 762749970 762811482 762749135 762942731 763507366 764177382 764577210 764589369 764503360 764726818
1970.2G64726818N91456O02425K30968j20938j14262K26080N26667M64856J18673j42395
$$ 764726818 765318274 765920699 766151667 766030729 765916467 766142547 766669214 767134070 767252743 767110348
1990.6G67110348p8917K35021M75407L57032j2398k64108j33991J88112L02851O7771
$$ 767110348 767031431 767266452 767741859 768098891 768086493 767822385 767688394 767876506 768179357 768247128
2011G68247128k96951m36902k46942K7597P7307j50084m45128m89115k39611M0054
$$ 768247128 767950177 767513275 767266333 767293930 767371237 767221153 766776025 766286910 766047299 766087353
2031.4G66087353K8134k75672n13375m31537j08838J31011M7147k50816m05610k40445
$$ 766087353 766115487 765839815 765326440 764894903 764786065 764917076 764964223 764713407 764307797 764067352
2051.8G64067352J09494L11195J62125j28150k03192K0087L01063L73244J61350j26481
$$ 764067352 764176846 764488041 764650166 764522016 764318824 764338911 764639974 765013218 765174568 765048087
2072.2G65048087j95086K6226L01182L33309O7413k03609j49310J64032L97026L18468
$$ 765048087 764853001 764879227 765180409 765513718 765581131 765377522 765228212 765392244 765789270 766107738
2092.6G66107738L0816j67728n2035K52486M19378K98381J1682j37090R655K89262
$$ 766107738 766138554 765970826 765918791 766171277 766590655 766889036 766900718 766763628 766773283 767062545
2113G67062545L96073K04444r6143j84714J7046K88845L53515J22070j55389j53363
$$ 767062545 767458618 767663062 767566919 767382205 767399251 767688096 768041611 768163681 768008292 767854929
2133.4G67854929J23739L72410L58582Q6605j73151j39296J52349L94106L38197O7949
$$ 767854929 767978668 768351078 768709660 768796265 768623114 768483818 768636167 769030273 769368470 769436419
2153.8G69436419j04785L8803L82244N88537M63187J75238O1691K67923N89668O97255
$$ 769436419 769331634 769370437 769752681 770341218 770804405 770979643 771041334 771309257 771898925 772596180
2174.2G72596180M99726K09272J34170L52680O37532O85572M41969J57296J14203L68059
$$ 772596180 773095906 773305178 773439348 773792028 774429560 775115132 775557101 775714397 775828600 776196659
2194.6G76196659O50763O49989L49939Q0049J24573L86179O11007N96702L27349P7426
$$ 776196659 776847422 777497411 777847350 777927399 778051972 778438151 779049158 779645860 779973209 780050635
2215G80050635J20461M12286O12795M60505J17422m3810J10328L76344M66108K82050
$$ 780050635 780171096 780583382 781196177 781656682 781774104 781730294 781840622 782216966 782683074 782965124
2235.4G82965124j0431j22190O6340L58403M34577K01166j08957j85311M5896L30746
$$ 782965124 782954693 782832503 782898843 783257246 783691823 783892989 783784032 783598721 783644617 783975363
2255.8G83975363L54469J06871j04487q1182J31607L69907L47793J0192k88427k16722
$$ 783975363 784329832 784436703 784332216 784251034 784382641 784752548 785100341 785110533 784822106 784605384
2276.1G84605384J59860M08828K52783j05739l27348k20657R0003K45035M8816l08752
$$ 784605384 784765244 785174072 785426855 785321116 784993768 784773111 784863114 785108149 785156965 784848213
2296.5G84848213m35471k18869R0659J73032o3896l92020m78863k51711K6048O9439
$$ 784848213 784412742 784193873 784284532 784457564 784393668 784001648 783522785 783271074 783297122 783366561
2316.9G83366561j90020n24759n99265l18468L0399N3942k64227m92096m26293k45035
$$ 783366561 783176541 782651782 782052517 781734049 781764448 781818390 781554163 781062067 780635774 780390739
2337.3G80390739o7174n0545k36273m36902m68432l62278k50756k75016m02212m71771
$$ 780390739 780323565 780273020 780036747 779599845 779131413 778769135 778518379 778243363 777841151 777369380
2357.7G77369380n37097l84570r417L6716l24130m27842j05917J77681J02639k46823
$$ 777369380 776832283 776447713 776438296 776475012 776150882 775723040 775617123 775794804 775897443 775650620
2378.1G75650620m65393l74734j47045k980j04487m37796p12335o66082l78013j58846
$$ 775650620 775185227 774810493 774663448 774660468 774555981 774118185 773405850 772739768 772361755 772202909
2398.5G72202909k74122o15299q14139o99818m22717l13401n28931q20160q98004p35402
$$ 772202909 771928787 771313488 770499349 769799531 769376814 769063413 768534482 767714322 766816318 766080916
2418.9G66080916n01633m65333o99818r52900r84430p78377n33521n42522q04305j023292
$$ 766080916 765579283 765113950 764414132 763461232 762476802 761698425 761164904 760622382 759818077 758794785
2439.3G58794785r92358p61807n70774n96106q15153j018882r79185p19071n20766
$$ 758794785 757802427 757040620 756469846 755873740 755058587 754039705 753060520 752341449 751820683
2457.7G51820683o13033r01819j047372q83699o09398m86374o38306r33826j049041
$$ 751820683 751207650 750305831 749258459 748374760 747765362 747278988 746640682 745706856 744657815
2476G44657815q53599n50150m61221o85156r46462r50575p28190m99606m73141o87361
$$ 744657815 743804216 743254066 742792845 742107689 741161227 740210652 739482462 738982856 738509715 737822354
2496.4G37822354r20832q97587o12616l73364m45604p48217r51111q26955n16057l77238
$$ 737822354 736901522 736003935 735391319 735017955 734572351 733824134 732873023 732046068 731530011 731152773
2516.8G31152773n43773q16226r47893q33094n71013m50849o56724r61602j034915
$$ 731152773 730609000 729792774 728844881 728011787 727440774 726989925 726333201 725371599 724336684
2535.2G24336684q56400o12259n25415p00950r56595j018822q21829n43237m87864
$$ 724336684 723480284 722868025 722342610 721641660 720685065 719666243 718844414 718301177 717813313
2553.5G17813313p45714j012325r93729p18951m57585m90248p81953j017392r49919
$$ 717813313 717067599 716055274 715061545 714342594 713885009 713394761 712612808 711595416 710645497
2571.9G10645497o51360m62651n69999q39830j015603r30607o64890m82619n82337
$$ 710645497 709994137 709531486 708961487 708121657 707106054 706175447 705510557 705027938 704445601
2590.2G04445601q59440j008034q69453o09457n24521p14004j003861j129687r73165
$$ 704445601 703586161 702578127 701708674 701099217 700574696 699860692 698856831 697727144 696753979
2608.6F96753979p32601p31170j013100j301825j319766j095891r16362r77934j228571
$$ 696753979 696021378 695290208 694277108 692975283 691655517 690559626 689643264 688665330 687436759
2626.9F87436759j467049j489281j276434j058399j100302j362860j540363j467824
$$ 687436759 685969710 684480429 683203995 682145596 681045294 679682434 678142071 676674247
2643.3F76674247j225710j062215j161396j410306j534283j416087j179159j034498
$$ 676674247 675448537 674386322 673224926 671814620 670280337 668864250 667685091 666650593
2659.6F66650593j132130j374185j498282j345337j062512r71735j132726j331151
$$ 666650593 665518463 664144278 662645996 661300659 660238147 659266412 658133686 656802535
2675.9F56802535j357853j185000r66966r01878j047314j232683j272261j155198r90212
$$ 656802535 655444682 654259682 653292716 652390838 651343524 650110841 648838580 647683382 646693170
2694.3F46693170r72152j164794j370728j399994j242518j102507j186013j393557
$$ 646693170 645721018 644556224 643185496 641785502 640542984 639440477 638254464 636860907
2710.6F36860907j513421j466036j278580j140773j230120j420916j467287j307607
$$ 636860907 635347486 633881450 632602870 631462097 630231977 628811061 627343774 626036167
2726.9F26036167j087904r76682j078069j303255j370728j177788r20534q58724j046718
$$ 626036167 624948263 623971581 622893512 621590257 620219529 619041741 618121207 617262483 616215765
2745.2F16215765j241385j230956j052677q76487q87632j059890j195728j174927j019478
$$ 616215765 614974380 613743424 612690747 611814260 610926628 609866738 608671010 607496083 606476605
2763.6F06476605r09627r83655j169503j284957j242637j123369j070321j185417j420319
$$ 606476605 605566978 604583323 603413820 602128863 600886226 599762857 598692536 597507119 596086800
2782E96086800j589179j562118j397074j320839j483619j732767j851081j785040j647473
$$ 596086800 594497621 592935503 591538429 590217590 588733971 587001204 585150123 583365083 581717610
2800.3E81717610j651227j846731k063811k151072k087652j972616j986623k189278
$$ 581717610 580066383 578219652 576155841 574004769 571917117 569944501 567957878 565768600
2816.6E65768600k400876k464890k427340k413570k549649k810716l037811l178060
$$ 565768600 563367724 560902834 558475494 556061924 553512275 550701559 547663748 544485688
2832.9E44485688l280282l494382l966868m696488n568802o370962o876111o899238
$$ 544485688 541205406 537711024 533744156 529047668 523478866 517107904 510231793 503332555
2849.3E03332555o306231n118221l645748k388239j762121j929820k720237l691226
$$ 503332555 497026324 491908103 488262355 485874116 484111995 482182175 479461938 475770712
2865.6D75770712m369617m488945m062235l306180k523780j917571j482814j195491
$$ 475770712 471401095 466912150 462849915 459543735 457019955 455102384 453619570 452424079
2881.9D52424079j093775j183599j399696j620293j781493j875788j967222k185761
$$ 452424079 451330304 450146705 448747009 447126716 445345223 443469435 441502213 439316452
2898.2D39316452k523214k864689l151297l424198l784001m301637m944980n522162
$$ 439316452 436793238 433928549 430777252 427353054 423569053 419267416 414322436 408800274
2914.5D08800274n777627n576104m981756m161716l160059j948029o53118N68807J724541
$$ 408800274 403022647 397446543 392464787 388303071 385143012 383194983 382541865 383110672 384835213
2932.9C84835213K809525L691673M293531M613638M608631M208178L421724K477884
$$ 384835213 387644738 391336411 395629942 400243580 404852211 409060389 412482113 414959997
2949.2D14959997J668245J144200J040906J384914J965135K632856L389955M174113
$$ 414959997 416628242 417772442 418813348 420198262 422163397 424796253 428186208 432360321
2965.5D32360321M903704N500883N849630N936771N885870N815804N689770N374550
$$ 432360321 437264025 442764908 448614538 454551309 460437179 466252983 471942753 477317303
2981.8D77317303M856766M248410L683925L246456K817899K219916J495033P53194
$$ 477317303 482174069 486422479 490106404 493352860 496170759 498390675 499885708 500638902
2998.1E00638902J16527l07321o38962r77457j205593j253903j147419r44972q52049
$$ 500638902 500755429 500448108 499809146 498831689 497626096 496372193 495224774 494279802 493427753
3016.5D93427753j010090j314491j642942j909465k012521j988888k008348k108485
$$ 493427753 492417663 491103172 489460230 487550765 485538244 483549356 481541008 479432523
3032.8D79432523k193093k231240k273500k335221k401143k477586k553881k594560
$$ 479432523 477239430 475008190 472734690 470399469 467998326 465520740 462966859 460372299
3049.1D60372299k558827k510667k543927k591252k532005k360314k189696k090007
$$ 460372299 457813472 455302805 452758878 450167626 447635621 445275307 443085611 440995604
3065.5D40995604k000362j900375j806736j691282j586258j546383j534313j503974
$$ 440995604 438995242 437094867 435288131 433596849 432010591 430464208 428929895 427425921
3081.8D27425921j453280j348287j226038j191348j212984j201689j161039j138509
$$ 427425921 425972641 424624354 423398316 422206968 420993984 419792295 418631256 417492747
3098.1D17492747j171559j255095j340866j389921j380026j362950j391053j442373
$$ 417492747 416321188 415066093 413725227 412335306 410955280 409592330 408201277 406758904
3114.4D06758904j521974j621902j696229j725227j733959j778483j847416j884103
$$ 406758904 405236930 403615028 401918799 400193572 398459613 396681130 394833714 392949611
3130.7C92949611j921773j953989j946330j954854j990855k012282k024502k054691
$$ 392949611 391027838 389073849 387127519 385172665 383181810 381169528 379145026 377090335
3147C77090335k062351k041399k075553k151519k166092k115310k085298k097398k111286
$$ 377090335 375027984 372986585 370911032 368759513 366593421 364478111 362392813 360295415 358184129
3165.4C58184129k113163k108634k103209k118260k162963k149403k057404k039343
$$ 358184129 356070966 353962332 351859123 349740863 347577900 345428497 343371093 341331750
3181.7C41331750k062976k024830k001106j995474j961559j924783j923234j938641
$$ 341331750 339268774 337243944 335242838 333247364 331285805 329361022 327437788 325499147
3198C25499147j882613j768261j710504j707315j674027j617104j622945j668900j642138
$$ 325499147 323616534 321848273 320137769 318430454 316756427 315139323 313516378 311847478 310205340
3216.4C10205340j562446j536220j582176j625150j601517j583219j659960j717835
$$ 310205340 308642894 307106674 305524498 303899348 302297831 300714612 299054652 297336817
3232.7B97336817j741350j826376j883119j882225j883328j920194k013564k083003
$$ 297336817 295595467 293769091 291885972 290003747 288120419 286200225 284186661 282103658
3249B82103658k085686k104938k154261k174199k164870k155751k118945k048105j960725
$$ 282103658 280017972 277913034 275758773 273584574 271419704 269263953 267145008 265096903 263136178
3267.4B63136178j835972j749784j691192j527190j339972j247078j171500j085818
$$ 263136178 261300206 259550422 257859230 256332040 254992068 253744990 252573490 251487672
3283.7B51487672r88423p99522n95019n00142m76673m37230l52845k46644j50218p6190
$$ 251487672 250499249 249699727 249104708 248604566 248127893 247690663 247337818 247091174 246940956 246864766
3304.1B46864766m1217m3347l5614K056O2764J34677J58354J42917J35586J29268J30191
$$ 246864766 246823549 246780202 246744588 246746644 246809408 246944085 247102439 247245356 247380942 247510210 247640401
3326.5B47640401J40548J48699J35853J30296J48773J27465L7506m1902m2379N201
$$ 247640401 247780949 247929648 248065501 248195797 248344570 248472035 248509541 248467639 248425260 248430461
3346.9B48430461L8162J818p6682j19492q3342j8180k6807n3287p435M828n5895j23083
$$ 248430461 248468623 248470441 248393759 248274267 248190925 248172745 248145938 248092651 248085216 248090044 248034149 247911066
3371.4B47911066j49772q4758q463j0238m2930k98R9451J72942J95981J34333J9491
$$ 247911066 247761294 247676536 247668073 247657835 247614905 247614607 247714058 247887000 248082981 248217314 248236805
3393.8B48236805j6048J45554L55676L00244Q5398R4011K41697L14266L64527L96252
$$ 248236805 248220757 248366311 248721987 249022231 249107629 249201640 249443337 249757603 250122130 250518382
3414.2B50518382L87042L94792M41938N19067O32078P62135Q62360Q43525Q57621R62257
$$ 250518382 250905424 251300216 251742154 252261221 252893299 253655434 254517794 255361319 256218940 257181197
3434.6B57181197R03339P61360P61240Q64208J028150J187444J164556J083940J110166
$$ 257181197 258084536 258845896 259607136 260471344 261499494 262686938 263851494 264935434 266045600
3453B66045600J183659J282036J368404J349181J330465J459300J585961J508295J303494
$$ 266045600 267229259 268511295 269879699 271228880 272559345 274018645 275604606 277112901 278416395
3471.3B78416395J276553J439184J647264J773566J679599J605362J752406J852184
$$ 278416395 279692948 281132132 282779396 284552962 286232561 287837923 289590329 291442513
3487.6B91442513J791358J776398J840591J902282J914472J934945J931846J809389
$$ 291442513 293233871 295010269 296850860 298753142 300667614 302602559 304534405 306343794
3504C06343794J769811J933723K086461K140671K114564K021313K020270K180010K363950
$$ 306343794 308113605 310047328 312133789 314274460 316389024 318410337 320430607 322610617 324974567
3522.3C24974567K285927K084911K141446K317697K412557K512962K520114K388180
$$ 324974567 327260494 329345405 331486851 333804548 336217105 338730067 341250181 343638361
3538.6C43638361K447873K704769K861113K711206K505094K592146K758474K791226
$$ 343638361 346086234 348791003 351652116 354363322 356868416 359460562 362219036 365010262
3554.9C65010262K853453K997875L031403K974748L104896L431260L468156L231377
$$ 365010262 367863715 370861590 373892993 376867741 379972637 383403897 386872053 390103430
3571.3C90103430L188133L363400L541232L690719L804565L831267L850341L880560
$$ 390103430 393291563 396654963 400196195 403886914 407691479 411522746 415373087 419253647
3587.6D19253647L864855L846824L959030M073888M099876M121005M160702M191906
$$ 419253647 423118502 426965326 430924356 434998244 439098120 443219125 447379827 451571733
3603.9D51571733M176348M210592M210650M204452M314095M325718M392296M559964
$$ 451571733 455748081 459958673 464169323 468373775 472687870 477013588 481405884 485965848
3620.2D85965848M334182M052519M161746M620254M703402M178524M051149M204750
$$ 485965848 490300030 494352549 498514295 503134549 507837951 512016475 516067624 520272374
3636.5E20272374M248500M233897M158675M048348M112184M407585M335343L814757
$$ 520272374 524520874 528754771 532913446 536961794 541073978 545481563 549816906 553631663
3652.8E53631663L629268L835916L822625L599941L506363L514767L425240L271818
$$ 553631663 557260931 561096847 564919472 568519413 572025776 575540543 578965783 582237601
3669.2E82237601L214538L121376L029347K888679K664268K582670K655983K778053
$$ 582237601 585452139 588573515 591602862 594491541 597155809 599738479 602394462 605172515
3685.5F05172515K851784K591133K086818J880169J939953K004981J975834J819790
$$ 605172515 608024299 610615432 612702250 614582419 616522372 618527353 620503187 622322977
3701.8F22322977J627326J593828J706600J765728J595676J411498J343190J331985
$$ 622322977 623950303 625544131 627250731 629016459 630612135 632023633 633366823 634698808
3718.1F34698808J331508J292646J221597J143933J217186J352787J400411J304746
$$ 634698808 636030316 637322962 638544559 639688492 640905678 642258465 643658876 644963622
3734.4F44963622J038194Q46743R03607R29951R11296J143277J189351Q70168O80208
$$ 644963622 646001816 646848559 647752166 648682117 649593413 650736690 651926041 652796209 653476417
3752.8F53476417Q69155J043081R62735Q28146Q46148Q78334Q30293P50839P45655
$$ 653476417 654345572 655388653 656351388 657179534 658025682 658904016 659734309 660485148 661230803
3771.1F61230803P95424Q18729Q36015P95960P69556P57873O84440O22213N86331O49571
$$ 661230803 662026227 662844956 663680971 664476931 665246487 666004360 666688800 667311013 667897344 668546915
3791.5F68546915Q02994Q44657P84636N86688L80993O03080P17521N31137N40912O86169
$$ 668546915 669349909 670194566 670979202 671565890 671946883 672549963 673267484 673798621 674339533 675025702
3811.9F75025702O78420N70833O56724N59986K90155L93927N10037N30124O33836P23421
$$ 675025702 675704122 676274955 676931679 677491665 677781820 678175747 678685784 679215908 679849744 680573165
3832.3F80573165P56562N56708K20775K31505L63528L61562M16696O02484O68168K80082
$$ 680573165 681329727 681886435 682107210 682338715 682702243 683063805 683480501 684082985 684751153 685031235
3852.7F85031235L8684M35710N81860M67122L64005L61383M23193K95818J51098K16782
$$ 685031235 685069919 685505629 686087489 686554611 686918616 687279999 687703192 687999010 688150108 688366890
3873.1F88366890L51489M92990M26828K87414K99752K31921K32041L33965K54393J74999
$$ 688366890 688718379 689211369 689638197 689925611 690225363 690457284 690689325 691023290 691277683 691452682
3893.5F91452682K66612L11970K56121K22028J82032J20581O5803P5698K21610L38733
$$ 691452682 691719294 692031264 692287385 692509413 692691445 692812026 692877829 692953527 693175137 693513870
3913.9F93513870K40565P3611P7427J49786J49548J83940K59221J86384L1292K9922
$$ 693513870 693754435 693828046 693905473 694055259 694204807 694388747 694647968 694834352 694865644 694895566
3934.3F94895566J39474J94013J46270J05202J66119K34305K29300J63137R7991Q5949
$$ 694895566 695035040 695229053 695375323 695480525 695646644 695880949 696110249 696273386 696371377 696457326
3954.7F96457326J00911J55270K02358J24514K0862P3611J71185J66714J63973J41203
$$ 696457326 696558237 696713507 696915865 697040379 697061241 697134852 697306037 697472751 697636724 697777927
3975.1F97777927M9651L0577J49667K88487K36034N2094j0430P3254J92046K49922
$$ 697777927 697827578 697858155 698007822 698296309 698532343 698584437 698574007 698647261 698839307 699089229
3995.5F99089229K00570
$$ 699089229 699289799
3997.5F99289799
$$ 699289799
##END=$$ End of the data block
