##TITLE=G23-52-CE $$ Begin of the data block
##JCAMP-DX=5.00 $$ ACD/SpecManager v 10.08
##SPECTROMETER/DATA SYSTEM=Alpha
##DATE=17 Oct 2013 10:58:30
##DATA TYPE=INFRARED SPECTRUM
##DATA CLASS=XYDATA
##ORIGIN=
##OWNER=
##NPOINTS=1765
##FIRSTX=399.75695801
##LASTX=3997.56933594
##MAXX=3997.56933594
##MINX=399.75695801
##MAXY=0.78620350
##MINY=0.23208281
##XFACTOR=1.0000000000
##YFACTOR=1.000000000000000e-9
##FIRSTY=0.48082066
##DELTAX=2.03957629
##XUNITS=1/CM
##YUNITS=ARBITRARY UNITS
##XYDATA=(X++(Y..Y))
399.8D80820656l849685n510986l587157O89119L446550K162516j441956k917677r34124
$$ 480820656 476970971 471459985 467872828 468561947 472008497 474171013 472729057 469811380 468877256
418.1D68877256J641720J277119j556247m340768m039407j038313J340390P21216j869083
$$ 468877256 470518976 471796095 470239848 465899080 461859673 460821360 462161750 462882966 461013883
436.5D61013883k812743n49495L017068M587918K286643j468271k837926j116008J241923
$$ 461013883 458201140 457651645 460668713 465256631 467543274 466075003 463237077 462121069 463362992
454.8D63362992J249045j830280m650622m457385j922995K25276m87387l234893m807562
$$ 463362992 464612037 462781757 458131135 453673750 451750755 451976031 451488644 448253751 443446189
473.2D43446189l173202j00643J383245J2219k511352l202468j247108R76264Q31306
$$ 443446189 440272987 440172344 441555589 441567808 439056456 435853988 434606880 435583144 436414450
491.5D36414450j720517m200370m031270j563877O2525j080275l512054m817397l909230
$$ 436414450 434693933 430493563 426462293 424898416 424960941 423880666 420368612 415551215 411641985
509.9D11641985j618892l83824j608103l818095m258573k193898M55946J453191K21938
$$ 411641985 410023093 409639269 408031166 404213071 399954498 397760600 398216546 399669737 399891675
528.3C99891675j351893j013160J522451M149527M489928K397806l5286n48393Q50946
$$ 399891675 398539782 397526622 399049073 403198600 407688528 410086334 410051048 409502655 410353601
546.6D10353601J808584N14656j984805l277957k424062o02632Q1658j392096l679157
$$ 410353601 412162185 412676841 410692036 407414079 404990017 404387385 404469043 403076947 399397790
565C99397790m440963k754420j14769J059711K92451o16104J98126K675116M840106
$$ 399397790 394956827 392202407 392087638 393147349 393439800 392823696 393021822 395696938 400537044
583.3D00537044M641473K298653J64509M4107J395256K093613Q89957j103431j928419
$$ 400537044 405178517 407477170 407641679 407685786 409081042 411174655 412064612 410961181 409032762
601.7D09032762q09878J212716K034992Q02219j008838j293064K80142K269119K957583
$$ 409032762 408222884 409435600 411470592 412272811 411263973 409970909 410251051 412520170 415477753
620D15477753J997202Q30859J139701K898544M279554L761291J563668j61171M18216
$$ 415477753 417474955 418305814 419445515 422344059 426623613 430384904 431948572 431787401 432205617
638.4D32205617K399624L321647K042056j66923j192242k18839J509637K032995P03901
$$ 432205617 434605241 437926888 439968944 439802021 438609779 438390940 439900577 441933572 442637473
656.7D42637473j114994j492262m9025J528800K211720J188099o06120j49101J730830
$$ 442637473 441522479 440030217 439981192 441509992 443721712 444909811 444303691 444154590 445885420
675.1D45885420L316372K923370R82284n31464j70261J524091K395361J060576j413614
$$ 445885420 449201792 452125162 453107446 452575982 452405721 453929812 456325173 457385749 455972135
693.5D55972135k706349j764744L62515J689941J265585J04487R0838J925081M182905
$$ 455972135 453265786 451501042 451863557 453553498 454819083 454923570 455014408 456939489 461122394
711.8D61122394M839748L565043K162069K568722M730493O586164O323874M075080
$$ 461122394 465962142 469527185 471689254 474257976 478988469 485574633 491898507 495973587
728.1D95973587J983851J961619L508627M386664L039300L11911j446485q49009J026571
$$ 495973587 497957438 499919057 503427684 507814348 510853648 511165559 509719074 508870065 509896636
746.5E09896636J848698L60369k202391l302753j997769J15633Q18252l65078j580238
$$ 509896636 511745334 512105703 509903312 506600559 504602790 504718423 505536675 505171597 503591359
764.8E03591359n65529K653777N868733O811381N183398L166736L261983N289197O564379
$$ 503591359 503025830 505679607 511548340 518359721 523543119 526709855 529971838 535261035 541825414
783.2E41825414N251705K205491L3260N60701L034591M790187L957391J640141P15852
$$ 541825414 547077119 549282610 549315870 549876571 552911162 557701349 561658740 563298881 564014733
801.6E64014733K401531M937648N505324L009140l98278j536429J78516K245426J848877
$$ 564014733 566416264 571353912 576859236 579868376 579470098 577933669 578112185 580357611 582206488
819.9E82206488j127482m075408m540622k601683o73294j077473l557682n508542m813016
$$ 582206488 581079006 577003598 572462976 569861293 569187999 568110526 564552844 559044302 554231286
838.3E54231286k278924n24402j068890k941370l734111k250910K08914J315117J86205
$$ 554231286 551952362 551427960 550359070 547417700 543683589 541432679 541641593 542956710 543142915
856.6E43142915j523316j083493K293825O334245Q089244O850839M477084L233969
$$ 543142915 541619599 540536106 542829931 549164176 557253420 564104259 568581343 571815312
872.9E71815312L540158L605068J454115k553940n879819o572962n155206l862977
$$ 571815312 575355470 578960538 580414653 577860713 571980894 565407932 560252726 556389749
889.3E56389749m351318o006241o861508n947589m233659l654361n139708p478893
$$ 556389749 552038431 546032190 539170682 533223093 528989434 525335073 520195365 512716472
905.6E12716472q641898p971168o595880n975991o381721o746381n825669l519058
$$ 512716472 504074574 496103406 489507526 483531535 477149814 470403433 464577764 461058706
921.9D61058706j108974j26898p93964j780301j708270n36412N38409M21971p87109
$$ 461058706 459949732 459822834 459028870 457248569 455540299 455003887 455542296 455964267 455177158
940.2D55177158k205998l314852m372269n893976p948339r936183j1025101j0862738
$$ 455177158 452971160 449656308 445284039 439390063 431441724 421505541 410480440 399617702
956.6C99617702j0014802r514958r862840j0546089j0652512r784072q329541p065356
$$ 399617702 389602900 380087942 370225102 359679013 349026501 339242429 330912888 323847532
972.9C23847532o355315n826146m873335l404498j974464j212358j269430j660883
$$ 323847532 317492217 311666071 306792736 303388238 301413774 300201416 298931986 297271103
989.2B97271103j700759j200199n17548r1344r9480k35319j22815Q9734P6592l50266
$$ 297271103 295570344 294370145 293852597 293761253 293661773 293426454 293303639 293393373 293469965 293119699
1009.6B93119699j143009j805097j860529j427144j081764j245320j806021k278298
$$ 293119699 291976690 290171593 288311064 286883920 285802156 284556836 282750815 280472517
1025.9B80472517k264976j852423j486838j561016k012223k335161k150953j670510
$$ 280472517 278207541 276355118 274868280 273307264 271295041 268959880 266808927 265138417
1042.2B65138417j379370j415700j497805j235694m96536M23491J076489J306862J334459
$$ 265138417 263759047 262343347 260845542 259609848 259113312 259536803 260613292 261920154 263254613
1060.6B63254613J567483K078831K286911J562923K7657j293481j341253j26750J459212
$$ 263254613 264822096 266900927 269187838 270750761 270778418 269484937 268143684 268016934 269476146
1078.9B69476146K659410L279567L571420L916145M371732M583210M251510L430128
$$ 269476146 272135556 275415123 278986543 282902688 287274420 291857630 296109140 299539268
1095.2B99539268K506703J930982J747131J677573J560867J464367J556784J990944
$$ 299539268 302045971 303976953 305724084 307401657 308962524 310426891 311983675 313974619
1111.6C13974619K644271L057271K864033K188235J576066J478315J865029K348691
$$ 313974619 316618890 319676161 322540194 324728429 326304495 327782810 329647839 331996530
1127.9C31996530K533764K338201K045721J870751J645386J081854J78337o75946r94176
$$ 331996530 334530294 336868495 338914216 340784967 342430353 343512207 343690544 343014598 342020422
1146.2C42020422o58065p5877K43545K45124L72172J054674K254575L455669M127592
$$ 342020422 341362357 341286480 341530025 341775149 342147321 343201995 345456570 348912239 353039831
1164.6C53039831M211098M172474M617691N643904O705076P152945O914317O563544
$$ 353039831 357250929 361423403 366041094 371684998 378390074 385543019 392457336 399020880
1180.9C99020880O591529O867975O787837N832851M192590K598435J588106J085609
$$ 399020880 405612409 412480384 419268221 425101072 429293662 431892097 433480203 434565812
1197.2D34565812N57453l12567j237005j593679j084864j76430K82615n4568p07149
$$ 434565812 435123265 434810698 433573693 431980014 430895150 430718720 431001335 430946767 430239618
1215.6D30239618r75639p18713m38124o76453j456320k223730k403945j928717j273632
$$ 430239618 429263979 428545266 428107142 427430689 425974369 423750639 421346694 419417977 418144345
1233.9D18144345r76532j063526j033425m44144N92917J570493J991868J857012J709789
$$ 418144345 417167813 416104287 415070862 414626718 415219635 416790128 418781996 420639008 422348797
1252.3D22348797J993627K583742K960145K709478K032489J619190J858830K441079
$$ 422348797 424342424 426926166 429886311 432595789 434628278 436247468 438106298 440547377
1268.6D40547377K681941K212941J343131P72357Q69185J339734J602441J360595Q71152
$$ 440547377 443229318 445442259 446785390 447557747 448426932 449766666 451369107 452729702 453600854
1287D53600854O16669P18654P81178L45558o44744j659899k082229j843155j450687
$$ 453600854 454217523 454936177 455717355 456062913 455418169 453758270 451676041 449832886 448382199
1305.3D48382199j436562j770943j969397j581877o53148K35468N03033J38075m45128
$$ 448382199 446945637 445174694 443205297 441623420 440970272 441205740 441708773 441846848 441401720
1323.7D41401720q79735j135170j468033k005130k524674k568006j966834j102716
$$ 441401720 440521985 439386815 437918782 435913652 433388978 430820972 428854138 427751422
1340D27751422n82397n97000r24647j230955j267940j142114j238615j733392k325475
$$ 427751422 427169025 426572025 425647378 424416423 423148483 422006369 420767754 419034362 416708887
1358.3D16708887k739787l026069l279775l527880l713488l500075l112465k975821
$$ 416708887 413969100 410943031 407663256 404135376 400421888 396921813 393809348 390833527
1374.7C90833527k991229l226698l718108l949761l375054k151548r11296k53886j57207
$$ 390833527 387842298 384615600 380897492 376947731 373572677 371421129 370509833 370255947 370098740
1393C70098740k93464j84208K80351P59035J099944J298875J321196J465023J819074
$$ 370098740 369805276 369621068 369901419 370660454 371760398 373059273 374380469 375845492 377664566
1411.4C77664566K040535K044529K105862K260089K229482K382695K443701J925797
$$ 377664566 379705101 381749630 383855492 386115581 388345063 390727758 393171459 395097256
1427.7C95097256J112491L11106p3999j13458j59114j21564O9440K85625O38008R59158
$$ 395097256 396209747 396520853 396446854 396333396 396174282 396052718 396122158 396407783 397045791 398004949
1448.1C98004949P90596L14385L67850J565367K939433K924591K843440L175109L452093
$$ 398004949 398795545 399109930 399477780 401043147 403982580 406907171 409750611 412925720 416377813
1466.4D16377813M192471O268233R077490R363323P299960N490064M165620L022551
$$ 416377813 420570284 426838517 435916007 445279330 452579290 458069354 462234974 465257525
1482.8D65257525J610756j49250k310425m250407m777491n020499n967379o522059
$$ 465257525 466868281 466719031 464408606 460158199 455380708 450360209 444392830 437870771
1499.1D37870771o381423o074667o996810r595990r384275q210688p911832o732463
$$ 437870771 431489348 425414681 418417871 408821881 399437606 391226918 383315086 376582623
1515.4C76582623m654021k623885k072037k622157k989233l115952k680540k176255
$$ 376582623 371928602 369304717 367232680 364610523 361621290 358505338 355824798 353648543
1531.7C53648543k145826j921297j361817j037121n71966K85954J033753J705289K511531
$$ 353648543 351502717 349581420 348219603 347182482 346610516 346896470 347930223 349635512 352147043
1550.1C52147043L345608M081846M550427N530834N556524L497064L025293L352791
$$ 352147043 355492651 359574497 364124924 369655758 375212282 378709346 381734639 385087430
1566.4C85087430L361881K982557K031177J593560J606137J184076P55280L67284n5492
$$ 385087430 388449311 391431868 393463045 395056605 396662742 397846818 398602098 398969382 398913890
1584.7C98913890l22908m09782o05077j027613j738251k492338l062308l562480m122883
$$ 398913890 398590982 398181200 397576123 396548510 394810259 392317921 389255613 385693133 381570250
1603.1C81570250m844070n789011o889463p520646p561475q300781j0011673r725958
$$ 381570250 376726180 370937169 364047706 356527060 348965585 340664804 330653131 320927173
1619.4C20927173r547144j1001587j1040956j0235995r813875q757204q038133q190572
$$ 320927173 311380029 300378442 289337486 279101491 269287616 260530412 252492279 244301707
1635.7B44301707o233052l426343j819789p39709J87725Q34346J065418J754567K647131
$$ 244301707 238068655 234642312 232822523 232082814 232270539 233104885 234170303 235924870 238572001
1654.1B38572001K417058K615467L730044N123138N974144N912661O619394P562489
$$ 238572001 240989059 243604526 247334570 252457708 258431852 264344513 270963907 278526396
1670.4B78526396P152557P611930Q480221Q009196P678896Q876741J1399776J0982573
$$ 278526396 285678953 293290883 301771104 309780300 317459196 326335937 337735713 348718286
1686.7C48718286J0025054J1187970J1963964J4558256J7027318J7338932J8752873
$$ 348718286 358743340 369931310 381895274 396453530 413480848 430819780 449572653
1701D49572653J5516936J2691617J2364209J0781080R437859Q448600P561207O999552
$$ 449572653 465089589 477781206 490145415 500926495 510364354 518812954 526374161 533373713
1717.3E33373713N838395M708111M401028L972292L059506K383888K159536K530456
$$ 533373713 539212108 543920219 548321247 552293539 555353045 557736933 559896469 562426925
1733.6E62426925K491653J921177J883387K254427L118217M481077N831897O855249
$$ 562426925 564918578 566839755 568723142 570977569 574095786 578576863 584408760 591264009
1749.9E91264009P155240O774962P142425P701158P429958O988227N969286N303144
$$ 591264009 598419249 605194211 612336636 620037794 627467752 634455979 640425265 645728409
1766.3F45728409N567372N808532N690933M627168L379702L181875L572643L725946
$$ 645728409 651295781 657104313 662795246 667422414 670802116 673983991 677556634 681282580
1782.6F81282580L382504K674997K107501K172947K694845K788305K392769J857936
$$ 681282580 684665084 687340081 689447582 691620529 694315374 697103679 699496448 701354384
1798.9G01354384J490713J629471K097786K364814K051592J387298J009345J339853
$$ 701354384 702845097 704474568 706572354 708937168 710988760 712376058 713385403 714725256
1815.2G14725256J944363K132595J678824J090884R31740J300931J824975J787245
$$ 714725256 716669619 718802214 720481038 721571922 722503662 723804593 725629568 727416813
1831.5G27416813J179338O49631N91874J036227J581132J637101R54390L07858L82841
$$ 727416813 728596151 729245782 729837656 730873883 732455015 734092116 735046506 735354364 735737205
1849.9G35737205R72032J418948J268864O61731K22146L75271R43959J333773J105964
$$ 735737205 736709237 738128185 739397049 740058780 740280926 740656197 741600156 742933929 744039893
1868.2G44039893M03166J0490L38376R59337J239419R23216L98219J98662N24223J069248
$$ 744039893 744443059 744453549 744791925 745751262 746990681 747913897 748312116 748510778 749035001 750104249
1888.6G50104249J192688P45655K39312J21117M74870R40681R74059N25176O3837L4272
$$ 750104249 751296937 752042592 752281904 752403021 752877891 753818572 754792631 755317807 755381644 755415916
1909G55415916M59552Q60095Q28088L95596k8789J6510M78923Q35181O86884J92821
$$ 755415916 755875468 756735563 757563651 757959247 757930458 757946968 758425891 759261072 759947956 760140777
1929.4G60140777j19508N7221M70638P01249N29349J13427j52170L6120M76956O99520
$$ 760140777 760021269 760078490 760549128 761250377 761779726 761893153 761740983 761777103 762254059 762953579
1949.8G62953579M83394O2883p7903K16067O23524O81936L32058m7028r4116K28942
$$ 762953579 763436973 763499856 763421953 763638020 764261544 764943480 765275538 765228510 765134394 765363336
1970.2G65363336N88357N98669K57075p2420p9035K40266N21242M45724J00672j60157
$$ 765363336 765951693 766550362 766807437 766735017 766655982 766896248 767417490 767863214 767963886 767803729
1990.6G67803729r6858K34664M88281L57270k6047k61367j11103J93477K74718J9193
$$ 767803729 767706871 767941535 768429816 768787086 768761039 768499672 768388569 768582046 768856764 768875957
2011G68875957l17276m05848k11775N1081Q9168j56641m52339m89891k30312L0637
$$ 768875957 768558681 768152833 767941058 767992139 768081307 767924666 767472327 766982436 766752124 766782761
2031.4G66782761q047k89738n07534m21464p8380J46925K5749k45452l63051k17975
$$ 766782761 766774714 766484976 765977442 765555978 765477598 765624523 765650272 765404820 765041769 764823794
2051.8G64823794J23680L34561J74999j18077k14576k2352K79128L69549J51038j28746
$$ 764823794 764947474 765282035 765457034 765338957 765124381 765102029 765381157 765750706 765901744 765772998
2072.2G65772998j85966M5955L22998L42846P2896j85192j34050J52707L74317K96294
$$ 765772998 765587032 765632987 765955985 766298831 766371727 766186535 766052485 766205192 766579509 766875803
2092.6G66875803Q703j77980m9293K67565M49539L25620K5451j30355J8000L14117
$$ 766875803 766884506 766706526 766657233 766924798 767374337 767699957 767725408 767595053 767613053 767927170
2113G67927170M19974J98007j21296k09152J3470L04103L52383J15692j50263j65224
$$ 767927170 768347144 768545151 768423855 768214703 768228173 768532276 768884659 769000351 768850088 768684864
2133.4G68684864R8527L64244L58760O6638j96815j33276J88470M39584L56675N9068
$$ 768684864 768783391 769147635 769506395 769573033 769376218 769242942 769431412 769870996 770227671 770286739
2153.8G70286739j13249K1339L57389N84900M76241J72914N9366L05354O35863O92486
$$ 770286739 770173490 770194829 770552218 771137118 771613359 771786273 771845639 772150993 772786856 773479342
2174.2G73479342M52698J69575J29700L73184O50764O81758M38809J62542J15871L71993
$$ 773479342 773932040 774101615 774231315 774604499 775255263 775937021 776375830 776538372 776654243 777026236
2194.6G77026236O73235O62863L48091O8545R4116L90947O39021N81801L03090Q8334
$$ 777026236 777699471 778362334 778710425 778778970 778873086 779264033 779903054 780484855 780787945 780876279
2215G80876279J36137L82364N70297M68433J39117n1737J04010L96371M82917K64764
$$ 780876279 781012416 781394780 781965077 782433510 782572627 782520890 782624900 783021271 783504188 783768952
2235.4G83768952k6703r6381J00971L56912M11034J94192j04487j80483N5313L46839
$$ 783768952 783742249 783645868 783746839 784103751 784514785 784708977 784604490 784424007 784479320 784826159
2255.8G84826159L85285J07884j48177j08242J11818L43144L59416M3095k65360k02775
$$ 784826159 785211444 785319328 785171151 785062909 785174727 785517871 785877287 785920382 785655022 785452247
2276.1G85452247J51336L76761K23160r9421l01957k08080R6738K25783K3484k74837
$$ 785452247 785603583 785980344 786203504 786104083 785802126 785594046 785690784 785916567 785940051 785665214
2296.5G85665214l93867k37942L7968J36733n6326l44158m06086j93119K7001Q464
$$ 785665214 785271347 785033405 785071373 785208106 785151780 784807622 784401536 784208417 784235418 784243882
2316.9G84243882k49625n14447n40138k64108M2200N2393j97649m05789m31597k87473
$$ 784243882 783994257 783479810 782939672 782675564 782717764 782770157 782572508 782166719 781735122 781447649
2337.3G81447649o8843m1068k30133m76838n47528m02808k36988k23339l56436m70340
$$ 781447649 781378806 781337738 781107605 780630767 780083239 779680431 779443443 779220104 778863668 778393328
2357.7G78393328n27024l88384o0320r54l29852m16636j25527J22129O7711k62320
$$ 778393328 777866304 777477920 777417600 777416646 777086794 776670158 776544631 776666760 776734471 776472151
2378.1G76472151n05089m10080j44780m590j33276m55439o94096o34014l70384j77443
$$ 776472151 775967062 775556982 775412202 775407612 775274336 774818897 774124801 773490787 773120403 772942960
2398.5G72942960k81810o17743q20160o97195m34042l49342n49019p99417q77619p37190
$$ 772942960 772661150 772043407 771223247 770526052 770092010 769742668 769193649 768394232 767516613 766779423
2418.9G66779423n00381m50015o97255r80914r98199p56621n20349n58078q32439j035571
$$ 766779423 766279042 765829027 765131772 764150858 763152659 762396038 761875689 761317611 760485172 759449601
2439.3G59449601r59992p19428n62728o21974q62181j052857r68158o69599m76718
$$ 759449601 758489609 757770181 757207453 756585479 755723298 754670441 753702283 753032684 752555966
2457.7G52555966o02007r03010j043320q73744n82695m67599o68525r79722j045763
$$ 752555966 751953959 751050949 750007629 749133885 748551190 748083591 747415066 746435344 745389581
2476G45389581p97153n21600n04434p31409r53674r39488p04706m86374m93705p19011
$$ 745389581 744592428 744070828 743566394 742834985 741881311 740941823 740237117 739750743 739257038 738538027
2496.4G38538027r31084q92878o16908l61204m13895p47263r69887q32915n08428l52085
$$ 738538027 737606943 736714065 736097157 735735953 735322058 734574795 733604908 732771993 732263565 731911480
2516.8G31911480n20110q34882r91225q43406n54681m52280o66857r51826j014590
$$ 731911480 731391370 730556488 729565263 728721857 728167176 727714896 727048039 726096213 725081623
2535.2G25081623q31902n94795n44548p38144r85444j041472q25226n18918m58121
$$ 725081623 724249721 723654926 723110378 722372234 721386790 720345318 719520092 719001174 718543053
2553.5G18543053p36177j042366j038373p23839m35769m80056p80761j003623r35376
$$ 718543053 717806876 716764510 715726137 715002298 714566529 714086473 713305712 712302089 711366713
2571.9G11366713o61135m59134n45860q45789j038135r31859o53743m69745n79834
$$ 711366713 710705578 710246444 709700584 708854795 707816660 706884801 706231058 705761313 705181479
2590.2G05181479q75592j012623q55923n93543n15878p36654j030207j110732r54211
$$ 705181479 704305887 703293264 702437341 701843798 701327920 700591266 699561059 698450327 697496116
2608.6F97496116p55191p38978r80496j276434j321793j104295r16004r80854j247942
$$ 697496116 696740925 696001947 695021451 693745017 692423224 691318929 690402925 689422071 688174129
2626.9F88174129j483977j474500j245439j064420j130044j381219j562655j465320
$$ 688174129 686690152 685215652 683970213 682905793 681775749 680394530 678831875 677366555
2643.3F77366555j203597j061678j151562j382291j514196j393974j155675j051366
$$ 677366555 676162958 675101280 673949718 672567427 671053231 669659257 668503582 667452216
2659.6F67452216j196980j438082j516759j323342j026988r34899j112640j328290
$$ 667452216 666255236 664817154 663300395 661977053 660950065 660015166 658902526 657574236
2675.9F57574236j359045j184225r52900q91328j064777j255095j253903j090705r29833
$$ 657574236 656215191 655030966 654078066 653186738 652121961 650866866 649612963 648522258 647592425
2694.3F47592425r74118j222134j407206j394928j235306j083195j156449j408637
$$ 647592425 646618307 645396173 643988967 642594039 641358733 640275538 639119089 637710452
2710.6F37710452j566648j483441j242697j116872j253486j456737j481593j293540
$$ 637710452 636143804 634660363 633417666 632300794 631047308 629590571 628108978 626815438
2726.9F26815438j069069j003146j123011j275659j278519j124144r41694q87692j044511
$$ 626815438 625746369 624743223 623620212 622344553 621066034 619941890 619000196 618112504 617067993
2745.2F17067993j230419j230896j069605q85904q62777j039386j209438j186728j011372
$$ 617067993 615837574 614606678 613537073 612651169 611788392 610749006 609539568 608352840 607341468
2763.6F07341468r01103r72330j148999j295090j287281j142502j068533j205861j436055
$$ 607341468 606440365 605468035 604319036 603023946 601736665 600594163 599525630 598319769 596883714
2782E96883714j546621j488328j380980j370669j517057j722276j832843j783729j658618
$$ 596883714 595337093 593848765 592467785 591097116 589580059 587857783 586024940 584241211 582582593
2800.3E82582593j630306j800299k060354k187371k106249j957774j968325k181053
$$ 582582593 580952287 579151988 577091634 574904263 572798014 570840240 568871915 566690862
2816.6E66690862k404451k489984k444148k394080k508104k785027l063858l218233
$$ 566690862 564286411 561796427 559352279 556958199 554450095 551665068 548601210 545382977
2832.9E45382977l294886l503739l985882m735589n603195o358087o841361o897926
$$ 545382977 542088091 538584352 534598470 529862881 524259686 517901599 511060238 504162312
2849.3E04162312o337136n142570l649026k382487j770675j946539k728671l694266
$$ 504162312 497825176 492682606 489033580 486651093 484880418 482933879 480205208 476510942
2865.6D76510942m353195m455537m035860l309816k555669j951128j514733j218557
$$ 476510942 472157747 467702210 463666350 460356534 457800865 455849737 454335004 453116447
2881.9D53116447j095534j168042j376838j609683j792132j905352j993955k185344
$$ 453116447 452020913 450852871 449476033 447866350 446074218 444168866 442174911 439989567
2898.2D39989567k525628k876848l143161l420264l796548m304528m937380n495519
$$ 439989567 437463939 434587091 431443930 428023666 424227118 419922590 414985210 409489691
2914.5D09489691n732387n569130n032391m199266l143251j942992p07478N33909J757234
$$ 409489691 403757304 398188174 393155783 388956517 385813266 383870274 383162796 383696705 385453939
2932.9C85453939K835215L689259M306733M619658M581541M187018L424853K484798
$$ 385453939 388289154 391978413 396285146 400904804 405486345 409673363 413098216 415583014
2949.2D15583014J702816J208275J072586J381069J962602K638460L408521M212231
$$ 415583014 417285830 418494105 419566691 420947760 422910362 425548822 428957343 433169574
2965.5D33169574M924476N479961N838365N960643N915344N834162N706996N394697
$$ 433169574 438094050 443574011 449412376 455373019 461288363 467122525 472829521 478224218
2981.8D78224218M862547M249543L724128L305584K826095K193451J487940P76947
$$ 478224218 483086765 487336308 491060436 494366020 497192115 499385566 500873506 501650453
2998.1E01650453J62243k67386o28114r86874j198500j218319j130611r81480q97526
$$ 501650453 501812696 501545310 500917196 499930322 498731822 497513503 496382892 495401412 494503886
3016.5D94503886j008183j272142j618505j940101k059907j981705j939655k055049
$$ 494503886 493495703 492223561 490605056 488664955 486605048 484623343 482683688 480628639
3032.8D80628639k194583k258033k286463k324969k392083k481640k574801k593339
$$ 480628639 478434056 476176023 473889560 471564591 469172508 466690868 464116067 461522728
3049.1D61522728k499550k453089k549499k635867k557009k364099k193094k085089
$$ 461522728 459023178 456570089 454020590 451384723 448827714 446463615 444270521 442185432
3065.5D42185432j991809j893520j817077j725525j586020j470357j484931j562565
$$ 442185432 440193623 438300103 436483026 434757501 433171481 431701124 430216193 428653628
3081.8D28653628j522094j379609j251400j173198j160562j194299j209795j162171
$$ 428653628 427131534 425751925 424500525 423327327 422166765 420972466 419762671 418600500
3098.1D18600500j106441j162351j309692j407564j413345j388610j403034j490950
$$ 418600500 417494059 416331708 415022016 413614452 412201107 410812497 409409463 407918513
3114.4D07918513j595378j645655j660287j670569j696527j772732j855313j885564
$$ 407918513 406323135 404677480 403017193 401346624 399650097 397877365 396022052 394136488
3130.7C94136488j909315j935333j958519j988292j990527j975536k005458k075702
$$ 394136488 392227173 390291840 388333321 386345029 384354502 382378966 380373508 378297806
3147C78297806k083302k054006k080828k104044k090603k099067k137124k160013k137303
$$ 378297806 376214504 374160498 372079670 369975626 367885023 365785956 363648832 361488819 359351516
3165.4C59351516k118588k121061k113730k138346k139837k073347k046287k087355
$$ 359351516 357232928 355111867 352998137 350859791 348719954 346646607 344600320 342512965
3181.7C42512965k104223k049386j984090j972377j984566j950890j892627j878321
$$ 342512965 340408742 338359356 336375266 334402889 332418323 330467433 328574806 326696485
3198C26696485j871615j813650j752288j707583j659364j639932j652390j665086j652866
$$ 326696485 324824870 323011220 321258932 319551349 317891985 316252053 314599663 312934577 311281711
3216.4C11281711j621604j600832j588195j598031j644283j656562j647622j692950
$$ 311281711 309660107 308059275 306471080 304873049 303228766 301572204 299924582 298231632
3232.7B98231632j754284j801521j845837j889139j942605j987278k011955k048612
$$ 298231632 296477348 294675827 292829990 290940851 288998246 287010968 284999013 282950401
3249B82950401k096861k138406k148927k131700k154082k199739k165199k051323j933158
$$ 282950401 280853540 278715134 276566207 274434507 272280425 270080686 267915487 265864164 263931006
3267.4B63931006j824349j740962j663208j525700j383782j283973j173973j043439
$$ 263931006 262106657 260365695 258702487 257176787 255793005 254509032 253335059 252291620
3283.7B52291620r11296q05348o85319n28917m42743m14059l36259k24501j38506p8157
$$ 252291620 251380324 250574976 249889657 249360740 248917997 248503938 248167679 247943178 247804672 247726515
3304.1B47726515o6251p1436j5244L9801M2469O1810R5442J04010J31756J68130J42842
$$ 247726515 247660264 247588828 247573584 247613385 247655854 247717664 247813106 247917116 248048872 248217002 248359844
3326.5B48359844J08674J44050J73539J51649J39996J34573Q3610j2964p4476m0278
$$ 248359844 248468518 248612568 248786107 248937756 249077752 249212325 249295935 249282971 249208495 249168217
3346.9B49168217J0535J133m6268q4520q5622p1332l6075n603k2724k8059n6833j52082
$$ 249168217 249178752 249179885 249133617 249049097 248963475 248892143 248856068 248850465 248827741 248799682 248742849 248590767
3371.4B48590767j54331m7922j8686n9486l2633N8785R6559J43081K28718J73018K6211
$$ 248590767 248436436 248388514 248369828 248310342 248277709 248336494 248433053 248576134 248804852 248977870 249004081
3393.8B49004081J3515J49459K70232K32980J12414J43290K92242L86923L98964L56644
$$ 249004081 249017596 249167055 249437287 249670267 249782681 249925971 250218213 250605136 251004100 251360744
3414.2B51360744L18200L39746M08918N07235O36995P45148Q31544Q77619R41485J023233
$$ 251360744 251678944 252018690 252427608 252934843 253571838 254316986 255148530 256026149 256967634 257990867
3434.6B57990867R22263P51465P67917R03070J042842J125932J100361J108945J162678
$$ 257990867 258913130 259664595 260432512 261335582 262378424 263504356 264604717 265713662 266876340
3453B66876340J166195J210689J337290J379013J348406J432926J556634J498312J313448
$$ 266876340 268042535 269253224 270590514 271969527 273317933 274750859 276307493 277805805 279119253
3471.3B79119253J328349J522899J672059J702905J647204J662076J801729J854896
$$ 279119253 280447602 281970501 283642560 285345465 286992669 288654745 290456474 292311370
3487.6B92311370J756430J731694J824975J926750J940846J919359J906485J826018
$$ 292311370 294067800 295799494 297624469 299551219 301492065 303411424 305317909 307143927
3504C07143927J796871J939774K075493K119154K117157K045840K055287K223790K389163
$$ 307143927 308940798 310880572 312956065 315075219 317192376 319238216 321293503 323517293 325906456
3522.3C25906456K321779K138675K127975K285570K465695K557844K497077K383828
$$ 325906456 328228235 330366910 332494885 334780455 337246150 339803994 342301071 344684899
3538.6C44684899K483934K716929K810657K662599K515972K605050K771914K867610
$$ 344684899 347168833 349885762 352696419 355359018 357874990 360480040 363251954 366119564
3554.9C66119564K907723K944499K963960K977222L145725L466338L498286L256082
$$ 366119564 369027287 371971786 374935746 377912968 381058693 384525031 388023317 391279399
3571.3C91279399L204436L373414L549725L719598L817856L783405L808409L934055
$$ 391279399 394483835 397857249 401406974 405126572 408944428 412727833 416536242 420470297
3587.6D20470297L964663L907949L975957M061640M092276M124105M151046M167288
$$ 420470297 424434960 428342909 432318866 436380506 440472782 444596887 448747933 452915221
3603.9D52915221M182369M274607M292398M255176M290938M281789M377783M511386
$$ 452915221 457097590 461372197 465664595 469919771 474210709 478492498 482870281 487381667
3620.2D87381667M259348M022419M188091M671871M746676M198611M055559M192889
$$ 487381667 491641015 495663434 499851525 504523396 509270072 513468683 517524242 521717131
3636.5E21717131M211724TM188359M093170M100740M315257M271984L839731L679216
$$ 521717131 525928855 530140579 534328938 538422108 542522848 546838105 551110089 554949820 558629036
3654.9E58629036L867388L822982L579140L463328L491282L465831L332615L247619
$$ 558629036 562496424 566319406 569898546 573361874 576853156 580318987 583651602 586899221
3671.2E86899221L113747K994000K877772K671242K568364K634704K783180K877175
$$ 586899221 590012968 593006968 595884740 598555982 601124346 603759050 606542230 609419405
3687.5F09419405K571226K017617J851261J978814K046526J950502J740158J587629
$$ 609419405 611990631 614008248 615859509 617838323 619884849 621835351 623575509 625163138
3703.8F25163138J658797J773834J716316J498819J372814J356005J374245J392782
$$ 625163138 626821935 628595769 630312085 631810904 633183718 634539723 635913968 637306750
3720.1F37306750J346111J245439J114249J143277J310825J414836J347184J113057
$$ 637306750 638652861 639898300 641012549 642155826 643466651 644881487 646228671 647341728
3736.5F47341728R19640R34303R57489R27329J091778J118422Q22961O35028Q22306
$$ 647341728 648261368 649195671 650153160 651080489 652172267 653290689 654113650 654748678 655570984
3754.8F55570984J016974R66311Q64565Q79169Q88586Q58009P76350P25389P75754
$$ 655570984 656587958 657554269 658418834 659298003 660186589 661044598 661820948 662546337 663322091
3773.2F63322091Q37624Q75890Q37326P71225P24316O37889N46157N77688P37786Q25048
$$ 663322091 664159715 665035605 665872931 666644156 667368472 668006361 668552518 669130206 669867992 670693040
3793.6F70693040Q07762Q18133O36757L30269N06997P04944N76377N64754O84262O62505
$$ 670693040 671500802 672318935 672955692 673285961 673792958 674497902 675074279 675639033 676323295 676985800
3814F76985800N58675O59525N67496L11613M12762N50926N96762O13927O15299O69897
$$ 676985800 677544475 678204000 678771496 679083109 679495871 680046797 680643559 681257486 681872785 682542682
3834.4F82542682N46634K56359K55526L82840L70145M18186O07193O62744K74837K3842
$$ 682542682 683089316 683345675 683601201 683984041 684354186 684772372 685379565 686042309 686317146 686340988
3854.8F86340988L84688N48363N00560M14490L58761L86178K89619J62482K01106L69907
$$ 686340988 686725676 687274039 687774599 688189089 688547850 688934028 689223647 689386129 689587235 689957142
3875.2F89957142N52058M63784K73943K32935J78516K48253L58045K34842J73211L11375
$$ 689957142 690509200 690972984 691246927 691479862 691658378 691906631 692264676 692499518 692672729 692984104
3895.5F92984104L44396K81572K10524Q3863P9215J42574J32382J91152K93553K53380
$$ 692984104 693328500 693610072 693820596 693904459 693983674 694126248 694258630 694449782 694743335 694996715
3915.9F94996715J13964Q0347J56581J84000J54972J79589J73389O7831M9591J58488
$$ 694996715 695110679 695191026 695347607 695531607 695686579 695866168 696039557 696107388 696156979 696315467
3936.3F96315467K24114J91390J24932J04904J69337K42829K20597J14679L9697P7545
$$ 696315467 696539581 696730971 696855903 696960807 697130144 697372973 697593570 697708249 697747946 697825491
3956.7F97825491J75894J84476J04129Q6904J31607J24335J12951J58847J36256N4717
$$ 697825491 698001385 698185861 698289990 698376894 698508501 698632836 698745787 698904634 699040890 699095607
3977.1F99095607O9737J80245K80738K38299P2062J4186R7990J76549K03371J48117
$$ 699095607 699165344 699345589 699626327 699864626 699936688 699950874 700048864 700225413 700428784 700576901
3997.5G00576901
$$ 700576901
##END=$$ End of the data block
