##TITLE=G23-51-SE $$ Begin of the data block
##JCAMP-DX=5.00 $$ ACD/SpecManager v 10.08
##SPECTROMETER/DATA SYSTEM=Alpha
##DATE=23 Oct 2013 10:11:40
##DATA TYPE=INFRARED SPECTRUM
##DATA CLASS=XYDATA
##ORIGIN=
##OWNER=
##NPOINTS=1765
##FIRSTX=399.75695801
##LASTX=3997.56933594
##MAXX=3997.56933594
##MINX=399.75695801
##MAXY=0.79981804
##MINY=0.26139092
##XFACTOR=1.0000000000
##YFACTOR=1.000000000000000e-9
##FIRSTY=0.52149647
##DELTAX=2.03957629
##XUNITS=1/CM
##YUNITS=ARBITRARY UNITS
##XYDATA=(X++(Y..Y))
$$ plain form
399.8 521496475 515605330 511922896 511814952 513484001 513794839 512452006 511907399 513244033 514611006
418.1 514611006 513152242 509890556 507864773 507663012 507093251 504400611 501050532 499517441 500317693
436.5 500317693 501655877 501795411 501498282 502887487 506049514 508411765 507871568 505457878 504075587
454.8 504075587 504326522 503706157 500543773 496254236 493439913 492657632 491718382 488777071 484546155
473.2 484546155 481731355 481501549 481835127 480367154 477703214 476385266 476962000 477211148 475329041
491.5 475329041 472066879 469532162 468518972 467490643 464544654 460295528 456960440 455103129
507.9 455103129 453278691 449940056 445628852 442372799 440878749 439850956 437971920 435615748
524.2 435615748 434352964 435115308 436843276 437801182 438046366 439500362 443285853 447788656 450300276
$$ packed form
399.8E21496475n891145l682434j07944J669049L10838j342833n44607J336634J366973
418.1E14611006j458764l261686k025783k01761n69761k692640l350079j533091Q00252
436.5E00317693J338184J39534k97129J389205L162027K362251n40197k413690j382291
454.8E04075587K50935o20365l162384m289537k814323p82281r39250k941311m230916
473.2D84546155k814800k29806L33578j467973k663940j317948N76734K49148j882107
491.5D75329041l262162k534717j013190j028329k945989m249126l335088j857311
507.9D55103129j824438l338635m311204l256053j494050j027793j879036k356172
524.2D35615748j262784P62344J727968R57906K45184J453996L785491M502803K511620
$$ plain form
542.5 450300276 450195163 449411213 449682653 450316757 449547082 447162807 444755524 443490803 442647487
560.9 442647487 440568507 436788887 432827443 430435419 429632157 429230481 428691357 428875059 431067079
579.2 431067079 435050517 438999474 441624612 443510771 445769757 448294312 449816436 449623466 448684543
597.6 448684543 448501170 449435174 450306952 449976295 449018180 448954433 450257391 451820403 452407479 452399701
618 452399701 453527898 456502855 460088462 462726355 464450449 466585636 469747037 472951382 474915028
636.3 474915028 475729227 476724893 478728920 480996728 482129216 482026041 482060641 483121783 484544992
654.7 484544992 485035747 484374613 483850658 484556466 486067265 487422496 487592071 487571687 488971174
673.1 488971174 491582245 493876249 494793445 495211631 496468276 498473316 499926686 499929726 499060571
$$ packed form
542.5D50300276j05113p83950K71440O34104p69675k384275k407283j264721q43316
560.9D42647487k078980l779620l961444k392024q03262m01676n39124J83702K192020
579.2D31067079L983438L948957K625138J886159K258986K524555J522124j92970r38923
597.6D48684543j83373R34004Q71778l30657r58115o3747J302958J563012N87076p778
618D52399701J128197K974957L585607K637893J724094K135187L161401L204345J963646
636.3D74915028Q14199R95666K004027K267808J132488j03175L4600J061142J423209
654.7D84544992M90755o61134n23955P05808J510799J355231J69575k0384J399487
673.1D88971174K611071K294004R17196M18186J256645K005040J453370L040q69155
$$ plain form
691.4 499060571 498441249 498294502 497808486 496491283 495241195 495387226 497103512 499306262 501013398
709.8 501013398 502494037 504834235 508563221 512855172 516579092 519969881 524229348 529760182
726.1 529760182 535435557 539781749 542602122 544985533 547909200 550871253 552534163 552604556 552191973
744.4 552191973 552327216 552777410 552349448 550524116 548223913 546602905 545748353 544816375 543464303
762.8 543464303 542714000 543961108 547378659 551865220 556410432 561156690 566868603 573336184 579067171
781.2 579067171 582953990 585516572 588099301 591302395 594368041 596349120 597686052 599895418
797.5 599895418 603657067 608020306 611547232 613966465 616345346 619267285 621821105 622832716
813.8 622832716 622432530 621763110 621535361 621174395 619533360 616353989 612635195 609580874 607110560
$$ packed form
691.4D99060571o19322j46747m86016j317203j250088J46031J716286K202750J707136
709.8E01013398J480639K340198L728986M291951L723920L390789M259467N530834
726.1E29760182N675375M346192K820373K383411K923667K962053J662910P0393m12583
744.4E52191973J35243M50194m27962j825332k300203j621008q54552r31978j352072
762.8E43464303p50303J247108L417551M486561M545212M746258N711913O467581N730987
781.2E79067171L886819K562582K582729L203094L065646J981079J336932K209366
797.5E99895418L761649M363239L526926K419233K378881K921939K553820J011611
813.8F22832716m00186o69420k27749l60966j641035l179371l718794l054321k470314
$$ plain form
832.1 607110560 604104221 600155592 596165061 593123198 590966523 588850081 586301506 583887637
848.5 583887637 582458198 581959486 581437826 580272436 579239666 580048740 583680451 589404345 595771492
866.8 595771492 602154255 608634174 614789963 619375229 621250510 620423913 617944539 614597559 610257447
885.2 610257447 604674518 598340452 592348337 587273180 582623184 577593923 571953893 566073477
901.5 566073477 560226977 554097533 547079563 539122105 530997574 523496091 516791582 510813117
917.8 510813117 505786836 502203286 500276625 499495417 498992503 498356819 497845203 497835815 498256713 498642832
938.2 498642832 498594522 497845739 495906949 491970599 485402167 476390928 465881199 454892725 443950504
956.6 443950504 432957530 421666205 410152465 398785114 387894869 377574950 367844164 358906895
$$ packed form
832.1F07110560l006339l948629l990531l041863k156675k116442k548575k413869
848.5E83887637j429439m98712n21660j165390j032770Q09074L631711N723894O367147
866.8E95771492O382763O479919O155789M585266J875281q26597k479374l346980m340112
885.2F10257447n582929o334066n992115n075157m649996n029261n640030n880416
901.5E66073477n846500o129444p017970p957458q124531p501483o704509n978465
917.8E10813117n026281l583550j926661p81208n02914o35684n11616r388M20898L86119
938.2D98642832m8310p48783j938790l936350o568432r011239j0509729j0988474j0942221
956.6D43950504j0992974j1291325j1513740j1367351j0890245j0319919r730786q937269
$$ plain form
972.9 358906895 351154685 344937950 340352297 337158680 334956795 333476007 332594663 332112968 331694901
991.2 331694901 331136167 330606312 330434322 330756038 331417024 332081079 332444280 332371205 331860274 330924422
1011.6 330924422 329611123 328063130 326508224 325121701 323802888 322264194 320395708 318414986
1027.9 318414986 316577643 314870358 313065112 311005443 308813334 306714863 304760724 302944094
1044.3 302944094 301290452 299880534 298961133 298754096 299250692 300248832 301619142 303474367 305944085
1062.6 305944085 308807135 311376482 312770337 312515944 311096489 309692532 309256464 310091674 312217027
1081 312217027 315526158 319684774 324251920 328856587 333273470 337456971 341379851 344769299 347301424
1099.3 347301424 348987341 350211352 351505846 353182226 355192930 357442528 359953791 362699568
$$ packed form
972.9C58906895p752210o216735m585653l193617k201885j480788q81344m81695m18067
991.2C31694901n58734n29855j71990L21716O60986O64055L63201p3075n10931r35852
1011.6C30924422j313299j547993j554906j386523j318813j538694j868486j980722
1027.9C18414986j837343j707285j805246k059669k192109k098471j954139j816630
1044.3C02944094j653642j409918r19401k07037M96596R98140J370310J855225K469718
1062.6C05944085K863050K569347J393855k54393j419455j403957m36068Q35210K125353
1081C12217027L309131M158616M567146M604667M416883M183501L922880L389448K532125
1099.3C47301424J685917J224011J294494J676380K010704K249598K511263K745777
$$ plain form
1115.6 362699568 365440369 367776036 369514287 370917916 372440398 374369621 376746804 379361957
1132 379361957 381861329 383936584 385332137 385808498 385358542 384376228 383378834 382601172 381967545
1150.3 381967545 381451309 381261230 381743044 383134127 385350525 388154060 391434193 395235181 399653733
1168.7 399653733 404704034 410281956 416359723 423017919 430252433 437779814 445111215 451940447
1185 451940447 458270043 464090735 469064474 472678900 474751800 475659043 475982457 475991875 475603759
1203.3 475603759 474877566 474280477 474268585 474801451 475440055 475815743 475932747 475977182 475905925 475389153
1223.7 475389153 474184632 472480088 470684767 469032049 467485160 465962261 464609832 463794231
1240.1 463794231 463785470 464467376 465529740 466867089 468631983 470911652 473481447 475954711 478152066
$$ packed form
1115.6C62699568K740801K335667J738251J403629J522482J929223K377183K615153
1132C79361957K499372K075255J395553M76361m49956r82314r97394p77662o33627
1150.3C81967545n16236j90079M81814J391083K216398K803535L280133L800988M418552
1168.7C99653733N050301N577922O077767O658196P234514P527381P331401O829232
1185D51940447O329596N820692M973739L614426K072900R07243L23414R418l88116
1203.3D75603759p26193n97089j1892N32866O38604L75688J17004M4435p1257n16772
1223.7D75389153j204521j704544j795321j652718j546889j522899j352429q15601
1240.1D63794231q761O81906J062364J337349J764894K279669K569795K473264K197355
$$ plain form
1258.4 478152066 480204970 482331336 484583050 486784458 488786459 490666479 492568851 494383156
1274.7 494383156 495799512 496708512 497430474 498395801 499636918 500823975 501630127 502030432 502203226
1293.1 502203226 502095282 501386166 499957532 498081267 496204048 494568110 492994428 491283029 489623815
1311.4 489623815 488417894 487880409 487856507 487974405 487960458 487690955 487025917 485689640 483486444
1329.8 483486444 480668396 477807015 475387275 473527730 472068667 470882952 469982356 469348013 468753546
1348.1 468753546 467821538 466374487 464574754 462670714 460669130 458170474 454680175 450443953
1364.5 450443953 446291775 442543924 439041674 435105652 430420280 426146656 423295051 421405911
1380.8 421405911 419572979 417778432 416603476 416286707 416459382 416600734 416465074 416284561 416382968
$$ packed form
1258.4D78152066K052904K126366K251714K201408K002001J880020J902372J814305
1274.7D94383156J416356R09000P21962R65327J241117J187057Q06152M00305J72794
1293.1E02203226j07944p09116j428634j876265j877219j635938j573682j711399j659214
1311.4D89623815j205921n37485k3902J17898j3947k69503o65038j336277k203196
1329.8D83486444k818048k861381k419740j859545j459063j185715r00596o34343n94467
1348.1D68753546r32008j447051j799733j904040k001584k498656l490299m236222
1364.5D50443953m152178l747851l502250l936022m685372m273624k851605j889140
1380.8D21405911j832932j794547j174956l16769J72675J41352j35660j80513R8407
$$ plain form
1399.1 416382968 416918635 417806476 418880343 420077503 421478897 423117816 424833447 426511765 428297073
1417.5 428297073 430520564 432971776 435350120 437456250 439001352 439939082 440299720 440076113 439099580
1435.9 439099580 437696308 436728686 436199337 435753047 435183555 434333205 433159769 431750983 430560648
1454.2 430560648 430251390 431315422 433231294 435589045 438821137 443511337 450066060 459223419
1470.5 459223419 471288413 483174711 492504507 499782324 505365431 509380162 511779904 512480974
1486.8 512480974 511203587 508154392 504508317 500319898 494991899 489240259 483819097 478600353
1503.2 478600353 472006291 462458849 453454703 445785612 438318223 431870580 427242488 424301267
1519.5 424301267 421650261 418756127 415910602 412988424 410319984 407729208 404926747 402753890
$$ packed form
1399.1D16382968N35667Q87841J073867J197160J401394J638919J715631J678318J785308
1417.5D28297073K223491K451212K378344K106130J545102R37730L60638k23607r76533
1435.9D39099580j403272r67622n29349m46290n69492q50350j173436j408786j190335
1454.2D30560648l09258J064032J915872K357751L232092M690200O554723R157359
1470.5D59223419J2064994J1886298R329796P277817N583107M014731K399742P01070
1486.8E12480974j277387l049195l646075m188419n327999n751640n421162n218744
1503.2D78600353o594062r547442r004146p669091p467389o447643m628092k941221
1519.5D24301267k651006k894134k845525k922178k668440k590776k802461k172857
$$ plain form
1535.8 402753890 401363075 399969012 398847967 398670465 399411887 401058972 403595537 406834662 410512298
1554.1 410512298 414375633 419124156 424612284 428570211 431682616 434655517 437509209 440265447
1570.5 440265447 442426980 444008708 445291907 446276695 446994424 447390914 447450638 447180837 446633369
1588.8 446633369 445730478 444328457 442203909 439364612 435939312 431863815 427013636 421290100
1605.1 421290100 414657474 407138020 399199367 391240805 382234842 371377110 361440897 352089047
1621.4 352089047 341206282 330185831 319844753 309888422 301168680 293158799 284779131 278540105
1637.8 278540105 275388807 273906529 273494422 273960680 275175184 276632011 278511673 281459481 284662336
1656.1 284662336 288030088 292291880 297805727 304241210 310672253 317734271 325762987 333368510
$$ packed form
1535.8D02753890j390815j394063j121045j77502P41422J647085K536565L239125L677636
1554.1D10512298L863335M748523N488128L957927L112405K972901K853692K756238
1570.5D40265447K161533J581728J283199R84788P17729L96490N9724k69801n47468
1588.8D46633369r02891j402021k124548k839297l425300m075497m850179n723536
1605.1D21290100o632626p519454p938653p958562r005963j0857732r936213r351850
1621.4C52089047j0882765j1020451j0341078r956331q719742q009881q379668o239026
1637.8B78540105l151298j482278m12107M66258J214504J456827J879662K947808L202855
1656.1B84662336L367752M261792N513847O435483O431043P062018Q028716P605523
$$ plain form
1672.4 333368510 341258675 349979848 358333528 366353542 375396401 386910647 398083746 408173412
1688.8 408173412 419291466 431054175 445147425 461511731 477844775 495277107 509760678
1703 509760678 521669447 533438861 543764830 552585781 560335934 567473412 574744940 581380248
1719.3 581380248 586523712 590765417 594538629 597938180 601222157 604273379 607231379 610157132
1735.7 610157132 613066018 616629720 620883644 625380039 630172193 635494709 641559064 647937834
1752 647937834 653637767 658928871 664293647 669666290 675179243 680220306 684561610 688707411 692855656
1770.3 692855656 697103560 700955570 703974307 706660867 709462881 712330997 714980245 717214108
1786.7 717214108 719138265 721115708 723422348 725639582 727414191 728902996 730493009 732350409
$$ packed form
1672.4C33368510P890165Q721173Q353680Q020014R042859J1514246J1173099J0089666
1688.8D08173412J1118054J1762709J4093250J6364306J6333044J7432332J4483571
1703E09760678J1908769J1769414J0325969Q820951P750153P137478P271528O635308
1719.3E81380248N143464M241705L773212L399551L283977L051222K958000K925753
1735.7F10157132K908886L563702M253924M496395M792154N322516O064355O378770
1752F47937834N699933N291104N364776N372643N512953N041063M341304M145801M148245
1770.3F92855656M247904L852010L018737K686560K802014K868116K649248K233863
1786.7G17214108J924157J977443K306640K217234J774609J488805J590013J857400
$$ plain form
1803 732350409 734175861 735694945 736975491 738327920 739885509 741478443 742826283 743912935 744962215
1821.3 744962215 746225893 747699499 748979092 749905169 750807881 751945198 753179014 754237115 754964232
1839.7 754964232 755541801 756322801 757388830 758351564 758999169 759504676 760148704 761032403 761900365
1858 761900365 762482822 762850702 763316989 764001012 764738977 765308678 765704095 766179919 766900778 767707646
1878.4 767707646 768296301 768636703 769021153 769692302 770517409 771162927 771514297 771807194 772334099 773034334
1898.8 773034334 773611784 773904979 774068117 774388134 774931252 775458455 775739908 775867641 776120543 776624680
1919.2 776624680 777121484 777360499 777456701 777677536 778105140 778537869 778739154 778768778 778909206 779252768
1939.6 779252768 779627979 779835880 779881537 779976010 780293107 780740559 781050920 781162024 781286180 781598330
$$ packed form
1803G32350409J825452J519084J280546J352429J557589J592934J347840J086652J049280
1821.3G44962215J263678J473606J279593R26077R02712J137317J233816J058101P27117
1839.7G54964232N77569P81000J066029R62734O47605N05507O44028Q83699Q67962
1858G61900365N82457L67880M66287O84023P37965N69701L95417M75824P20859Q06868
1878.4G67707646N88655L40402L84450O71149Q25107O45518L51370K92897N26905P00235
1898.8G73034334N77450K93195J63138L20017N43118N27203K81453J27733K52902N04137
1919.2G76624680M96804K39015R6202K20835M27604M32729K01285K9624J40428L43562
1939.6G79252768L75211K07901M5657R4473L17097M47452L10361J11104J24156L12150
$$ plain form
1960 781598330 782004952 782296181 782390118 782439172 782650709 783020973 783351481 783480585 783501744 783622026
1980.4 783622026 783893108 784149647 784252286 784250438 784300148 784500599 784754753 784865081 784819007 784822345 784956872
2002.8 784956872 785086870 785040975 784838855 784672260 784646213 784643352 784492493 784200430 783909917 783738792
2023.2 783738792 783640325 783467889 783165514 782843053 782633722 782539129 782411158 782150149 781867981 781699717
2043.6 781699717 781653643 781622112 781496465 781317592 781256795 781355441 781485915 781531572 781501949 781540930 781720757
2066.1 781720757 781952977 782078505 782057643 782048881 782165945 782326102 782432795 782467723 782479048 782565892 782732010
2088.5 782732010 782885015 782960176 783013999 783136308 783324838 783496797 783594489 783666372 783807397 784030080
2108.9 784030080 784223795 784307420 784330428 784379303 784480333 784606099 784694433 784736633 784796953 784901381 785007834
$$ packed form
1960G81598330M06622K91229R3937M9054K11537L70264L30508J29104K1159J20282
1980.4G83622026K71082K56539J02639j848M9710K00451K54154J10328m6074L338J34527
2002.8G84956872J29998m5895k02120j66595k6047k861j50859k92063k90513j71125
2023.2G83738792r8467j72436l02375l22461k09331r4593j27971k61009k82168j68264
2043.6G81699717m6074l1531j25647j78873o0797R8646J30474M5657k9623L8981J79827
2066.1G81720757K32220J25528k0862q762J17064J60157J06693L4928J1325Q6844J66118
2088.5G82732010J53005P5161N3823J22309J88530J71959R7692P1883J41025K22683
2108.9G84030080J93715Q3625K3008M8875J01030J25766Q8334M2200O0320J04428J06453
$$ plain form
2131.3 785007834 785086572 785146832 785191417 785270154 785424888 785578966 785643637 785660684 785735190 785887897 786054373
2153.8 786054373 786187053 786330163 786550164 786836505 787118256 787367105 787624002 787955642 788378060 788823724
2174.2 788823724 789225638 789555728 789862394 790233850 790655315 791040182 791370988 791678965 791990161 792334437
2194.6 792334437 792698145 793032527 793315709 793589890 793910563 794245183 794544041 794831157 795130610 795450270
2215 795450270 795797706 796124339 796358466 796526253 796738029 796999633 797217429 797373474 797515690 797698855
2235.4 797698855 797923565 798103333 798183858 798222721 798305690 798438609 798558533 798666239 798783243 798883140
2255.8 798883140 799001932 799146414 799247324 799290836 799338162 799433947 799533129 799584568 799617827 799657226 799692273
2278.2 799692273 799730718 799756289 799741566 799726784 799770594 799818039 799789190 799718559 799677491 799690247 799717367
$$ packed form
2131.3G85007834P8738O0260M4585P8737J54734J54078O4671J7047P4506J52707J66476
2153.8G86054373J32680J43110K20001K86341K81751K48849K56897L31640M22418M45664
2174.2G88823724M01914L30090L06666L71456M21465L84867L30806L07977L11196L44276
2194.6G92334437L63708L34382K83182K74181L20673L34620K98858K87116K99453L19660
2215G95450270L47436L26633K34127J67787K11776K61604K17796J56045J42216J83165
2235.4G97698855K24710J79768Q0525L8863Q2969J32919J19924J07706J17004R9897
2255.8G98883140J18792J44482J00910M3512M7326R5785R9182N1439L3259L9399L5047
2278.2G99692273L8445K5571j4723j4782M3810M7445k8849p0631m1068J2756K7120
$$ plain form
2300.6 799717367 799714506 799679101 799667656 799701154 799731016 799717009 799663365 799643695 799676001 799742997 799813449 799806833
2325.1 799806833 799710929 799610496 799501598 799265325 798952579 798758864 798755765 798764706 798522174 797880113
2345.5 797880113 797189832 796877801 796961844 797296643 797650754 797791839 797687769 797365010 796834409 796173096
2365.9 796173096 795413673 794627130 793932319 793334782 792750061 792158306 791614652 791155696 790768087 790399432
2386.3 790399432 790026367 789662778 789310813 788962662 788592696 788182139 787752926 787312031 786863208 786410034
2406.7 786410034 785910487 785331547 784738600 784202278 783658624 783065021 782473743 781896770 781311929 780704856
2427.1 780704856 780059993 779354990 778627813 777952552 777298033 776609898 775926888 775261581 774579167 773875773
2447.5 773875773 773159921 772432685 771719158 771051705 770392656 769716024 769051433 768390357 767741084 767119706
$$ packed form
2300.6G99717367k861l5405j1445L3498K9862j4007n3644j9670L2306O6996P0452o616
2325.1G99806833r5904j00433j08898k36273l12746j93715l099Q941k42532o42061
2345.5G97880113o90281l12031Q4043L34799L54111J41085j04070l22759n30601o61313
2365.9G96173096p59423p86543o94811n97537n84721n91755n43654m58956l87609l68655
2386.3G90399432l73065l63589l51965l48151l69966m10557m29213m40895m48823m53174
2406.7G86410034m99547n78940n92947n36322n43654n93603n91278n76973n84841o07073
2427.1G80704856o44863p05003p27177o75261o54519o88135o83010o65307o82414p03394
2447.5G73875773p15852p27236p13527o67453o59049o76632o64591o61076o49273o21378
$$ plain form
2467.9 767119706 766482890 765802622 765096962 764401555 763745725 763095379 762418628 761758685 761122286 760482550
2488.3 760482550 759853959 759232521 758605301 757998109 757429302 756845295 756215990 755612969 755062699 754512191
2508.7 754512191 753940701 753351331 752714336 752044678 751421094 750855923 750276625 749628723 748942077 748269022
2529 748269022 747602284 746904969 746171296 745424151 744690418 743971646 743221104 742438018 741709530 741065621
2549.4 741065621 740424097 739741325 739023983 738262475 737517536 736848533 736193419 735491693 734775901 734097958
2569.8 734097958 733445704 732766449 732027769 731249154 730491519 729795694 729127824 728441179 727739155 727039754
2590.2 727039754 726372242 725728333 725055575 724343300 723589718 722799063 722019970 721253812 720432103 719542146
2610.6 719542146 718641520 717739642 716795027 715795159 714745641 713655710 712553501 711426020 710229993
$$ packed form
2467.9G67119706o36816o80268p05660o95407o55830o50346o76751o59943o36399o39736
2488.3G60482550o28591o21438o27220o07192n68807n84007o29305o03021n50270n50508
2508.7G54512191n71490n89370o36995o69658o23584n65171n79298o47902o86646o73055
2529G48269022o66738o97315p33673p47145p33733p18772p50542p83086p28488o43909
2549.4G41065621o41524o82772p17342p61508p44939o69003o55114p01726p15792o77943
2569.8G34097958o52254o79255p38680p78615p57635o95825o67870o86645p02024o99401
2590.2G27039754o67512o43909o72758p12275p53582p90655p79093p66158q21709q89957
2610.6G19542146r00626r01878r44615r99868j049518j089931j102209j127481j196027
$$ plain form
2629 710229993 709009409 707837760 706698954 705517530 704261303 702991962 701775670 700595796 699385583
2647.3 699385583 698117912 696843922 695630252 694470525 693279445 692027211 690788448 689588904
2663.7 689588904 688386500 687189043 686030924 684927285 683875322 682865977 681880414 680856168
2680 680856168 679760158 678664684 677653611 676707506 675732374 674682796 673618495 672598302 671578884
2698.3 671578884 670475721 669280112 668053508 666832149 665597022 664315999 662978411 661599636
2714.6 661599636 660262883 659032941 657843769 656605422 655321836 654103875 653048813 652084768
2731 652084768 651075423 650042057 649079978 648168385 647228479 646229446 645198703 644198000 643239141
2749.3 643239141 642290711 641353369 640411079 639440358 638457417 637479484 636502206 635502398 634472191
$$ packed form
2629G10229993j220584j171649j138806j181424j256227j269341j216292j179874j210213
2647.3F99385583j267671j273990j213670j159727j191080j252234j238763j199544
2663.7F89588904j202404j197457j158119j103639j051963j009345r85563j024246
2680F80856168j096010j095474j011073r46105r75132j049578j064301j020193j019418
2698.3F71578884j103163j195609j226604j221359j235127j281023j337588j378775
2714.6F61599636j336753j229942j189172j238347j283586j217961j055062r64045
2731F52084768j009345j033366r62079r11593r39906r99033j030743j000703r58859
2749.3F43239141r48430r37342r42290r70721r82941r77933r77278r99808j030207
$$ plain form
2767.7 634472191 633429587 632356882 631198883 629939497 628621936 627299905 625991702 624644160
2784 624644160 623163819 621559680 619945765 618346930 616672397 614885926 613034129 611150742 609278858
2802.3 609278858 607383370 605311513 603054762 600757778 598450065 596054435 593521714 590848565
2818.7 590848565 588056445 585108578 581879795 578245282 574114144 569367468 563861668 557380199
2835 557380199 549562097 540183246 529257357 516725659 502437294 486635536 470682591 457243204
2851.3 457243204 449160367 447535604 450904161 456394732 461364925 464210898 464477003 462615550
2867.6 462615550 459766805 457427591 456562728 456924647 457540184 457581252 456634700 454614431 451633275
2886 451633275 447901011 443643481 439027816 434173495 429137528 423883885 418301493 412257373 405640453
$$ packed form
2767.7F34472191j042604j072705j157999j259386j317561j322031j308203j347542
2784F24644160j480341j604139j613915j598835j674533j786471j851797j883387j871884
2802.3F09278858j895488k071857k256751k296984k307713k395630k532721k673149
2818.7E90848565k792120k947867l228783l634513m131138m746676n505800o481469
2835E57380199p818102r378851j0925889j2531698j4288365j5801758j5952945j3439387
2851.3D57243204q082837j624763L368557N490571M970193K845973K66105j861453
2867.6D62615550k848745k339214q64863L61919O15537M1068r46552k020269k981156
2886D51633275l732264m257530m615665m854321n035967n253643n582392o044120o616920
$$ plain form
2904.3 405640453 398294598 389935821 380188346 368821234 356107652 343004018 330885768 321074963
2920.6 321074963 314644247 312307060 314145625 319530666 327488929 337178916 347968996 359243929
2937 359243929 370281368 380263656 388420820 394237101 397611797 398906767 398947746 398866981 399722964
2955.3 399722964 402256280 406777143 413210988 421347320 430892378 441382825 452253699 462951869
2971.6 462951869 473047316 482330263 490752041 498348713 505168855 511179149 516343117 520731628
2987.9 520731628 524481714 527650833 530178666 532013476 533178866 533760130 533835530 533446074 532688677
3006.3 532688677 531757951 530839205 529971302 529089212 528123617 527002096 525682211 524118483 522270977
3024.7 522270977 520242989 518186867 516152620 514137566 512103140 509991050 507775426 505476117
$$ packed form
2904.3D05640453p345855q358777r747475j1367112j2713582j3103634j2118250r810805
2920.6C21074963o430716k337187J838565N385041P958263R689987J0790080J1274933
2937C59243929J1037439R982288Q157164N816281L374696J294970M0979q0765Q55983
2955.3C99722964K533316M520863O433845Q136332R545058J0490447J0870874J0698170
2971.6D62951869J0095447R282947Q421778P596672O820142O010294N163968M388511
2987.9E20731628L750086L169119K527833J834810J165390N81264P5400l89456p57397
3006.3E32688677r30726r18746q67903q82090r65595j121521j319885j563728j847506
3024.7E22270977k027988k056122k034247k015054k034426k112090k215624k299309
$$ plain form
3041 505476117 503122449 500727713 498272151 495738178 493215591 490764320 488305569 485810399 483343303
3059.3 483343303 480969965 478743106 476650387 474628448 472657263 470779747 469044805 467443287
3075.6 467443287 465888351 464283019 462681234 461201668 459828615 458498329 457205564 455960274
3092 455960274 454731643 453499109 452278554 451046050 449757934 448412925 447032392 445624083 444166660
3110.3 444166660 442662627 441141605 439573407 437927842 436229289 434465289 432629883 430788845
3126.6 430788845 428967625 427096307 425120890 423096627 421107531 419159412 417183340 415139496
3143 415139496 413065404 410980850 408883721 406782746 404649317 402455807 400255680 398128331 396057755
3161.3 396057755 393936723 391735345 389526159 387354523 385221809 383101791 380959630 378806889
$$ packed form
3041E05476117k353668k394736k455562k533973k522587k451271k458751k495170k467096
3059.3D83343303k373338k226859k092719k021939j971185j877516j734942j601518
3075.6D67443287j554936j605332j601785j479566j373053j330286j292765j245290
3092D55960274j228631j232534j220555j232504j288116j345009j380533j408309j457423
3110.3D44166660j504033j521022j568198j645565j698553j764000j835406j841038
3126.6D30788845j821220j871318j975417k024263j989096j948119j976072k043844
3143D15139496k074092k084554k097129k100975k133429k193510k200127k127349k070576
3161.3C96057755k121032k201378k209186k171636k132714k120018k142161k152741
$$ plain form
3177.6 378806889 376687080 374580532 372458547 370348632 368269295 366221517 364192843 362166137
3193.9 362166137 360128582 358118773 356218547 354427755 352656066 350853473 349058032 347318888
3210.3 347318888 345614493 343907446 342204034 340484083 338775396 337144613 335521102 333802730
3226.6 333802730 332032889 330301553 328585833 326797366 324915141 322977513 321015835 319034547
3242.9 319034547 317011207 314929992 312817514 310698301 308554977 306394368 304212272 301986516
3259.2 301986516 299761951 297596425 295508116 293506831 291608304 289806962 288101822 286521524
3275.5 286521524 285066634 283710629 282451600 281311721 280313909 279471695 278738797 278023183 277357042
3293.9 277357042 276852071 276476532 276134104 275802463 275505841 275265008 275051057 274852961 274705976 274587572
$$ packed form
3177.6C78806889k119809k106548k121985k109915k079337k047778k028674k026706
3193.9C62166137k037555k009809j900226j790792j771689j802593j795441j739144
3210.3C47318888j704395j707047j703412j719951j708687j630783j623511j718372
3226.6C33802730j769841j731336j715720j788467j882225j937628j961678j981288
3242.9C19034547k023340k081215k112478k119213k143324k160609k182096k225756
3259.2C01986516k224565k165526k088309k001285j898527j801342j705140j580298
3275.5B86521524j454890j356005j259029j139879r97812q42214p32898p15614o66141
3293.9B77357042n04971l75539l42428l31641k96622k40833k13951j98096j46985j18404
$$ plain form
3314.3 274587572 274476826 274392247 274291247 274160922 274051368 273930162 273761302 273576647 273382157 273194909
3334.7 273194909 273039848 272867680 272589505 272224784 271872818 271517426 271114916 270693094 270232350 269713312
3355.1 269713312 269209445 268762439 268325537 267864734 267418474 266987622 266501427 265951455 265406728 264905274
3375.5 264905274 264430881 263998538 263595462 263215333 262920618 262754560 262659460 262465268 262141973 261868954
3395.9 261868954 261758238 261766881 261737615 261577040 261428744 261390924 261397481 261427373 261518538 261668295 261875331
3418.3 261875331 262139022 262454361 262906164 263499051 264118224 264740258 265497983 266379744 267156184 267794698
3438.7 267794698 268481761 269327193 270323515 271389753 272431642 273501188 274651557 275866836 277167588
3457 277167588 278526455 279856324 281222641 282775581 284429461 285931826 287230074 288542539 290015966
$$ packed form
3314.3B74587572j10746q4579j01000j30325j09554j21206j68860j84655j94490j87248
3334.7B73194909j55061j72168k78175l64721l51966l55392m02510m21822m60744n19038
3355.1B69713312n03867m47006m36902m60803m46260m30852m86195n49972n44727n01454
3375.5B64905274m74393m32343m03076l80129k94715j66058r5100j94192l23295k73019
3395.9B61868954j10716Q643k9266j60575j48296l7820O557K9892R1165J49757K07036
3418.3B61875331K63691L15339M51803N92887O19173O22034P57725Q81761P76440O38514
3438.7B67794698O87063Q45432R96322J066238J041889J069546J150369J215279J300752
3457B77167588J358867J329869J366317J552940J653880J502365J298248J312465J473427
$$ plain form
3475.4 290015966 291715890 293551832 295303732 297023028 298851520 300693482 302454680 304228961
3491.7 304228961 306086063 308016270 309966207 311927080 313902497 315805644 317647308 319577634
3508 319577634 321663797 323856562 326010525 328052372 330129623 332381725 334802926 337162465 339362592
3526.4 339362592 341600180 343958706 346400350 348920971 351451665 353950590 356566399 359322190
3542.7 359322190 362084001 364771515 367459893 370244443 373076648 375874549 378695369 381671667
3559 381671667 384789139 387898535 391002297 394403160 398030251 401502281 404894382 408411354 412057638
3577.4 412057638 415848285 419780195 423726648 427619547 431589842 435743183 439878404 443992287
3593.7 443992287 448215842 452504635 456807345 461121261 465399712 469642669 474009722 478488714
$$ packed form
3475.4B90015966J699924J835942J751900J719296J828492J841962J761198J774281
3491.7C04228961J857102J930207J949937J960873J975417J903147J841664J930326
3508C19577634K086163K192765K153963K041847K077251K252102K421201K359539K200127
3526.4C39362592K237588K358526K441644K520621K530694K498925K615809K755791
3542.7C59322190K761811K687514K688378K784550K832205K797901K820820K976298
3559C81671667L117472L109396L103762L400863L627091L472030L392101L516972L646284
3577.4D12057638L790647L931910L946453L892899L970295M153341M135221M113883
3593.7D43992287M223555M288793M302710M313916M278451M242957M367053M478992
$$ plain form
3610 478488714 482966572 487463564 491885722 496323705 501006186 505598009 509871721 513959706 518261015
3628.4 518261015 522971451 527446389 531645715 535799265 539903581 544005454 548088133 552039444
3644.7 552039444 555863559 559818625 563967049 567852139 571411788 575106144 578899264 582398772
3661 582398772 585642219 588830471 591938257 595020533 598244667 601246655 604000330 606901586 609728575
3679.4 609728575 612373352 615005970 617610514 620120227 622446895 624602675 626696050 628725052
3695.7 628725052 630645931 632448554 634169638 635892034 637579978 639113128 640465200 641738355
3712 641738355 643201947 644779325 646250188 647592366 648813307 649908185 650936067 652065337 653246939
3730.3 653246939 654305995 655264676 656298041 657486856 658636630 659394443 659968376 661000967 662025034
$$ packed form
3610D78488714M477858M496992M422158M437983M682481M591823M273712M087985M301309
3628.4E18261015M710436M474938M199326M153550M104316M101873M082679L951311
3644.7E52039444L824115L955066M148424L885090L559649L694356L793120L499508
3661E82398772L243447L188252L107786L082276L224134L001988K753675K901256K826989
3679.4F09728575K644777K632618K604544K509713K326668K155780K093375K029002
3695.7F28725052J920879J802623J721084J722396J687944J533150J352072J273155
3712F41738355J463592J577378J470863J342178J220941J094878J027882J129270J181602
3730.3F53246939J059056R58681J033365J188815J149774P57813N73933J032591J024067
$$ plain form
3748.7 662025034 662704587 663571537 664730370 665793717 666614592 667406142 668285668 669146001 669912875
3767.1 669912875 670574188 671279967 672110200 672976255 673799634 674515247 675194621 675859451 676488161 677149713
3787.5 677149713 677837849 678498387 679088771 679622650 680202305 680732548 681218386 681879044 682423890 682829678
3807.8 682829678 683442235 684168875 684724152 685130417 685691476 686192930 686615705 687220573 687783539 688256145
3828.2 688256145 688692987 689124286 689672351 690121830 690372884 690735459 691164911 691592038 692128479 692724168
3848.6 692724168 693094611 692975223 692997813 693632245 694305956 694787025 695125282 695451856 695754349 695881248
3869 695881248 696064651 696413457 696796298 697221756 697523296 697763920 698094845 698396146 698741198 699072182
3889.4 699072182 699258864 699490070 699831367 700101495 700200081 700209618 700293183 700565100 700908899 701166153
$$ packed form
3748.7F62025034O79553Q66950J158833J063347Q20875P91550Q79526Q60333P66874
3767.1F69912875O61313P05779Q30233Q66055Q23379P15613O79374O64830O28710O61552
3787.5F77149713O88136O60538N90384N33879N79655N30243M85838O60658N44846M05788
3807.8F82829678O12557P26640N55277M06265N61059N01454M22775O04868N62966M72606
3828.2F88256145M36842M31299N48065M49479K51054L62575M29452M27127N36441N95689
3848.6F92724168L70443j19388K2590O34432O73711M81069L38257L26574L02493J26899
3869F95881248J83403L48806L82841M25458L01540K40624L30925L01301L45052L30984
3889.4F99072182J86682K31206L41297K70128R8586R537Q3565K71917L43799K57254
$$ plain form
3909.8 701166153 701372504 701530516 701598346 701683640 701880097 702105403 702276170 702400506 702510715 702632666
3930.2 702632666 702798188 703015685 703229249 703387916 703484356 703580201 703788221 704054594 704247713 704363465
3950.6 704363465 704450846 704567850 704718053 704826713 704900622 705008209 705133617 705260217 705412507 705563605
3971 705563605 705690682 705832005 705988467 706069887 706085503 706154287 706273198 706370115 706477284 706647217 706853807
3993.4 706853807 707032919 707122743
3997.5 707122743
$$ packed form
3909.8G01166153K06351J58012O7830Q5294J96457K25306J70767J24336J10209J21951
3930.2G02632666J65522K17497K13564J58667R6440R5845K08020K66373J93119J15752
3950.6G04363465Q7381J17004J50203J08660P3909J07587J25408J26600J52290J51098
3971G05563605J27077J41323J56462Q1420J5616O8784J18911R6917J07169J69933K06590
3993.4G06853807J79112Q9824
3997.5G07122743
##END=$$ End of the data block
