##TITLE=G23-51-SE $$ Begin of the data block
##JCAMP-DX=5.00 $$ ACD/SpecManager v 10.08
##SPECTROMETER/DATA SYSTEM=Alpha
##DATE=23 Oct 2013 10:11:40
##DATA TYPE=INFRARED SPECTRUM
##DATA CLASS=XYDATA
##ORIGIN=
##OWNER=
##NPOINTS=1765
##FIRSTX=399.75695801
##LASTX=3997.56933594
##MAXX=3997.56933594
##MINX=399.75695801
##MAXY=0.80072701
##MINY=0.26190400
##XFACTOR=1.0000000000
##YFACTOR=1.000000000000000e-9
##FIRSTY=0.52487087
##DELTAX=2.03957629
##XUNITS=1/CM
##YUNITS=ARBITRARY UNITS
##XYDATA=(X++(Y..Y))
399.8 524870872 518340945 514496028 514461815 515668631 515083432 513312519 513188958 515181065 516685307
418.1 516685307 514890969 511430979 509263575 509033561 508947790 506590724 502667725 500325978 500809252
436.5 500809252 502400041 502976775 502696276 503708005 506569207 508934736 508728087 506731033 505458772
454.8 505458772 505525768 504717171 501598716 497552335 494852960 493919373 492661357 489400715 485264778
473.2 485264778 482952476 482878357 482754886 480954081 478519082 477470934 477998227 478126526 476261228
491.5 476261228 473050356 470558733 469695956 468774259 465696901 461218566 457756430 455880076 454148352
509.9 454148352 450936735 446543038 443084955 441559285 440644979 438842952 436470449 435169756 435865372
528.3 435865372 437509149 438490659 438837081 440270573 443856895 448209524 450812012 450957358 450367361
546.6 450367361 450706929 451354593 450526565 447981179 445369959 443891883 442887664 440883696 437378079
565 437378079 433631539 431256562 430342078 429858029 429323673 429562926 431736052 435607105 439532518
583.3 439532518 442259550 444209158 446464777 449019879 450580388 450323105 449316114 449238688 450277954
601.7 450277954 451055944 450578302 449563444 449510098 450863391 452408373 452870280 452831984 454000294
620 454000294 456970870 460584670 463241369 464989424 467245281 470535368 473827094 475824594 476518512
638.4 476518512 477336973 479296267 481604308 482745528 482572407 482529223 483628154 485121906 485618025
656.7 485618025 484979928 484526187 485274464 486841500 488368005 488648683 488563418 489921778 492490113
675.1 492490113 494713962 495631337 496141881 497464627 499436498 500797808 500709355 499783099 499189854
693.5 499189854 499113619 498635650 497262269 495897382 495911419 497587502 499863684 501662254 503171444
711.8 503171444 505508423 509176254 513377190 517092586 520515919 524778008 530285954 535990357
728.1 535990357 540405273 543217540 545553744 548474431 551453114 553067565 553050458 552662134 552905262
746.5 552905262 553357542 552868009 551081061 548843265 547203422 546328306 545422912 544041276 543191314
764.8 543191314 544425011 547956944 552540660 557089567 561830163 567526877 573922575 579581320
781.2 579581320 583428741 586008608 588661015 591907144 594934642 596868932 598231554 600473881
797.5 600473881 604227722 608567536 612121284 614609838 616979063 619845569 622391105 623382032 622894943
815.8 622894943 622153997 621917963 621580362 619955361 616778731 613108993 610086977 607572377 604531407
834.2 604531407 600608349 596653819 593586326 591347396 589135349 586547554 584171414 582769394
850.5 582769394 582246423 581727922 580621660 579622149 580421507 584061265 589848638 596263409 602610826
868.9 602610826 609031796 615199089 619817138 621634066 620742321 618259072 614927590 610588670 604978740
887.2 604978740 598627090 592605233 587511957 582904875 577902853 572250307 566362023 560490429
903.5 560490429 554295540 547230661 539303064 531235695 523747325 517020047 511011660 505956352
919.8 505956352 502349377 500414073 499659777 499202311 498573154 498036146 498016268 498457164 498877257 498830199
940.2 498830199 498082995 496191293 492254496 485601246 476523519 466021508 455064386 444127142
956.6 444127142 433145702 421877861 410351366 398944139 388026118 377703220 367970437 359026492
972.9 359026492 351299047 345145524 340595186 337357908 335102350 333629191 332784086 332299620 331867397
991.2 331867397 331354588 330893636 330757827 331088215 331745267 332394570 332735747 332625926 332046807 331068635
1011.6 331068635 329775482 328255504 326714844 325332016 324024469 322535634 320714802 318725586
1027.9 318725586 316842109 315111250 313334197 311313033 309091777 306929290 304987848 303203344
1044.3 303203344 301519066 300078303 299152762 298937142 299421132 300419867 301828384 303732485 306196660
1062.6 306196660 309025615 311609030 313007355 312682629 311219215 309858054 309472293 310317487 312420696
1081 312420696 315694541 319858223 324473470 329103261 333517790 337704927 341634810 345027387 347556800
1099.3 347556800 349244148 350483358 351767510 353418857 355439991 357699007 360202909 362933040
1115.6 362933040 365636647 367953539 369711965 371126145 372644961 374592632 376976997 379558533
1132 379558533 382031351 384120852 385546029 386037290 385609597 384678930 383708298 382911742 382280439
1150.3 382280439 381779879 381573528 382041961 383444816 385658294 388421059 391675264 395505250 399936736
1168.7 399936736 404942185 410492718 416569233 423195183 430395603 437933117 445295542 452138156
1185 452138156 458455026 464249432 469201267 472804248 474880368 475802571 476119131 476102710 475712627
1203.3 475712627 474999011 474389464 474344850 474855304 475503087 475922763 476065755 476100773 476035833 475545019
1223.7 475545019 474356085 472631156 470816612 469195634 467688322 466183782 464846313 464043766
1240.1 464043766 464044750 464724630 465753794 467053354 468818069 471111625 473680496 476139992 478329539
1258.4 478329539 480402142 482545972 484781206 486948580 488927007 490816057 492751807 494583696
1274.7 494583696 495989949 496900648 497625351 498561174 499785930 500984371 501803219 502211571 502378404
1293.1 502378404 502264202 501569629 500161290 498310864 496464014 494831979 493255109 491554826 489907682
1311.4 489907682 488702536 488129854 488061488 488172650 488170624 487914741 487259001 485912263 483707607 480910927
1331.8 480910927 478079557 475709409 473908812 472461820 471224099 470269769 469606876 468987763 468033582
1350.2 468033582 466579378 464786917 462899953 460933059 458465099 454974532 450717747 446534485
1366.5 446534485 442752898 439236164 435317457 430650830 426346421 423430175 421518326 419742048
1382.8 419742048 418017507 416847795 416495264 416662246 416834176 416727573 416557014 416666985 417224109
1401.2 417224109 418115288 419160634 420332670 421728283 423362315 425067037 426763952 428629875
1417.5 428629875 430916131 433336705 435644120 437690914 439215899 440148264 440504938 440314919 439391494
1435.9 439391494 437979728 436949462 436375946 435937107 435417593 434588969 433383018 431968540 430827260
1454.2 430827260 430571049 431621939 433492780 435845613 439082175 443721294 450237602 459460706
1470.5 459460706 471618921 483476281 492688626 499861628 505398273 509421527 511864483 512623608
1486.8 512623608 511377752 508289516 504579484 500382066 495066732 489271134 483823180 478686571
1503.2 478686571 472256631 462783843 453693688 445938587 438439548 432010293 427441508 424592167
1519.5 424592167 422023147 419133306 416240454 413271278 410595834 408051908 405303806 403157771
1535.8 403157771 401815623 400521606 399453193 399227202 399906188 401559412 404145926 407391101 411056519
1554.1 411056519 415016472 419936836 425384998 429182857 432214260 435173601 438031673 440754294
1570.5 440754294 442884058 444494784 445789039 446708977 447384238 447776884 447809458 447494209 446923733
1588.8 446923733 446016014 444624394 442540705 439747453 436330736 432230592 427350610 421630681
1605.1 421630681 415047795 407559961 399612278 391657740 382678777 371830285 361881673 352543801
1621.4 352543801 341689527 330650777 320266962 310287952 301572412 293601125 285249799 278955579
1637.8 278955579 275746644 274281859 273937345 274456441 275641859 277059674 279002994 282011271 285156965
1656.1 285156965 288481921 292749435 298277259 304701954 311122030 318203688 326246321 333836138
1672.4 333836138 341714442 350428522 358771235 366801947 375889450 387410551 398538202 408618808
1688.8 408618808 419748157 431501448 445575416 461970210 478401423 495838732 510219336
1703 510219336 522082865 533844709 544155359 552994132 560831606 568116903 575487018 582077086
1719.3 582077086 587124348 591299713 595058322 598500848 601855695 604986846 607995033 610868096
1735.7 610868096 613712311 617263138 621522367 626032233 630852580 636207402 642279506 648622274
1752 648622274 654296696 659588039 664921045 670253754 675766647 680828631 685190082 689346433 693494141
1770.3 693494141 697714031 701526105 704547882 707271457 710092664 712953508 715602815 717854023
1786.7 717854023 719820559 721849620 724147439 726285696 727993488 729490221 731134772 733001888
1803 733001888 734797299 736307561 737595856 738945067 740494013 742103875 743489027 744585276 745628595
1821.3 745628595 746894658 748360813 749638736 750571609 751450241 752550125 753755331 754787266 755531967
1839.7 755531967 756189227 757033348 758076310 758978248 759584069 760091484 760776818 761694491 762558758
1858 762558758 763107657 763453603 763943911 764687538 765463591 765996218 766326487 766766906 767471969 768256485
1878.4 768256485 768824160 769177675 769604802 770306528 771133661 771764934 772124529 772455394 772998929 773679316
1898.8 773679316 774220824 774488449 774663925 775022566 775588214 776096761 776337802 776456416 776749849 777282298
1919.2 777282298 777769029 777982533 778045058 778246403 778660297 779084265 779315174 779382646 779529095 779886365
1939.6 779886365 780287862 780491292 780516207 780596256 780905187 781352341 781670332 781784654 781894624 782198250
1960 782198250 782620668 782937169 783044100 783083618 783265710 783605039 783918619 784040749 784070492 784209371
1980.4 784209371 784502506 784786463 784895122 784870684 784913182 785129189 785381079 785483062 785451293 785470366
2000.8 785470366 785599470 785715282 785667717 785467625 785291731 785247624 785232723 785099208 784845591 784564972
2021.2 784564972 784366310 784241498 784058034 783758104 783452570 783253074 783146203 783007443 782740653 782454908
2041.6 782454908 782320499 782330394 782320559 782203138 782050192 781992257 782066882 782177567 782214224 782195687 782242000
2064 782242000 782404244 782621741 782758355 782750607 782722354 782825291 783017933 783156335 783181429 783179522 783274114
2086.5 783274114 783444166 783594728 783667505 783703983 783804834 783999443 784188986 784304380 784406841 784549773
2106.9 784549773 784730911 784905314 785027325 785098612 785161972 785262227 785388112 785470605 785497844 785540223
2127.3 785540223 785640419 785776198 785896778 785968721 785998225 786061823 786194324 786308885 786367297 786425352
2147.7 786425352 786523581 786668479 786828399 786965072 787104428 787306666 787583470 787876725 788154542 788439214
2168 788439214 788767517 789172292 789623320 790038168 790369987 790670693 791024029 791427910 791813314 792137325
2188.4 792137325 792424977 792748392 793134451 793526173 793862164 794141531 794422328 794734001 795045614 795331597
2208.8 795331597 795612633 795925617 796271443 796617925 796906888 797123313 797339559 797605157 797866464 798058987
2229.2 798058987 798211157 798362136 798525810 798710465 798875749 798995733 799096227 799185157 799270511 799379647
2249.6 799379647 799498439 799580038 799647987 799782455 799946487 800042629 800073206 800104916 800190926 800324023 800430357
2272.1 800430357 800453007 800442576 800482631 800569892 800622761 800604522 800578117 800608575 800643384 800600052 800532639
2294.5 800532639 800519526 800528586 800519526 800510228 800489545 800464988 800481319 800514102 800514281 800498664 800521016 800567448
2319 800567448 800645411 800727010 800660610 800481975 800378740 800287843 800053120 799769819 799589574 799545705 799518466
2341.4 799518466 799273908 798634410 797937810 797644615 797782600 798107862 798381209 798540950 798481405 798122644
2361.8 798122644 797624946 797072291 796396494 795641541 794903874 794254303 793654144 793033957 792441130 791976452
2382.2 791976452 791652262 791347742 790988028 790600657 790197134 789790392 789407849 789030850 788609862 788141072
2402.6 788141072 787679672 787245274 786781907 786239326 785654366 785090506 784529746 783948421 783351183 782723725
2423 782723725 782082558 781466901 780849993 780169189 779454172 778766990 778089583 777410150 776758373 776107132
2443.4 776107132 775424182 774721742 774013519 773312867 772610426 771918058 771261930 770608544 769918740 769210041
2463.8 769210041 768550217 767955959 767353654 766680956 765957355 765254915 764601827 763947189 763251662 762567818
2484.2 762567818 761940956 761339724 760736525 760109901 759464025 758857012 758294702 757723391 757130623 756538391
2504.6 756538391 755954921 755376995 754812896 754255176 753656745 753012896 752386153 751788914 751162112 750481725
2525 750481725 749796152 749142826 748477578 747761965 747013569 746260822 745524466 744789243 744035542 743277073
2545.4 743277073 742561579 741926908 741326094 740665734 739901781 739108860 738378167 737690508 736999869 736302257
2565.8 736302257 735614002 734955013 734305680 733625114 732900441 732140958 731390536 730697751 730032504 729322374
2586.2 729322374 728578091 727871478 727223396 726604879 725955486 725220919 724445045 723706961 722974241 722166717
2606.6 722166717 721306622 720451355 719595373 718694448 717721581 716700017 715654910 714575768 713462889
2624.9 713462889 712323427 711134911 709909976 708714962 707569778 706416667 705205858 703958511
2641.2 703958511 702729702 701526582 700302243 699037850 697769880 696544826 695371687 694198906
2657.5 694198906 692978323 691735446 690512717 689316154 688149214 687009990 685891867 684802294
2673.9 684802294 683754921 682758152 681770802 680736661 679687738 678685784 677703559 676690340 675650895
2692.2 675650895 674614847 673591793 672552407 671442330 670241714 669006169 667793572 666571736
2708.5 666571736 665280163 663935542 662592888 661292851 660047591 658818901 657563686 656312585
2724.8 656312585 655141115 654076219 653084636 652100921 651082218 650075495 649140418 648228526 647253454
2743.2 647253454 646219254 645204902 644253016 643324435 642362833 641361237 640360773 639406681 638492823
2761.6 638492823 637540638 636508644 635444939 634387612 633313596 632153034 630891740 629605174
2777.9 629605174 628319561 627013206 625660121 624193966 622595847 620957673 619344473 617678106
2794.2 617678106 615879238 613997519 612113059 610259235 608361721 606286645 604045749 601766407
2810.5 601766407 599461854 597054124 594517171 591852546 589059949 586096823 582850933 579203725
2826.8 579203725 575063050 570325315 564811647 558261752 550391674 541022003 530113637 517590940
2843.1 517590940 503311336 487503827 471506506 457997084 449872017 448255599 451668888 457199365
2859.5 457199365 462181658 465037704 465303659 463414818 460531622 458144069 457231581 457607597 458284914
2877.8 458284914 458361804 457420349 455409288 452437729 448686749 444397181 439775437 434934735 429906905
2896.2 429906905 424637616 419019610 412955910 406348228 399004340 390632749 380874634 369489074
2912.5 369489074 356770128 343674481 331532389 321702570 315298378 312979251 314810067 320206434
2928.8 320206434 328177959 337854236 348649502 359948784 370990396 380979389 389150083 394938648
2945.1 394938648 398254722 399547696 399644494 399607271 400496662 403048962 407553792 413965642 422098488
2963.5 422098488 431670278 442212254 453114897 463815272 473909497 483206511 491686702 499350309
2979.8 499350309 506169617 512152314 517346382 521808207 525607526 528773904 531279743 533126533
2996.1 533126533 534328580 534926176 534998477 534604967 533858895 532960713 532073319 531205475 530289233 529302657
3016.5 529302657 528191030 526874185 525314093 523488760 521453857 519356728 517311633 515322983
3032.8 515322983 513310015 511214077 509016156 506703436 504313648 501895010 499423563 496888012
3049.1 496888012 494374961 491902649 489402354 486890197 484444976 482112229 479881406 477764010
3065.5 477764010 475791425 473895133 472029865 470259577 468601942 467008024 465426236 463852137
3081.8 463852137 462345183 460947633 459629864 458348095 457104176 455880910 454665482 453458905
3098.1 453458905 452203065 450873584 449503541 448116779 446715981 445261806 443735838 442162156
3114.4 442162156 440562755 438961804 437309384 435525447 433672726 431834102 429995328 428119957
3130.7 428119957 426165164 424155921 422177464 420228392 418196410 416073233 413976133 411921829
3147 411921829 409860611 407766134 405613393 403423607 401261657 399128824 396997362 394863784 392707407
3165.4 392707407 390541345 388386995 386218995 384014189 381802052 379646629 377566457 375515878
3181.7 375515878 373441458 371329397 369211346 367107511 365053087 363067448 361075014 359069139
3198 359069139 357140690 355316788 353534102 351735383 349945843 348205119 346461922 344687939 342953473
3216.4 342953473 341264337 339583844 337915391 336245805 334547490 332804173 331026584 329254866
3232.7 329254866 327458352 325580955 323657840 321708918 319727451 317704201 315603197 313448131
3249 313448131 311308056 309193879 307071716 304895461 302648276 300394654 298217297 296143204 294151127
3267.4 294151127 292238265 290428251 288737565 287162453 285678029 284276456 282993078 281865329
3283.7 281865329 280903131 280091733 279362440 278665036 278043300 277550489 277147651 276778102 276463151 276200801
3304.1 276200801 275966644 275770992 275596201 275421470 275256455 275115103 275003672 274919748 274814516 274651259
3324.5 274651259 274481803 274342656 274197906 274009615 273820043 273666978 273483187 273187965 272803873 272412300
3344.9 272412300 272050023 271691740 271275669 270808280 270320475 269826680 269370377 268924624 268441617 267962128
3365.3 267962128 267511189 267022371 266450524 265870810 265365183 264929920 264532149 264129192 263752490 263464868
3385.7 263464868 263266921 263136178 262975544 262694657 262400866 262298107 262367249 262333959 262111902 261931628
3406.1 261931628 261904001 261971444 262080491 262186646 262303412 262470067 262712032 263071388 263567775 264142245
3426.5 264142245 264739484 265344679 266059190 266939878 267769575 268444002 269168407 270025134 270950377 271966249
3446.8 271966249 273032188 274104238 275221616 276426524 277753741 279157221 280508518 281847924
3463.2 281847924 283380389 285086840 286638290 287887752 289136112 290631682 292367846 294176280
3479.5 294176280 295884132 297564387 299361885 301209033 303010166 304831177 306698859 308591127
3495.8 308591127 310518712 312510669 314522862 316447169 318318814 320314735 322454840 324633777
3512.1 324633777 326764822 328802645 330896080 333190113 335641712 338014275 340202570 342391163
3528.4 342391163 344707936 347152144 349712998 352304697 354844987 357465476 360240787 363019198
3544.7 363019198 365655214 368280321 371055514 373924911 376784205 379656821 382666677 385819584
3561.1 385819584 388982981 392114908 395459324 399062395 402612180 406056106 409568161 413218707
3577.4 413218707 417017847 420951158 424942374 428936154 432959408 437055081 441122562 445228457
3593.7 445228457 449499220 453841746 458122969 462416768 466759086 471028030 475368977 479872972
3610 479872972 484407693 488938600 493370205 497849703 502601087 507215381 511488199 515589535 519883394
3628.4 519883394 524543583 529002309 533216834 537361562 541464865 545568466 549653649 553669274
3644.7 553669274 557609618 561643779 565753818 569558799 573061347 576664269 580348492 583824635
3661 583824635 587124586 590408385 593624711 596771300 600013316 603023708 605746508 608550191 611299455
3679.4 611299455 613913059 616547465 619215131 621816754 624174953 626263440 628276706 630298436
3695.7 630298436 632265091 634076834 635742724 637428761 639160514 640770912 642180026 643512189
3712 643512189 644970119 646445870 647804797 649083376 650319695 651454687 652488530 653625429 654853582
3730.3 654853582 656036556 657117367 658102155 659169912 660284519 661081851 661697030 662715852 663713455
3748.7 663713455 664357245 665131211 666204274 667258680 668116808 668915451 669775009 670649827 671460748
3767.1 671460748 672108471 672747374 673564315 674422264 675198555 675910354 676595271 677235067 677848816 678501248
3787.5 678501248 679184258 679885983 680574179 681211591 681849718 682359397 682770014 683395565 683963537 684363186
3807.8 684363186 684920609 685647070 686282814 686744034 687256277 687686920 688096106 688696206 689254642 689749360
3828.2 689749360 690180242 690580666 691155553 691694498 691978872 692258656 692631125 693096757 693697274 694370031
3848.6 694370031 694837987 694712937 694564581 695089340 695752501 696235120 696566403 696887672 697243333 697485685
3869 697485685 697733581 698092103 698473394 698870122 699151695 699409723 699775696 700091243 700394809 700657189
3889.4 700657189 700769901 700923383 701242924 701554835 701732993 701847494 701945722 702106059 702360570 702625513
3909.8 702625513 702892423 703098476 703144610 703167498 703367770 703652620 703853250 703978360 704093277 704232514
3930.2 704232514 704406857 704593241 704765320 704885840 704932749 705008268 705239177 705533266 705736756 705855608
3950.6 705855608 705944300 706039369 706179321 706328452 706415772 706482649 706622839 706806302 706937373 707046628
3971 707046628 707172453 707269728 707353234 707429469 707524657 707694530 707873523 707973301 708038807 708131254 708263218
3993.4 708263218 708444715 708592713
3997.5 708592713
##END=$$ End of the data block
