##TITLE=G23-51-SE $$ Begin of the data block
##JCAMP-DX=5.00 $$ ACD/SpecManager v 10.08
##SPECTROMETER/DATA SYSTEM=Alpha
##DATE=23 Oct 2013 10:11:40
##DATA TYPE=INFRARED SPECTRUM
##DATA CLASS=XYDATA
##ORIGIN=
##OWNER=
##NPOINTS=1765
##FIRSTX=399.75695801
##LASTX=3997.56933594
##MAXX=3997.56933594
##MINX=399.75695801
##MAXY=0.80219710
##MINY=0.26262709
##XFACTOR=1.0000000000
##YFACTOR=1.000000000000000e-9
##FIRSTY=0.52409446
##DELTAX=2.03957629
##XUNITS=1/CM
##YUNITS=ARBITRARY UNITS
##XYDATA=(X++(Y..Y))
399.8E24094462o082534l288627K27332J295626m35352j788497l82364J875818J485288
418.1E17001152j881540l543675k090513r3520l48926k769351l699183j521945J063525
436.5E02116024J509369K84254k57372J210272K862871K070903p89582k519131j188159
454.8E05299449O93381l28422l158450m477233l181785j017958r11265k924532m223407
473.2D85769778k665996j62631K46793j518816k680391j354009N57899K58238j893998
491.5D76556867l252565k533407j084655r38922k754897m323572l560811j986474j768977
509.9D54352587l128737m165083l233015j465530j000136k005726k619982j367986
526.2D35366392Q99434J795858Q17418J21505J478195L791660M438340K555043J13070
$$ y = [524094462, 518011928, 514723301, 514950633, 516246259, 515810907, 514022410, 513640046, 515515864, 517001152, 515119612, 511575937, 509485424, 509391904, 509042978, 506273627, 502574444, 501052499, 502116024, 503625393, 503909647, 503652275, 504862547, 507725418, 509796321, 509006739, 506487608, 505299449, 505992830, 505664408, 502505958, 498028725, 494846940, 493828982, 492917717, 489993185, 485769778, 483103782, 482941151, 483187944, 481669128, 478988737, 477634728, 478192627, 478450865, 476556867, 473304302, 470770895, 469686240, 468747318, 465992421, 461668849, 458108038, 456121564, 454352587, 451223850, 447058767, 443825752, 442360222, 441360086, 439354360, 436734378, 435366392, 436265826, 438061684, 438879102, 439000607, 440478802, 444270462, 448708802, 451263845, 451376915]
544.6D51376915n42998M06891O87539q20487k589256k662420j436770q72255j914858
562.9D41632301l522367l796190k374917r28372n41926n74946K04235K170265L846318
581.3D36114401L814369K658874K005219K346546K542257J396328l62575r01609K6434
599.6D49640244J017332Q27194k54751q37415p5519J227081J505226N70595N841J131147
620D54756975K987296L644377K689570J764029K228081L221303L189207J925885P92206
638.4D77198929J086562K134175K303630J096576k12908o5475J147091J599997N22673
656.7D86811250p48425o08027O23822J517713J585364L85046n2631J331300K436936
675.1D93282348K126962J039207O53833J327962J948774J377463l1650q63493n93722
$$ y = [451376915, 450833917, 451240808, 451928347, 451107860, 448518604, 445856184, 444419414, 443547159, 441632301, 438109934, 434313744, 431938827, 431010455, 430468529, 429893583, 430097818, 432268083, 436114401, 439928770, 442587644, 444592863, 446939409, 449481666, 450877994, 450515419, 449613810, 449640244, 450657576, 451484770, 451230019, 450392604, 450317085, 451544166, 453049392, 453619987, 453625828, 454756975, 457744271, 461388648, 464078218, 465842247, 468070328, 471291631, 474480838, 476406723, 477198929, 478285491, 480419666, 482723296, 483819872, 483606964, 483541489, 484688580, 486288577, 486811250, 486062825, 485454798, 486078620, 487596333, 489181697, 489566743, 489514112, 490845412, 493282348, 495409310, 496448517, 497102350, 498430312, 500379086, 501756549, 501724899, 500861406, 500267684]
693.5E00267684j31785n39065j466185j409918J45644J785279K177745J658022J488030
711.8E03975451K375484L688097M228711L763854L486574M322886N515576N631864
728.1E36988497M365504K877175K436817K968073K932250J526773q6247m44830K40386
746.5E53804398N48005m25935j919091k374470j596630q19206r71973j477599q45313
764.8E43922186J274943L514946M563272M569292M742324N645454O387293N775035
781.2E80394745L982425K582728K564669L182471L034294J987397J388431K241134
797.5F01358294L785909M372120L470897K328217K245367K756178K488196J080573
813.8F23885751l35276o67155k35796l64661j658976l198088l677904k997875k507687
$$ y = [500267684, 500135899, 499596834, 498130649, 496720731, 496866375, 498651654, 500829399, 502487421, 503975451, 506350935, 510039032, 514267743, 518031597, 521518171, 525841057, 531356633, 536988497, 541354001, 544231176, 546667993, 549636066, 552568316, 554095089, 554008842, 553564012, 553804398, 554352403, 553926468, 552007377, 549632907, 548036277, 547217071, 546245098, 544767499, 543922186, 545197129, 548712075, 553275347, 557844639, 562586963, 568232417, 574619710, 580394745, 584377170, 586959898, 589524567, 592707038, 595741332, 597728729, 599117160, 601358294, 605144203, 609516323, 612987220, 615315437, 617560804, 620316982, 622805178, 623885751, 623550475, 622883320, 622647524, 622282863, 620623887, 617425799, 613747895, 610750020, 608242333]
832.1F08242333l101766m010499m048943l121555k198398k138198k553641k361954
848.5E84707379j355827m51147n24998j212299j081943P89821L646255N742609O351590
866.8E96611440O392121O533742O155253M511952J794994q52883k486646l387809m429698
885.2F10842466n695045o369114n976378n080939m648506n047143n709887n930781
901.5E66384673n873144o203055p088721p953047q093060p483124o651998n910992
917.8E11127532n030096l661752k003670p75486m09215n47231n23060q2284L89039
936.2D98483777L85493n4091p31260j914173l952473o618262r069085j0533154j0964870
954.5D55031902j0924995j0989428j1258423j1456281j1357367j0961324j0399282
$$ y = [608242333, 605140567, 601130068, 597081125, 593959570, 591761172, 589622974, 587069333, 584707379, 583351552, 582900405, 582375407, 581163108, 580081165, 580870986, 584517241, 590259850, 596611440, 603003561, 609537303, 615692556, 620204508, 621999502, 621146619, 618659973, 615272164, 610842466, 605147421, 598778307, 592801929, 587720990, 583072484, 578025341, 572315454, 566384673, 560511529, 554308474, 547219753, 539266706, 531173646, 523690522, 517038524, 511127532, 506097436, 502435684, 500432014, 499656528, 499247313, 498700082, 498177022, 498094738, 498483777, 498869270, 498815179, 498083919, 496169746, 492217273, 485599011, 476529926, 465996772, 455031902, 444106907, 433117479, 421859056, 410402775, 399045408, 388084084, 377684802]
968.8C77684802r757012q924365p720113o175101m568875l209114k203435j451343
985.1C33675444q42333m67956m24027n42432m96030j38194L45111O64741O30975K98023
1005.5C32703322j22130n32806r44107j315892j544804j543909j367837j278728j503170
1023.9C22549939j883715k038956j889646j717806j766205j990348k164185k123445
1040.2C06975633j943618j804799j706034j436680q68649j41203N30690J002997J354814
1058.5C01963151J830130K432943K837270K577216J370370l09378j426995j372069
1074.8C09902638m02897Q53002K102285L295988M199565M586488M572570M395515M224747
1093.2C37729901L992885L418327K516925J671344J231134J278311J639456K004265
$$ y = [377684802, 367927790, 359003425, 351283312, 345108211, 340539336, 337330222, 335126787, 333675444, 332833111, 332365155, 331941128, 331398696, 330902666, 330764472, 331109583, 331774324, 332405299, 332703322, 332581192, 332048386, 331104279, 329788387, 328243583, 326699674, 325331837, 324053109, 322549939, 320666224, 318627268, 316737622, 315019816, 313253611, 311263263, 309099078, 306975633, 305032015, 303227216, 301521182, 300084502, 299215853, 299074650, 299605340, 300608337, 301963151, 303793281, 306226224, 309063494, 311640710, 313011080, 312701702, 311274707, 309902638, 309499741, 310352743, 312455028, 315751016, 319950581, 324537069, 329109639, 333505154, 337729901, 341722786, 345141113, 347658038, 349329382, 350560516, 351838827, 353478283, 355482548]
1109.5C55482548K281487K570957K780557K713949K308935J742392J401425J519799
1125.8C72802049J933783K372891K591044K484917K116442J438379M81725m40180r70960
1144.2C84810090j001358p68036o09338n07861j87338N00203J417577K213657K760589
1162.6C88628185L235101L784359M414558N015105N531192O050855O625295P192999
1178.9D30477649P504851P316112O799847O316841N835861M986763L611713K066404
1195.2D74916041R11474L15756k6375m05610p03812n94347m6104N12152O43701L85701
1215.6D75908577J16289K1160r7335m89026j136422j678407j785189j601041j514345
1233.9D67744261j539886j347989p75277P838O82592J081914J340449J745462K285629
$$ y = [355482548, 357764035, 360334992, 363115549, 365829498, 368138433, 369880825, 371282250, 372802049, 374735832, 377108723, 379699767, 382184684, 384301126, 385739505, 386221230, 385781050, 384810090, 383808732, 383040696, 382431358, 381923497, 381736159, 382236362, 383653939, 385867596, 388628185, 391863286, 395647645, 400062203, 405077308, 410608500, 416659355, 423284650, 430477649, 437982500, 445298612, 452098459, 458415300, 464251161, 469237924, 472849637, 474916041, 475827515, 476143271, 476116896, 475711286, 475007474, 474413127, 474367023, 474879175, 475522876, 475908577, 476024866, 476046026, 475948691, 475459665, 474323243, 472644836, 470859647, 469258606, 467744261, 466204375, 464856386, 464081109, 464088947, 464771539, 465853453, 467193902, 468939364, 471224993]
1252.3D71224993K586723K441943K154022K081543K187312K282053K212644J991361
1268.6D89162594J866132J918256J824707J391292Q90910P20174R55551J251668J214922
1287E01196206Q29994M22240J82092j01269p02321j426756j866579j859993j623661
1305.3D95049953j554548j675368j642376j224488n58972l3051R7901n4628l05355
1323.7D88099068o75439j336605k198726k799719k825827k354353j800478j466125
1340D72641796j244664r49622o48736o01113r62198j476914j791537j884967j981616
1358.3D61100429k467870l488124m277944m196287l776818l534198l950983m660368
1374.7D30747837m252672k869070j912206j805246j725942j141489l51071J35928J57655
$$ y = [471224993, 473811716, 476253659, 478407681, 480489224, 482676536, 484958589, 487171233, 489162594, 491028726, 492946982, 494771689, 496162981, 497053891, 497774065, 498729616, 499981284, 501196206, 502026200, 502448440, 502630532, 502529263, 501826942, 500400186, 498533607, 496673614, 495049953, 493495405, 491820037, 490177661, 488953173, 488394201, 488361150, 488459051, 488404423, 488099068, 487423629, 486087024, 483888298, 481088579, 478262752, 475908399, 474107921, 472641796, 471397132, 470447510, 469798774, 469197661, 468235463, 466758549, 464967012, 463082045, 461100429, 458632559, 455144435, 450866491, 446670204, 442893386, 439359188, 435408205, 430747837, 426495165, 423626095, 421713889, 419908643, 418182701, 417041212, 416690141, 416826069, 416983724]
1393D16983724p5192j16258J35540N46307Q92073J066983J180887J405030J665592
1411.4D23684686J736552J711249J868546K268613K388119K288372K051890J545995
1427.7D39544022R40323L41684j94133r17285j424790j041084n72145m50313n47946
1446D35678333q52615j215458j400798j077324j74165J039028J797795K325953L257244
1464.4D39377993M640341O471455R151995J2082816J1831045R228229P175654N512536
1480.7E05472064L983796K419412P64668j250923l142536l775298m224837n310416
1497D94935930n791188n465209n137146o340473r353042r086281p770330p470131o380945
1515.4D32141185m534543k849251k572238k869368k853781k933562k646803k491057
$$ y = [416983724, 416908532, 416792274, 416927814, 417474121, 418366194, 419433177, 420614064, 422019094, 423684686, 425421238, 427132487, 429001033, 431269646, 433657765, 435946137, 437998027, 439544022, 440484345, 440826029, 440631896, 439714611, 438289821, 437248737, 436676592, 436226279, 435678333, 434825718, 433610260, 432209462, 431132138, 430957973, 431997001, 433794796, 436120749, 439377993, 444018334, 450489789, 459641784, 471724600, 483555645, 492783874, 499959528, 505472064, 509455860, 511875272, 512639940, 511389017, 508246481, 504471183, 500246346, 494935930, 489144742, 483679533, 478542387, 472201914, 462848872, 453762591, 445992261, 438522130, 432141185, 427606642, 424757391, 422185153, 419315785, 416462004, 413528442, 410881639, 408390582]
1531.7D08390582k696246k124280j303852j232803j018941j69635P03961J635462K590656
1550.1D04774904L309220L746420L987194M913270N426735L755659L003418K945900
1566.4D35862720K852678K715499K107530J593858J276076Q75294O24180L44843n66
1584.7D48252112l27558n71847q99404j394302k128630k838970l396034m049510m852771
1603.1D27793086n696178o541610p440626p923097p945746q960664j0844082r970873
1619.4C62470210r359062j0870516j1043728j0379821r986937q723229p954270q346110
1635.7B85806537o333500l225685j443505l16292N50270J211882J424432J928061K968132
1654.1B82570332L116757L316581M274756N551666O432742O407142P083922Q040041
$$ y = [408390582, 405694336, 403570056, 402266204, 401033401, 400014460, 399844825, 400548786, 402184248, 404774904, 408084124, 411830544, 415817738, 420731008, 426157743, 429913402, 432916820, 435862720, 438715398, 441430897, 443538427, 445132285, 446408361, 447283655, 447907835, 448252678, 448252112, 447924554, 447352707, 446453303, 445059001, 442930371, 440091401, 436695367, 432645857, 427793086, 422096908, 415555298, 408114672, 400191575, 392245829, 383285165, 372441083, 362470210, 353111148, 342240632, 331196904, 320817083, 310830146, 302106917, 294152647, 285806537, 279473037, 276247352, 274803847, 274487555, 275037825, 276249707, 277674139, 279602200, 282570332, 285687089, 289003670, 293278426, 298830092, 305262834, 311669976, 318753898, 326793939]
1670.4C26793939P581234P897347Q712977Q326501Q063912R143204J1518001J1054308
1686.7C99091423R991943J1061758J1738926J4100701J6417414J6416699J7400473
1701D96219337J4384925J1911691J1803448J0337353Q893847P925928P379233P434845
1717.3E76290607O600142N042195M192829L792465L465951L363013L146529L031910
1733.6F08925641K883911K868473L577233M254639M515826M859150N401969O087601
1749.9F43374443O292045N601585N257666N339802N356550N502462M988134M325569
1766.3F86038256M234314M291117M305363L766894K947092K692878K825916K874732
1782.6G13976562K625704K189338J944184K087474K362609K145410J712620J527488
$$ y = [326793939, 334375173, 342272520, 350985497, 359311998, 367375910, 376519114, 388037115, 399091423, 409083366, 420145124, 431884050, 445984751, 462402165, 478818864, 496219337, 510604262, 522515953, 534319401, 544656754, 553550601, 561476529, 568855762, 576290607, 582890749, 587932944, 592125773, 595918238, 599384189, 602747202, 605893731, 608925641, 611809552, 614678025, 618255258, 622509897, 627025723, 631884873, 637286842, 643374443, 649666488, 655268073, 660525739, 665865541, 671222091, 676724553, 681712687, 686038256, 690272570, 694563687, 698869050, 702635944, 705583036, 708275914, 711101830, 713976562, 716602266, 718791604, 720735788, 722823262, 725185871, 727331281, 729043901, 730571389]
1798.9G30571389J661837J832009J733184J485824J318157J388907J543343J558602
1815.2G43093252J337648J083552J068235J314461J493096J297653R62258Q63254J066029
1833.6G53579438J190543J020610P44164O81222Q80122J059353R01699N87523M56572
1851.9G61101246O42836R16839Q83519N62787L46423N03659P88569Q13186N16475L04341
1872.3G67379880M58002P25806P82370N63980L46183M12643O86050Q14378O21498L45826
1892.7G73136616L23772N51522O88553N43296K60890J75059L81052N81145M96805K48075
1913.1G77386785J59323L22759N41031M90010K16067O7174K04742M10140M09603K12073
1933.5G80419707O0678J47521L65019M29690K04861j9133M7624L08454M52042L06070
$$ y = [730571389, 732233226, 734065235, 735798419, 737284243, 738602400, 739991307, 741534650, 743093252, 744430900, 745514452, 746582687, 747897148, 749390244, 750687897, 751650155, 752513409, 753579438, 754769981, 755790591, 756534755, 757215977, 758096099, 759155452, 760057151, 760644674, 761101246, 761744082, 762660921, 763544440, 764107227, 764453650, 764957309, 765745878, 766559064, 767075539, 767379880, 767837882, 768563688, 769346058, 769910038, 770256221, 770668864, 771354914, 772169292, 772790790, 773136616, 773460388, 774011910, 774700463, 775243759, 775504649, 775679708, 776060760, 776641905, 777138710, 777386785, 777546108, 777868867, 778409898, 778899908, 779115975, 779183149, 779387891, 779798031, 780207634, 780419707, 780480385, 780627906, 780992925, 781422615, 781627476, 781608343, 781655967, 781964421, 782416463, 782722533]
1953.9G82722533J10328J38402L40402M43101L19302J02341M0233J87993L43085L09348
1974.3G85057068J14262L8922J74582L15189K53499O4432k5272P9334K51949K67207
1994.7G86591172R4533m7982J1683J33872J22190n2095k10583j75655j2636L5584j27197
2017.1G86362886l14414l36528j94907p5221j30356k78711l14772k31385j35899j34825
2037.5G84215868k56777k94745j44363O259j9431j34051j48058j0252J07169Q5652
2057.9G83407271M470j7225O6459J78516K36213J60813p033n4419Q3148J87814J39773
2080.3G84385800L9101J8954J04547J76549J58429P3373M1902J17481K05576J83046
2100.7G85504758R9898R7632J64032K08438J74760R9004N0306M8995P9989J20998J05321
$$ y = [782722533, 782832861, 782971263, 783311665, 783754766, 784074068, 784176409, 784216642, 784404635, 784747720, 785057068, 785171330, 785210252, 785384834, 785700023, 785953522, 786017954, 785992682, 786072016, 786323965, 786591172, 786685705, 786637723, 786649406, 786783278, 786905468, 786853373, 786642790, 786467135, 786454499, 786490083, 786362886, 786048472, 785711944, 785517037, 785441816, 785311460, 785032749, 784717977, 784486592, 784350693, 784215868, 783959091, 783664346, 783519983, 783526242, 783506811, 783372760, 783224702, 783214450, 783321619, 783407271, 783411741, 783394516, 783460975, 783639491, 783875704, 784036517, 784029484, 783975065, 784058213, 784246027, 784385800, 784424901, 784443855, 784548402, 784724951, 784883380, 784956753, 784998655, 785116136, 785321712, 785504758, 785604656, 785702288, 785866320, 786074758, 786249518, 786348522, 786398828, 786447823, 786527812, 786648810, 786754131]
2123.2G86754131N3048O7056J24693J39713R6023N4598M3630R0957J52707J22726N4836
2145.6G87754118M6075R2149J53839J72079J27315J11521J85787K72215K92659K86579
2166G89494336L02374L45588L87847M13716M11332L43680L03626L66092M22895L91662
2186.4G93183148L23236K97725L30925L71277L70443L44932L30031L17633K94388K79605
2206.8G96443343K84672L01957L20017L38257L47912L17752K48731J91867K06411K50518
2227.2G99251437K24590J64152J39951J60337J94728J70172R4652O7234J07705J44601
2247.6H00719559J31667J03950Q5891Q0645J22010J53542J07229L2961J9074R1374
2268H01647902J50859R7096K3961J9252K8014L9339L7313r54j0967L6478M2737j5378
$$ y = [786754131, 786807179, 786874235, 786998928, 787138641, 787234664, 787289262, 787332892, 787423849, 787576556, 787699282, 787754118, 787800193, 787892342, 788046181, 788218260, 788345575, 788457096, 788642883, 788915098, 789207757, 789494336, 789796710, 790142298, 790530145, 790943861, 791355193, 791698873, 792002499, 792368591, 792791486, 793183148, 793506384, 793804109, 794135034, 794506311, 794876754, 795221686, 795551717, 795869350, 796163738, 796443343, 796728015, 797029972, 797349989, 797688246, 798036158, 798353910, 798602641, 798794508, 799000919, 799251437, 799476027, 799640179, 799780130, 799940467, 800135195, 800305367, 800400019, 800467253, 800574958, 800719559, 800851226, 800955176, 801041067, 801121712, 801243722, 801397264, 801504493, 801537454, 801556528, 801647902, 801798761, 801895857, 801919818, 801939070, 801967084, 802006423, 802043736, 802042782, 802031815, 802068293, 802111030, 802095652]
2292.5H02095652m8459k7835O556O616J848M77J3828M6492N1260K3305r358j0907l517
2319H02145958K3723K7418l4333p5101p2480j03593k05576k46167j73748p3552n2988
2341.4H01159561k35081o30081p30514l52025R8645L26157K59519Q8751l3021j73867
2361.8G99778044m28796o71506p84039p91669p53641o59585n67138n51343n52833m91917
2382.2G93525577l96550l55363l72469m06266m13477l77119l49641l66568m14193m52280
2402.6G89621651m61101m79102n11110n42105n54025n20587n31852o05345o27339o13927
2423G84175158o15240o03735o14882o91533p28964o81758o61731o96540o94692o49452
2443.4G77536631o23048o42180o98686p41422p41780p01189o67035o86467o98984o74367
$$ y = [802095652, 802047193, 802019358, 802025914, 802032530, 802034378, 802034855, 802048683, 802095175, 802146435, 802169740, 802160382, 802149475, 802145958, 802169681, 802197099, 802162766, 802087665, 802015185, 801911592, 801706016, 801459849, 801286101, 801212549, 801159561, 800924480, 800294399, 799563885, 799211860, 799310505, 799636662, 799896181, 799984932, 799951911, 799778044, 799349248, 798677742, 797893703, 797102034, 796348393, 795688808, 795121670, 794570327, 794017494, 793525577, 793129027, 792773664, 792401195, 791994929, 791581452, 791204333, 790854692, 790488124, 790073931, 789621651, 789160550, 788681448, 788170338, 787628233, 787074208, 786553621, 786021769, 785416424, 784789085, 784175158, 783559918, 782956183, 782341301, 781649768, 780920804, 780239046, 779577315, 778880775, 778186083, 777536631, 776913583, 776271403, 775572717, 774831295, 774089515, 773388326, 772721291, 772034824, 771335840, 770661473]
2463.8G70661473o34551o03020o11663o61492p10070p00057o64651o76394p02798o87361
2484.2G64009416o37054n77510n61952o22511o73712o38544n74529n58436n85139o05702
2504.6G57974327n88537n43177n19931n50747o15954o60897o47485o25133o46949o67215
2525G51908302o52015o32584o57380p16090p46369p54297p38263p03991p26282p67112
2545.4G44813919p24316o38008o17742o76036p60913p93695p28190o63162o89387p32183
2565.8G37790287p10428o48320o11126o61552p54118p73788p10666o55353o90222p50065
2586.2G30824649p40528o93738o58155o54220o81401p09176p30812p62463p74741p76827
2606.6G23642588q16048q55326q58188q97348r77635j016498j041949j075148j095951
$$ y = [770661473, 770026922, 769423902, 768812239, 768150747, 767440677, 766740620, 766075969, 765399575, 764696777, 764009416, 763372362, 762794852, 762232900, 761610389, 760936677, 760298133, 759723604, 759165168, 758580029, 757974327, 757385790, 756842613, 756322682, 755771935, 755155981, 754495084, 753847599, 753222466, 752575517, 751908302, 751256287, 750623703, 749966323, 749250233, 748503864, 747749567, 747011304, 746307313, 745581031, 744813919, 744089603, 743451595, 742833853, 742157817, 741396904, 740603209, 739875019, 739211857, 738522470, 737790287, 737079859, 736431539, 735820413, 735158861, 734404743, 733630955, 732920289, 732264936, 731574714, 730824649, 730084121, 729390383, 728732228, 728078008, 727396607, 726687431, 725956619, 725194156, 724419415, 723642588, 722826540, 721971214, 721113026, 720215678, 719238043, 718221545, 717179596, 716104448, 715008497]
2624.9G15008497j133084j182735j202464j187205j169444j186311j232624j248240
2641.2G05466390j220525j204133j225888j245201j250148j241207j191854j171709
2657.5F95715725j231312j259625j204372j166045j155138j125813j109302j092792
2673.9F86371326j028835r85504j038551j097679j071870r97365r46641r79185j051962
2692.2F77173734j051188j003265j005471j079142j199961j282215j262545j219392
2708.5F68070555j255691j345814j381099j307487j235843j243293j255751j227081
2724.8F57818496j163959j075149j007497j009286j037955j010358r30429r07063r68993
2743.2F48707807j025915j007915r41634r18507r52661j000226j004934r53555r17018
$$ y = [715008497, 713875413, 712692678, 711490214, 710303009, 709133565, 707947254, 706714630, 705466390, 704245865, 703041732, 701815844, 700570643, 699320495, 698079288, 696887434, 695715725, 694484413, 693224788, 692020416, 690854371, 689699233, 688573420, 687464118, 686371326, 685342491, 684356987, 683318436, 682220757, 681148887, 680151522, 679204881, 678225696, 677173734, 676122546, 675119281, 674113810, 673034668, 671834707, 670552492, 669289947, 668070555, 666814864, 665469050, 664087951, 662780464, 661544621, 660301328, 659045577, 657818496, 656654537, 655579388, 654571891, 653562605, 652524650, 651514292, 650583863, 649676800, 648707807, 647681892, 646673977, 645732343, 644813836, 643861175, 642860949, 641856015, 640902460, 639985442]
2761.6F39985442r67204j059950j079917j046538j055658j136124j244605j303196
2777.9F31092250j297533j304031j373648j498759j611650j621425j594067j658678
2794.2F19132459j778245j838684j839518j840234j919270k106130k269268k326488
2810.5F03214622k359152k426982k520085k647221k810061k998471l265560l646612
2826.8E80540478m129410m751086n548358o551742p878304r457767j1009395j2552023
2843.1E18662393j4279961j5831441j6033590j3530642q128583j614899L407866N524010
2859.5D58175153N008876K894461K61217j913756k867341k342224r28700K85983O20574
2877.8D59194243Q0228r43870k010703k928942l711909m327923m708111m891098n024791
$$ y = [639985442, 639018238, 637958288, 636878371, 635831833, 634776175, 633640051, 632395446, 631092250, 629794717, 628490686, 627117038, 625618279, 624006629, 622385204, 620791137, 619132459, 617354214, 615515530, 613676012, 611835778, 609916508, 607810378, 605541110, 603214622, 600855470, 598428488, 595908403, 593261182, 590451121, 587452650, 584187090, 580540478, 576411068, 571659982, 566111624, 559559882, 551681578, 542223811, 531214416, 518662393, 504382432, 488550991, 472517401, 458986759, 450858176, 449243277, 452651143, 458175153, 463184029, 466078490, 466339707, 464425951, 461558610, 459216386, 458287686, 458573669, 459194243, 459274471, 458330601, 456319898, 453390956, 449679047, 445351124, 440643013, 435751915, 430727124]
2896.2D30727124n253792n605876o042749o604254p375836q431793r825676j1429727
2912.5C70157421j2768031j3139396j2118370r773582o366611k273529J893639N422265
2928.8C21033806P956951R672493J0809064J1337102J1079639R975940Q141875N819708
2945.1C95826578L390163J317323P3492l2991R20951K590716M559785O452561Q141607
2963.5D23240185R579718J0559112J0930449J0752767J0171771R345442Q482933P689953
2979.8E00752330O884992O029844N207956M493475L845930L189266K525329J844585
2996.1E34773707J136303N49794J14679l15428o89328q81135r06944q81315q71777
3014.5E32028556r22382j097023j328946j567363j835585k044141k086521k020597
$$ y = [430727124, 425473332, 419867456, 413824707, 407220453, 399844617, 391412824, 381587148, 370157421, 357389390, 344249994, 332131624, 322358042, 315991431, 313717902, 315611541, 321033806, 328990757, 338663250, 349472314, 360809416, 371889055, 381864995, 390006870, 395826578, 399216741, 400534064, 400607556, 400574565, 401495516, 404086232, 408646017, 415098578, 423240185, 432819903, 443379015, 454309464, 465062231, 475234002, 484579444, 493062377, 500752330, 507637322, 513667166, 518875122, 523368597, 527214527, 530403793, 532929122, 534773707, 535910010, 536459804, 536574483, 536259055, 535569727, 534688592, 533781648, 532900333, 532028556, 531106174, 530009151, 528680205, 527112842, 525277257, 523233116, 521146595, 519125998]
3030.8E19125998j988173k054333k173305k268016k293170k303123k389669k498746
3047.1E01157463k524048k483070k473593k491325k480179k452225k371162k246141
3063.4D81635720k139092k022803j926988j869917j769662j628339j542211j565903
3079.7D67170805j598865j522839j391202j306564j290619j298309j279771j228035
3096D56254601j197487j245647j324237j371294j398236j407295j446158j522630j558125
3114.4D43783492j574904j612812j680195j790673j857787j837671j839549j916497
3130.7D29673404j997173k018929j988053j949400k002329k109169k125294k082943
3147D13400114k059520k088159k156407k208620k214581k163529k110750k132535k182990
$$ y = [519125998, 517137825, 515083492, 512910187, 510642171, 508349001, 506045878, 503656209, 501157463, 498633415, 496150345, 493676752, 491185427, 488705248, 486253023, 483881861, 481635720, 479496628, 477473825, 475546837, 473676920, 471907258, 470278919, 468736708, 467170805, 465571940, 464049101, 462657899, 461351335, 460060716, 458762407, 457482636, 456254601, 455057114, 453811467, 452487230, 451115936, 449717700, 448310405, 446864247, 445341617, 443783492, 442208588, 440595776, 438915581, 437124908, 435267121, 433429450, 431589901, 429673404, 427676231, 425657302, 423669249, 421719849, 419717520, 417608351, 415483057, 413400114, 411340594, 409252435, 407096028, 404887408, 402672827, 400509298, 398398548, 396266013, 394083023]
3165.4C94083023k186418k165704k150029k157450k180040k175361k149552k130657
3181.7C76787812k115131k104193k087265k050161k017409k020419k045482k023071
3198C60324681j928717j844734j833975j825273j785130j739502j698851j709789j748056
3216.4C44210654j745849j711190j685858j699746j740753j742125j715094j745253
3232.7C30424786j837254j903355j941860k002805k016396k000242k046913k129734
3249C14546227k168774k170861k199709k229005k225191k207905k165645k083928j991838
3267.4B95103371j892000j796276j728713j629651j483232j359909j255870j118809
3283.7B82838911r48698q11487p56681p18117o22987m85599l74765l55184l63141k91199
$$ y = [394083023, 391896605, 389730901, 387580872, 385423422, 383243382, 381068021, 378918469, 376787812, 374672681, 372568488, 370481223, 368431062, 366413653, 364393234, 362347752, 360324681, 358395964, 356551230, 354717255, 352891982, 351106852, 349367350, 347668499, 345958710, 344210654, 342464805, 340753615, 339067757, 337368011, 335627258, 333885133, 332170039, 330424786, 328587532, 326684177, 324742317, 322739512, 320723116, 318722874, 316675961, 314546227, 312377453, 310206592, 308006883, 305777878, 303552687, 301344782, 299179137, 297095209, 295103371, 293211371, 291415095, 289686382, 288056731, 286573499, 285213590, 283957720, 282838911, 281890213, 281078726, 280322045, 279603928, 278980941, 278495342, 278120577, 277765393, 277402252, 277111053]
3304.1B77111053k15351k14964k18183k24322k20508j37954o9172r6678j36197j25945
3324.5B75451779j26212j53065j56135j85966k22564j83523j78575k80410l62039l82781
3344.9B73220509l80605l71844m16130m73976m96626m96506m73023m74959m94182m67480
3365.3B68675178m45932m75317n42462n84632n41330m59283l68983l27944l46393l42667
3385.7B64240235k68489j51008j48178k83300k92689q6099M2170q0734k17080j27733
3406.1B62627095J3679N2750Q5086J17481J47730K13832K72005L30329M47452N76318
3426.5B64883757O47634O58065P42525Q55833P84546O37621O57618Q44955J035899
3444.8B71748453J093388J039207J055062J132369J224011J341432J397640J358420
$$ y = [277111053, 276895702, 276680738, 276462555, 276238233, 276017725, 275879771, 275810599, 275713921, 275577724, 275451779, 275325567, 275172502, 275016367, 274830401, 274607837, 274424314, 274245739, 273965329, 273603290, 273220509, 272839904, 272468060, 272051930, 271577954, 271081328, 270584822, 270111799, 269636840, 269142658, 268675178, 268229246, 267753929, 267211467, 266626835, 266085505, 265626222, 265257239, 264929295, 264582902, 264240235, 263971746, 263820738, 263672560, 263389260, 263096571, 263010472, 263052642, 262971908, 262754828, 262627095, 262640774, 262693524, 262778610, 262896091, 263043821, 263257653, 263529658, 263859987, 264307439, 264883757, 265531391, 266189456, 266931981, 267787814, 268572360, 269209981, 269867599, 270712554, 271748453, 272841841, 273881048, 274936110, 276068479, 277292490, 278633922, 280031562, 281389982]
3461.1B81389982J368254J539320J665920J523941J276166J258075J456737J730204
3477.4B93208599J885563J780004J708686J824289J855493J782954J801133J883000
3493.8C07729721J951993J964747J986772K009720J910001J863688K015531K142012
3510.1C23574185K196402K191275K086699K107233K281397K440483K422124K273023
3526.4C41572821K236724K343327K463579K576262K590775K503544K609343K825707
3542.7C61722082K871632K728999K636194K722919K854348K903491K916515L008544
3559C84364724L131807L176183L213167L447979L597528L466636L423065L566265L693879
3577.4D15081233L813952L998280M098296M054248M043102M135222M125177M152924
$$ y = [281389982, 282758236, 284297556, 285963476, 287487417, 288763583, 290021658, 291478395, 293208599, 295094162, 296874166, 298582852, 300407141, 302262634, 304045588, 305846721, 307729721, 309681714, 311646461, 313633233, 315642953, 317552954, 319416642, 321432173, 323574185, 325770587, 327961862, 330048561, 332155794, 334437191, 336877674, 339299798, 341572821, 343809545, 346152872, 348616451, 351192713, 353783488, 356287032, 358896375, 361722082, 364593714, 367322713, 369958907, 372681826, 375536174, 378439665, 381356180, 384364724, 387496531, 390672714, 393885881, 397333860, 400931388, 404398024, 407821089, 411387354, 415081233, 418895185, 422893465, 426991761, 431046009, 435089111, 439224333, 443349510, 447502434]
3593.7D47502434M280687M365533M376620M352361M326225M302471M407466M525393
3610D82439190M547388M554808M473835M506200M647136M473210M275381M259527M540026
3628.4E22716701M780650M391015M165947M166305M096568M071593M057110L976821
3644.7E56422710L952027M138827M142106L697455L422379L617346L688634L401875
3661E86483359L217876L251911L233194L205299L296912L082812K806663K777398K653480
3679.4F14008904K554655K602219K648473K629340K384305K075076K013504K016187
3695.7F32932663J924694J764774J654684J698316J744508J646102J438856J304269
3712F46108866J427412J484811J383782J305341J265884J130759J005233J166224J315594
$$ y = [447502434, 451783121, 456148654, 460525274, 464877635, 469203860, 473506331, 477913797, 482439190, 486986578, 491541386, 496015221, 500521421, 505168557, 509641767, 513917148, 518176675, 522716701, 527497351, 531888366, 536054313, 540220618, 544317186, 548388779, 552445889, 556422710, 560374737, 564513564, 568655670, 572353125, 575775504, 579392850, 583081484, 586483359, 589701235, 592953146, 596186340, 599391639, 602688551, 605771363, 608578026, 611355424, 614008904, 616563559, 619165778, 621814251, 624443591, 626827896, 628902972, 630916476, 632932663, 634857357, 636622131, 638276815, 639975131, 641719639, 643365741, 644804597, 646108866, 647536278, 649021089, 650404871, 651710212, 652976096, 654106855, 655112088, 656278312, 657593906]
3730.3F57593906J287758J128316R10640R76860J101316Q40902O48260J024485J045942
3748.7F66558385O87480P06136R74298J001834Q26121Q12113R21488Q68082P17103
3767.1F74073040O13809O73354P75873Q07941Q37505P82550O92010O36398O08802O40750
3787.5F81142032O81758O93917O61075O40393O93500N90443M68553O19769N27441L59893
3807.8F87078774N41508P37488O62208M89056N43773M59135L70264N39124N31137M48227
3828.2F92400694M25160M97162O54698N37335L07620L57926L88324L75331M69207N68569
3848.6F96982026M61221L6239J2458M83453N80490N04136M05550L31282K98739J62542
3869G00258136J77979L29137M13895M67241L35037K61724L50476L08036K61307J97768
$$ y = [657593906, 658881664, 660009980, 660920620, 661897480, 662998796, 663839698, 664487958, 665512443, 666558385, 667245865, 667952001, 668926299, 669928133, 670754254, 671566367, 672487855, 673355937, 674073040, 674686849, 675360203, 676136076, 676944017, 677781522, 678564072, 679256082, 679892480, 680501282, 681142032, 681823790, 682517707, 683178782, 683819175, 684512675, 685103118, 685571671, 686191440, 686718881, 687078774, 687620282, 688357770, 689019978, 689509034, 690052807, 690511942, 690882206, 691421330, 691952467, 692400694, 692825854, 693323016, 693977714, 694515049, 694822669, 695180595, 695568919, 695944250, 696413457, 696982026, 697443247, 697479486, 697491944, 697975397, 698555887, 699060023, 699465573, 699796855, 700095594, 700258136, 700436115, 700765252, 701179147, 701646388, 701981425, 702243149, 702593625, 702901661, 703162968, 703360736]
3889.4G03360736Q2553J78158L60131L59297K26796J04606N8532J54316K58863K16723
3909.8G05360711J85310K28465J78218Q7440J38640J91033J54138J22309J15752J69456
3930.2G06931472K52008K58982J96755R9361M9889J34230K34902K05576J24455R7275
3950.6G08584905J12593J08898R3758J34408J89126J47938Q1420J26183J72913J33455
3971G09885597J15693J31488J28507Q5295K0027K7895J17898J55568J27375J16587
3991.4G10911930J48236J79947J22964
3997.5G11363077
$$ y = [703360736, 703443289, 703621447, 703981578, 704340875, 704567671, 704672277, 704730809, 704885125, 705143988, 705360711, 705546021, 705774486, 705952704, 706040144, 706178784, 706369817, 706523955, 706646264, 706762016, 706931472, 707183480, 707442462, 707639217, 707738578, 707788467, 707922697, 708157599, 708363175, 708487630, 708584905, 708697498, 708806396, 708900154, 709034562, 709223688, 709371626, 709453046, 709579229, 709752142, 709885597, 710001290, 710132778, 710261285, 710346580, 710366607, 710394502, 710512400, 710667968, 710795343, 710911930, 711060166, 711240113, 711363077]
##END=$$ End of the data block
