##TITLE=G23-51-CE $$ Begin of the data block
##JCAMP-DX=5.00 $$ ACD/SpecManager v 10.08
##SPECTROMETER/DATA SYSTEM=Alpha
##DATE=23 Oct 2013 10:11:40
##DATA TYPE=INFRARED SPECTRUM
##DATA CLASS=XYDATA
##ORIGIN=
##OWNER=
##NPOINTS=1765
##FIRSTX=399.75695801
##LASTX=3997.56933594
##MAXX=3997.56933594
##MINX=399.75695801
##MAXY=0.81589842
##MINY=0.24606401
##XFACTOR=1.0000000000
##YFACTOR=1.000000000000000e-9
##FIRSTY=0.52739859
##DELTAX=2.03957629
##XUNITS=1/CM
##YUNITS=ARBITRARY UNITS
##XYDATA=(X++(Y..Y))
399.8E27398586k494633k589881j771093m20213J62662L4272m5955n01513j263261
$$ 527398586 524903953 522314072 520542979 520122766 520285428 520319700 520273745 519772232 518508971
418.1E18508971r80974o08742j232087j536429j158476j267553j842737j915395j340449
$$ 518508971 517527997 516919255 515687168 514150739 512992263 511724710 509881973 507966578 506626129
436.5E06626129k48074Q72016J373410J146018Q81732Q09908L50773n10633j298487
$$ 506626129 506378055 507250071 508623481 509769499 510651231 511461139 511811912 511301279 510002792
454.8E10002792j810670j914084j733601j959384k388894k446652k375334k384216
$$ 510002792 508192122 506278038 504544437 502585053 500196159 497749507 495374173 492989957
471.1D92989957k068549j597941j424640j195729q94189q32617q85338r46492j120955
$$ 492989957 490921408 489323467 487898827 486703098 485808909 484976292 484090954 483144462 482023507
489.5D82023507j355856j676679k128482k365529k301425k364427k615154k814680
$$ 482023507 480667651 478990972 476862490 474496961 472195536 469831109 467215955 464401275
505.8D64401275k888113k807886k812117k932161k831429k485365k140164j799673
$$ 464401275 461513162 458705276 455893159 452960998 450129569 447644204 445504040 443704367
522.1D43704367j306087o89417k39700P8410O70552J351595J993745K544463K480149
$$ 443704367 442398280 441708863 441469163 441547573 442218125 443569720 445563465 448107928 450588077
540.5D50588077J885802J150608L38077l50892o99967q67367j114100j476288j819611
$$ 450588077 452473879 453624487 453962564 453611672 452911705 452044338 450930238 449453950 447634339
558.8D47634339j957744j989037k279639k731294k612948j810431q79020L4750R96023
$$ 447634339 445676595 443687558 441407919 438676625 436063677 434253246 433374226 433408976 434404999
577.2D34404999J876563K582371L068119L101856K615571J858562J240313Q64357M99636
$$ 434404999 436281562 438863933 441932052 445033908 447649479 449508041 450748354 451612711 452112347
595.6D52112347J52022K9265Q3775J42187J68025J43975J85907K65092L27259N58615
$$ 452112347 452264369 452293634 452377409 452519596 452687621 452831596 453017503 453282595 453609854 454168469
616D54168469J038134J557588K028644K500982K827018K883554K623826K367496K272487
$$ 454168469 455206603 456764191 458792835 461293817 464120835 467004389 469628215 471995711 474268198
634.3D74268198K073079J846165J744151J582444J316577J126498J005947P37280M24743
$$ 474268198 476341277 478187442 479931593 481514037 482830614 483957112 484963059 485700339 486125082
652.7D86125082L50415M11094M64886M24415L01719L30716P50095J424491J282185
$$ 486125082 486475497 486886591 487351477 487775892 488077611 488408327 489158422 490582913 491865098
671D91865098J132280J388341J651794J771063J691103J327574R07540P66039P17998
$$ 491865098 492997378 494385719 496037513 497808576 499499679 500827253 501734793 502500832 503218830
689.4E03218830L51786l23415q78095r96471n55336K51293Q94308J195014J588821
$$ 503218830 503570616 503247201 502369106 501372635 500817299 501068592 501962900 503157914 504746735
707.7E04746735K259195K877116L224790L370643L598571M129827M706919M876494
$$ 504746735 507005930 509883046 513107836 516478479 520077050 524206877 528913796 533790290
724E33790290M565001M030287L735185L586352L049969K192974J518488J230061J042605
$$ 533790290 538355291 542385578 546120763 549707115 552757084 554950058 556468546 557698607 558741212
742.4E58741212O90937J11997l84629m82738l61979n28633j079560j445114j238585
$$ 558741212 559432149 559544146 559159517 558676779 558314800 557786167 556706607 555261493 554022908
760.8E54022908n71191L21507J368106K430141L422022M431605N247712N457044N085170
$$ 554022908 553451717 553773224 555141330 557571471 560993493 565425098 570672810 576129854 581215024
779.1E81215024M529536L992736L476679K929807K389014K034485K017737K298474
$$ 581215024 585744560 589737296 593213975 596143782 598532796 600567281 602585018 604883492
795.4F04883492K741218L111660L271222L264249L160953K948999K477944J796246
$$ 604883492 607624710 610736370 614007592 617271841 620432794 623381793 625859737 627655983
811.7F27655983J134098P36653M78089K3902n95033j267911j938462k379656k489268
$$ 627655983 628790081 629526734 630004823 630028725 629433692 628165781 626227319 623847663 621358395
830.1F21358395k496899k616882k822399k806664k501666k260566k170384j965046
$$ 621358395 618861496 616244614 613422215 610615551 608113885 605853319 603682935 601717889
846.4F01717889j502752r38356o32226o86169p54476l07202J087368L107786M812419
$$ 601717889 600215137 599276781 598644555 597958386 597203910 596896708 597984076 601091862 605904281
864.8F05904281N744875O171584O209731N513131L982187K036750J55270j442671k792179
$$ 605904281 611649156 617820740 624030471 629543602 633525789 635562539 635717809 634275138 631482959
883.1F31482959l999472m923940n241692m991769m646600m520416m597068m765689
$$ 631482959 627483487 622559547 617317855 612326086 607679486 603159070 598562002 593796313
899.4E93796313n012334n435824o058454o750823p238090p363259p205904o796181
$$ 593796313 588783979 583348155 577289701 570538878 563300788 555937529 548731625 541935444
915.8E41935444o023407m822612l365099k046764j204133q08597n62250k56420j6451
$$ 541935444 535912037 531089425 527724326 525677562 524473429 523664832 523102582 522846162 522829711
934.1E22829711n066o8068j09196m77791j738310l940582o417930q414030r642661
$$ 522829711 522824645 522756577 522647381 522169590 520431280 516490698 510072768 501658738 492016077
952.5D92016077j0309249j0682047j0901838j1062414j1224359j1343449j1287302
$$ 492016077 481706828 471024781 460122943 449060529 437836170 426492721 415205419
966.8D15205419j0983139j0441005r654940q620470p388086o036490m660010l423750
$$ 415205419 404222280 393781275 384126335 375505865 368117779 362081289 357421279 353997529
983.1C53997529k498687j855761j415699j140654r68695q21233n54770j31816K81334
$$ 353997529 351498842 349643081 348227382 347086728 346118033 345296800 344742030 344610214 344891548
1001.4C44891548M46081K08557l60370r91463j477600j774638j895816j884698j823187
$$ 344891548 345337629 345546186 345185816 344194353 342716753 340942115 339046299 337161601 335338414
1019.8C35338414j823455j953096k136588k244264k255261k225577k245933k366662
$$ 335338414 333514959 331561863 329425275 327181011 324925750 322700173 320454240 318087578
1036.1C18087578k479762k446085k312720k151549j939386j592726j003146k71469
$$ 318087578 315607816 313161731 310849011 308697462 306758076 305165350 304162204 303890735
1052.4C03890735M24117J037359J562655K035975K503843K799302K556652J465171
$$ 303890735 304314852 305352211 306914866 308950841 311454684 314253986 316810638 318275809
1068.7C18275809j91778j402050j437068m31329J074106K553165L709167M524082M965931
$$ 318275809 318084031 316681981 315244913 314813584 315887690 318440855 322150022 326674104 331640035
1087.1C31640035N034000M862427M507661L986985L338992K622962J919121J425654
$$ 331640035 336674035 341536462 346044123 350031108 353370100 355993062 357912183 359337837
1103.4C59337837J375377J716256K185106K578616K822191K903819K799749K519548
$$ 359337837 360713214 362429470 364614576 367193192 370015383 372919202 375718951 378238499
1119.7C78238499K149284J835674J750827K000630K528757K969414K895385K290576
$$ 378238499 380387783 382223457 383974284 385974914 388503671 391473085 394368470 396659046
1136C96659046J470000O54012p9542o15240q72373q62688o54161l25024J09523P24584
$$ 396659046 398129046 398783058 398703516 398088276 397215903 396353215 395699054 395374030 395483553 396208137
1156.4C96208137J542747K469153L381341M108250M611552N091012N690574O377042
$$ 396208137 397750884 400220037 403601378 407709628 412321180 417412192 423102766 429479808
1172.7D29479808P004886P390917P542461P590830P497460P111937O413936N504102
$$ 429479808 436484694 443875611 451418072 459008902 466506362 473618299 480032235 485536337
1189.1D85536337M449874L238261J952290P88808j12265o37353q25137q14557o42597
$$ 485536337 489986211 493224472 495176762 495965570 495853305 495215952 494390815 493576258 492933661
1207.4D92933661l31164m053J80423J63287j7494k94059o35654j038253j455248j792281
$$ 492933661 492602497 492598444 492778867 492942154 492924660 492630601 491994947 490956694 489501446 487709165
1227.8D87709165j971305j961350j812518j558155j185476o87093o8307N76139J136213
$$ 487709165 485737860 483776510 481963992 480405837 479220361 478533268 478464961 479041100 480177313
1246.2D80177313J611471K024442K316296K445042K424419K351642K296805K236039
$$ 480177313 481788784 483813226 486129522 488574564 490998983 493350625 495647430 497883469
1262.5D97883469K206951K229035K237320K190888K056897J733362J288355R68039
$$ 497883469 500090420 502319455 504556775 506747663 508804560 510537922 511826277 512794316
1278.8E12794316R21488J077771J211285J183570J015127P57396L73661j69337q08298
$$ 512794316 513715804 514793575 516004860 517188430 518203557 518960953 519334614 519165277 518356979
1297.2E18356979j374304j717270j851976j918375j967311j915455j686335j246214
$$ 518356979 516982675 515265405 513413429 511495054 509527743 507612288 505925953 504679739
1313.5E04679739o92844k04801J19984K47419N0365n23805j305401k037585k519816
$$ 504679739 503986895 503782094 503902078 504149497 504199862 503676057 502370656 500333071 497813255
1331.8D97813255k642870k414853j967668j370997q44001o03885n77360p10487j016766
$$ 497813255 495170385 492755532 490787864 489416867 488572866 487968981 487391621 486681134 485664368
1350.2D85664368j371920j666099j883149k097190k530068l118217l502160l721476
$$ 485664368 484292448 482626349 480743200 478646010 476115942 472997725 469495565 465774089
1366.5D65774089l766328l340065l058732l214896l356755l607392l998965m111349
$$ 465774089 462007761 458667696 455608964 452394068 449037313 445429921 441430956 437319607
1382.8D37319607l665030k686322j364470n08964m48018n11021k58117R9033N32150
$$ 437319607 433654577 430968255 429603785 429094821 428646803 428135782 427877665 427976698 428508848
1401.2D28508848R44018J381487J724899J774609J758605J758397J735151J892715
$$ 428508848 429452866 430834353 432559252 434333861 436092466 437850863 439586014 441478729
1417.5D41478729K574682K932579K801031K699852K269536J599163R68069K81542k92629
$$ 441478729 444053411 446985990 449787021 452486873 454756409 456355572 457323641 457605183 457312554
1435.9D57312554l9667N64546O71386N75811N42969O19918N77896J97709J19Q88616
$$ 457312554 457272887 457837433 458508819 459084630 459627599 460247517 460825413 461023122 461023241 461911857
1456.2D61911857L053367L847093L298789L294289M063398M864126O094754Q425623
$$ 461911857 464965224 468812317 472111106 475405395 479468793 484332919 490427673 498853296
1472.6D98853296R421140Q163750O537795M866243L178835J266002p47144k494693
$$ 498853296 508274436 516438186 522975981 527842224 531021059 532287061 531539917 529045224
1488.9E29045224l497064l916204n164742o764591o619036n816520o027132q442223
$$ 529045224 525548160 521631956 516467214 509702623 503083587 497267067 491239935 482797712
1505.2D82797712j1671364r766609p934868q120894p572175n860030l888905l200054
$$ 482797712 471126348 461359739 453424871 445303977 437731802 431871772 427982867 424782813
1521.5D24782813l012866k974123l242612l066599l092915l141344k344548k048016
$$ 424782813 421769947 418795824 415553212 412486613 409393698 406252354 403907806 401859790
1537.8D01859790k425641j261443M44085J324385J903713K525151L164321L569811
$$ 401859790 399434149 398172706 398616791 399941176 401844889 404370040 407534361 411104172
1554.1D11104172L524125M246354N924761M907042L703594L275961K927125K901911
$$ 411104172 414628297 418874651 424799412 429706454 433410048 436686009 439613134 442515045
1570.5D42515045K407015J602947J456559J530856J052022M19259M1515k51025o07103
$$ 442515045 444922060 446525007 447981566 449512422 450564444 450983703 451025218 450774193 450167090
1588.8D50167090j146466j779318k462238l094256l809988m722536n587309o336570
$$ 450167090 449020624 447241306 444779068 441684812 437874824 433152288 427564979 421228409
1605.1D21228409p153124q090228q615553q805007j0023683j1683971j0420978j0055899
$$ 421228409 414075285 405985057 397369504 388564497 378540814 366856843 356435865 346379966
1621.4C46379966j1843354j1797905j0954112j0500937r295047q778810r040535o312817
$$ 346379966 334536612 322738707 311784595 301283658 291988611 283209801 274169266 267856449
1637.8B67856449k995312j414299n05686L37362J425952J753211K052575L697813M331022
$$ 267856449 264861137 263446838 262941152 263278514 264704466 266457677 268510252 272208065 276539087
1656.1B76539087M195988M864097O159872P251978P118374P678330R002179Q705675
$$ 276539087 280735075 285599172 291759044 299011022 306129396 313807726 322809905 331515580
1672.4C31515580Q946479R951323R530693Q895994R833127J2974948J3110935J1829496
$$ 331515580 340462059 350413382 359944075 368840069 378673196 391648144 404759079 416588575
1688.8D16588575J2906372J3431460J5610963J7910212J7842889J9438624J6441882
$$ 416588575 429494947 442926407 458537370 476447582 494290471 513729095 530170977
1703E30170977J3204813J2743831J0965347Q979380P413864O331444O422997O482780
$$ 530170977 543375790 556119621 567084968 576064348 583478212 589809656 596232653 602715433
1719.3F02715433N373954M327536L737807L088415K588272K139092K321302L190220
$$ 602715433 608089387 612416923 616154730 619243145 621831417 623970509 626291811 629482031
1735.7F29482031L123402L086925L699482M225850M552841M962683N921840O986261
$$ 629482031 632605433 635692358 639391840 643617690 648170531 653133214 659055054 666041315
1752F66041315O657421O042063N872071N531371N560696N359352M570126L983498L673613
$$ 666041315 672698736 678740799 684612870 690144241 695704937 701064289 705634415 709617913 713291526
1770.3G13291526L886282M190862L647507K965569K700389K615034K444089K262473
$$ 713291526 717177808 721368670 725016177 727981746 730682135 733297169 735741258 738003731
1786.7G38003731J898110J471281J808881K280653J950145J476168J585424J933337
$$ 738003731 739901841 741373122 743182003 745462656 747412801 748888969 750474393 752407730
1803G52407730J823604J406848J159072J330793J553774J457214J242757J182079J097501
$$ 752407730 754231334 755638182 756797254 758128047 759681821 761139035 762381792 763563871 764661372
1821.3G64661372R44137R79424R57012Q59022J201928J420319J117229Q70824P39753
$$ 764661372 765605509 766584933 767541945 768400967 769602895 771023214 772140443 773011267 773751020
1839.7G73751020M32551L20375Q76606J190066R52900P35640O79433P02441O49512
$$ 773751020 774183571 774503946 775380552 776570618 777523518 778259158 778938591 779641032 780290544
1858G80290544N78821N23865M00543J64628J80602O74963R09865P11918N95808O03080
$$ 780290544 780869365 781393230 781793773 781958401 782139003 782813966 783723831 784435749 785031557 785634637
1878.4G85634637N49435M72248M18544L70681L66628N61595O51479M56691L99411M96685
$$ 785634637 786184072 786656320 787074864 787445545 787812173 788373768 789025247 789481938 789881349 790378034
1898.8G90378034N26846M30345K49922J21355K03073M34638M60863J52766o4730J81377
$$ 790378034 790904880 791335225 791585147 791706502 791909575 792344213 792805076 792957842 792893112 793074489
1919.2G93074489M17173M31180M13477K60472J67609K96592L73304K08557K026q0347
$$ 793074489 793491662 793922842 794336319 794596791 794764400 795060992 795434296 795642853 795644879 795564532
1939.6G95564532J1087L05235M38154K31564Q0526J63257K79367K82049J60873P4983
$$ 795564532 795575619 795880854 796319008 796550572 796631098 796794355 797073722 797355771 797516644 797591627
1960G97591627J39951K26915K16663J79291J31428J00970J81020K47836J71661L4750
$$ 797591627 797731578 797958493 798175156 798354447 798485875 798586845 798767865 799015701 799187362 799222112
1980.4G99222112J7404J10090J67131P2718r7215p4983J30356K51949K07901O8783
$$ 799222112 799239516 799349606 799516737 799589455 799492240 799417257 799547613 799799562 800007463 800076246
2000.8H00076246o6042p3850N186K3961r6619k44618k69234j62065m5299r5189k36690
$$ 800076246 800010204 799936354 799941540 799965501 799868882 799624264 799355030 799192965 799147666 799052477 798815787
2023.2G98815787k85685k27809j66655j60217k28465k95162k55883j71184j24335j04130
$$ 798815787 798530102 798302293 798135638 797975421 797746956 797451794 797195911 797024727 796900392 796796262
2043.6G96796262j13487j70052j45137l2127K8789O854k1517L3140J21236J37329Q5175
$$ 796796262 796682775 796512723 796367586 796335459 796364248 796371102 796349585 796382725 796503961 796641290 796726465
2066.1G96726465J2934r596R4414J93119J47462K7239k5928M3511J49429J49787M2379
$$ 796726465 796739399 796729803 796824217 797017336 797164798 797192037 797166109 797209620 797359049 797508836 797551215
2088.5G97551215L636R5725K20835K37763J31666M1485R1493K05279K10523J15455
$$ 797551215 797554851 797650576 797871411 798109174 798240840 798282325 798373818 798579097 798789620 798905075
2108.9G98905075M9233R6977J90377J93656Q0227q642K3126J21534J83702J31964L4392
$$ 798905075 798954308 799051285 799241662 799435318 799515545 799506903 799530029 799651563 799835265 799967229 800001621
2131.3H00001621M1545J32382J58608J08301M6373M2498J09672J87159J89125J21057
$$ 800001621 800043166 800175548 800334156 800442457 800488830 800531328 800641000 800828159 801017284 801138341
2151.7H01138341J27614J98364K27273K19285K07424K07186K50161L28481L65555L63410
$$ 801138341 801265955 801464319 801691592 801910877 802118301 802325487 802575648 802904129 803269684 803633094
2172.1H03633094L90887M14848L72410L42787L69370L69489L31461L20077L39687L47376
$$ 803633094 804023981 804438829 804811239 805154026 805523396 805892885 806224346 806544423 806884110 807231486
2192.5H07231486L19779K94804L29197L61860L35991K88725K71857L01599L20733L11255
$$ 807231486 807551265 807846069 808175266 808537126 808873117 809161842 809433699 809735298 810056031 810367286
2212.9H10367286L20077L17931K64287K33054K60711K82049K45870J82032J50502J71423
$$ 810367286 810687363 811005294 811269581 811502635 811763346 812045395 812291265 812473297 812623799 812795222
2233.3H12795222K16484K09212J38760Q9347J24693J76311J42037O9678O6698J25646
$$ 812795222 813011706 813220918 813359678 813449025 813573718 813750029 813892066 813961744 814028442 814154088
2253.7H14154088J70768J35183M5717M6551J15097J52230J54376J10030N0128N0187
$$ 814154088 814324856 814460039 814505756 814552307 814667404 814819634 814974010 815084040 815134168 815184355
2274.1H15184355R4890P2539J8299P748K9326N4836M8101J5199j6451m291M2438O1691
$$ 815184355 815279245 815351784 815370083 815377831 815407157 815461993 815510094 815525293 815508842 815504551 815546989 815608680
2298.6H15608680K4200j8597k3663K1637P5221N1021J1027L8683N3943K443R54N1320
$$ 815608680 815632880 815614283 815590620 815612257 815687478 815738499 815749526 815788209 815842152 815844595 815845549 815896869
2323.1H15896869J549q6486n1796j3829r0897j47938j80841k37405k73228l99470o27160
$$ 815896869 815898418 815811932 815760136 815746307 815655410 815507472 815326631 815089226 814815998 814416528 813789368
2345.5H13789368m46618J0908L09050L82840K69831J0550l09170n35369o09457n95093
$$ 813789368 813342750 813353658 813662708 814045548 814315379 814325929 814016759 813481390 812871933 812276840
2365.9H12276840o55174p17044o82235n94794m94063m58181m53234l92318k88605k10405
$$ 812276840 811621666 810904622 810222387 809627593 809133530 808675349 808222115 807829797 807541192 807330787
2386.3H07330787k20120l07560l76940l80039l28362k96712l70085m79758m98473m18246
$$ 807330787 807110667 806803107 806426167 806046128 805717766 805421054 805050969 804571211 804072738 803654492
2406.7H03654492l59595m07875n16057n80966n54383m73022m60387n91456p19548o91592
$$ 803654492 803294897 802887022 802370965 801789999 801235616 800762594 800302207 799710751 798991203 798299611
2427.1G98299611n52714m81427n74231p19786p37309n91994m82142n76615p46608p80046
$$ 798299611 797746897 797265470 796691239 795971453 795234144 794642150 794160008 793583393 792836785 792056739
2447.5G92056739o63459n36203n53847o78420p39515o82175n66244n17666o22988p59125
$$ 792056739 791393280 790857077 790303230 789624810 788885295 788203120 787636876 787119210 786496222 785737097
2467.9G85737097p24554n58376m92334o10471p39515p16984n88358n05626n64933o85155
$$ 785737097 785012543 784454167 783961833 783351362 782611847 781894863 781306505 780800879 780235946 779550791
2488.3G79550791p08819n89788m41551m43339n89848o95824o50525n03064m12106m96805
$$ 779550791 778841972 778252184 777810633 777367294 776777446 776081622 775431097 774928033 774515927 774019122
2508.7G74019122o30975o29305n33164m68195n02049o33121p19488o24656m77672m94718
$$ 774019122 773388147 772758842 772225678 771757483 771255434 770622313 769902825 769278169 768800497 768305779
2529G68305779o45340p59065p45475o28710n44548o32108q10384q26836o38604m95136
$$ 768305779 767660439 766901374 766155899 765527189 764982641 764350533 763540149 762713313 762074709 761579573
2549.4G61579573n68569p32421p77364o67572n39065n28156o40512p37786o75023n20646
$$ 761579573 761011004 760278583 759501219 758833647 758294582 757766426 757125914 756388128 755713105 755192459
2569.8G55192459m99130o49511p78735p48277o17564n31613n91517p19905p27951o14047
$$ 755192459 754693329 754043818 753265083 752516806 751899242 751367629 750776112 750056207 749328256 748714209
2590.2G48714209n26011n41628o56485p58410p11202n95749o22630q00788r21250q72731
$$ 748714209 748188198 747646570 746990085 746231675 745520473 744924724 744302094 743501306 742580056 741707325
2610.6G41707325p83741q04842r29892j036823j046955j000047r62198j015723j164555
$$ 741707325 740923584 740118742 739188850 738152027 737105072 736105025 735142827 734127104 732962549
2629G32962549j234055j148701j078069j126826j195490j205385j154840j093685j121342
$$ 732962549 731728494 730579793 729501724 728374898 727179408 725974023 724819183 723725498 722604156
2647.3G22604156j196027j235664j217365j123429j072526j159787j255035j234114
$$ 722604156 721408129 720172465 718955100 717831671 716759145 715599358 714344323 713110209
2663.7G13110209j123727j009941j006961j092672j115561j060068j011491r98557
$$ 713110209 711986482 710976541 709969580 708876908 707761347 706701279 705689788 704691231
2680G04691231j009404j036048j045525j009763r80258j011133j051068j066506j069188
$$ 704691231 703681827 702645779 701600254 700590491 699610233 698599100 697548032 696481526 695412338
2698.3F95412338j066327j105845j177311j237929j266897j234829j167417j159727
$$ 695412338 694346011 693240166 692062855 690824926 689558029 688323200 687155783 685996056
2714.6F85996056j222313j267850j246095j180112j132429j126647j146674j124382
$$ 685996056 684773743 683505893 682259798 681079686 679947257 678820610 677673936 676549554
2731F76549554j037777j008570j065254j093566j042009r82106r78231r88781r88305
$$ 676549554 675511777 674503207 673437953 672344387 671302378 670320272 669342041 668353260 667364955
2749.3F67364955r85444r58860r46044r82523j021207j029432j003980r70662r97364
$$ 667364955 666379511 665420651 664474607 663492084 662470877 661441445 660437465 659466803 658469439
2767.7F58469439j086474j146138j115977j051844j099109j246751j322686j316190
$$ 658469439 657382965 656236827 655120850 654069006 652969897 651723146 650400460 649084270
2784F49084270j344025j412869j454711j506567j578629j572311j547634j632750j759350
$$ 649084270 647740245 646327376 644872665 643366098 641787469 640215158 638667524 637034774 635275424
2802.3F35275424j807213j814545j863479j935780k020419k093196k103507k116680
$$ 635275424 633468211 631653666 629790187 627854407 625833988 623740792 621637285 619520605
2818.7F19520605k195478k315044k424300k503693k584636k707184k900779l137827
$$ 619520605 617325127 615010083 612585783 610082090 607497454 604790270 601889491 598751664
2835E98751664l427267l821611m377544n136073n960226o587803o736815o205440n024552
$$ 598751664 595324397 591502786 587125242 581989169 576028943 569441140 562704325 556498885 551474333
2853.3E51474333l556550k370298j852810k052248k729654l544867m190504m401267
$$ 551474333 547917783 545547485 543694675 541642427 538912773 535367906 531177402 526776135
2869.7E26776135m110336l479243k741456k063334j537680j242400j188874j271307
$$ 526776135 522665799 519186556 516445100 514381766 512844086 511601686 510412812 509141505
2886E09141505j380623j509368j679540j871884k079129k307981k545923k796710l060579
$$ 509141505 507760882 506251514 504571974 502700090 500620961 498312980 495767057 492970347 489909768
2904.3D89909768l403962l917425m530907n136520n646437n912602n855680n439669
$$ 489909768 486505806 482588381 478057474 472920954 467274517 461361915 455506235 450066566
2920.6D50066566m591822l404647k096623p78556M96715J691073K815306L816694M555643
$$ 450066566 445474744 442070097 439973474 439194918 439691633 441382706 444198012 448014706 452570349
2939D52570349M902482M785657M278511L537386K699525J900672J250595R42827J161873
$$ 452570349 457472831 462258488 466536999 470074385 472773910 474674582 475925177 476868004 478029877
2957.4D78029877J770079K488107L206729L953547M683584N231112N571991N769491
$$ 478029877 479799956 482288063 485494792 489448339 494131923 499363035 504935026 510704517
2973.7E10704517N806208N742192N579770N216241M711270M177213L621578L082931
$$ 510704517 516510725 522252917 527832687 533048928 537760198 541937411 545558989 548641920
2990E48641920K551258J942396J299143O82592J16885l74258q21531j177191j340807
$$ 548641920 551193178 553135574 554434717 555117309 555234194 554859936 554038405 552861214 551520407
3008.3E51520407j346171j290798j211703j196027j326203j533389j767993k033591
$$ 551520407 550174236 548883438 547671735 546475708 545149505 543616116 541848123 539814532
3024.7E39814532k222061k240897k185225k175629k230525k320647k419591k484680
$$ 539814532 537592471 535351574 533166349 530990720 528760195 526439548 524019957 521535277
3041E21535277k508282k556563k642750k689481k686143k691329k677798k643466k609730
$$ 521535277 519026995 516470432 513827682 511138201 508452058 505760729 503082931 500439465 497829735
3059.3D97829735k507329k364188k244949k097428j937896j848340j802028j745909
$$ 497829735 495322406 492958218 490713269 488615841 486677945 484829605 483027577 481281668
3075.6D81281668j686364j631767j574397j519472j469910j417994j343936j260340
$$ 481281668 479595304 477963537 476389140 474869668 473399758 471981764 470637828 469377488
3092D69377488j240105j262903j271724j323998j398951j433134j458854j510024j591116
$$ 469377488 468137383 466874480 465602756 464278758 462879807 461446673 459987819 458477795 456886679
3110.3D56886679j624703j623542j674622j739085j818031j915067j970887k005071
$$ 456886679 455261976 453638434 451963812 450224727 448406696 446491629 444520742 442515671
3126.6D42515671k050102k080559k092004k125114k186537k222121k244144k263427
$$ 442515671 440465569 438385010 436293006 434167892 431981355 429759234 427515090 425251663
3143D25251663k283812k342045k348781k273738k272368k384215k450109k422303k398640
$$ 425251663 422967851 420625806 418277025 416003287 413730919 411346704 408896595 406474292 404075652
3161.3D04075652k416432k449274k476126k469003k405852k369582k417505k479285
$$ 404075652 401659220 399209946 396733820 394264817 391858965 389489383 387071878 384592593
3177.6C84592593k472997k413899k366334k356708k364516k349138k329380k320766
$$ 384592593 382119596 379705697 377339363 374982655 372618139 370269001 367939621 365618855
3193.9C65618855k292753k234369k195925k197057k150982k067208k035320k011419
$$ 365618855 363326102 361091733 358895808 356698751 354547769 352480561 350445241 348433822
3210.3C48433822j972884j959860j944065j929313j931280j932978j945138j950086
$$ 348433822 346460938 344501078 342557013 340627700 338696420 336763442 334818304 332868218
3226.6C32868218j929462j943171k021193k109081k151847k180159k221524k232135
$$ 332868218 330938756 328995585 326974392 324865311 322713464 320533305 318311781 316079646
3242.9C16079646k248287k310544k374917k410472k429485k441496k449423k442658
$$ 316079646 313831359 311520815 309145898 306735426 304305941 301864445 299415022 296972364
3259.2B96972364k411574k382874k329320k237439k140403k047718j939565j772016
$$ 296972364 294560790 292177916 289848596 287611157 285470754 283423036 281483471 279711455
3275.5B79711455j609862j495301j360506j224488j111627r94444q82327p85053o82712
$$ 279711455 278101593 276606292 275245786 274021298 272909671 271915227 271032900 270247847 269565135
3293.9B69565135n95420n30661m60773l87877l28750l09050k83658k41161k54661k88576
$$ 269565135 268969715 268439054 267978281 267590404 267261654 266952604 266668946 266427785 266173124 265884548
3314.3B65884548k66879k11597j74314j86830k47926l09467l20554k80052k66225l19123
$$ 265884548 265617669 265406072 265231758 265044928 264797002 264487535 264166981 263886929 263620704 263301581
3334.7B63301581l72350l72648m00216m85092n73099o07520n35578n30153o72549p51615
$$ 263301581 262929231 262556583 262156367 261671275 261098176 260490656 259955078 259424925 258752376 258000761
3355.1B58000761o66052n72920n99473o52284o45488o12498o33090p18296p49975o90759
$$ 258000761 257334709 256761789 256162316 255510032 254864544 254252046 253618956 252900660 252150685 251459926
3375.5B51459926o14553n66602n69776n27456l90500k48760j96695k93479m38153m42177
$$ 251459926 250845373 250278771 249708995 249181539 248791039 248542279 248345584 248052105 247613952 247171775
3395.9B47171775k48403o1750j44631l37556k69934m5494M1306J8075K8670O4999J14337
$$ 247171775 246923372 246861622 246716991 246379435 246109501 246064007 246105313 246123388 246152058 246217057 246331394
3418.3B46331394J94490L02583M71368O18205O74217O54504P38800R07764Q28713O44415
$$ 246331394 246525884 246828467 247299835 247918040 248592257 249246761 249985561 250893325 251722038 252366453
3438.7B52366453P27803R62883J092911J138091J143277J159876J242280J383752J515418
$$ 252366453 253094256 254057139 255150050 256288141 257431418 258591294 259833574 261217326 262732744
3457B62732744J542151J479328J534015J763284J897454J756251J504004J497507J703888
$$ 262732744 264274895 265754223 267288238 269051522 270948976 272705227 274209231 275706738 277410626
3475.4B77410626J927317K041459J971095J942516K046168K068966K030492K083898
$$ 277410626 279337943 281379402 283350497 285293013 287339181 289408147 291438639 293522537
3491.7B93522537K144187K194792K228916K232403K244115K185225K101719K164722
$$ 293522537 295666724 297861516 300090432 302322835 304566950 306752175 308853894 311018616
3508C11018616K345771K514302K511412K382428K391904K524555K653927K618849K479017
$$ 311018616 313364387 315878689 318390101 320772529 323164433 325688988 328342915 330961764 333440781
3526.4C33440781K553582K791673K892613K912969K942621K905667K961338L096908
$$ 333440781 335994363 338786036 341678649 344591618 347534239 350439906 353401244 356498152
3542.7C56498152L115803L019631L050715L220409L343940L363609L386497L546864
$$ 356498152 359613955 362633586 365684301 368904710 372248650 375612259 378998756 382545620
3559C82545620L655464L485441L321022L766417M398883M370182M114956M148662M284501
$$ 382545620 386201084 389686525 393007547 396773964 401172847 405543029 409657985 413806647 418091148
3577.4D18091148M397929M507750M427940M215300M377395M875958M864454M647225
$$ 418091148 422489077 426996827 431424767 435640067 440017462 444893420 449757874 454405099
3593.7D54405099M789531N017430N025595M977048M874587M578590M565001M874646
$$ 454405099 459194630 464212060 469237655 474214703 479089290 483667880 488232881 493107527
3610D93107527N015761N063415M929602M887879N386472N478739M842878M164755M327059
$$ 493107527 498123288 503186703 508116305 513004184 518390656 523869395 528712273 532877028 537204087
3628.4E37204087N338073N416870M999816M809439M644335M554689M413723L890098
$$ 537204087 542542160 547959030 552958846 557768285 562412620 566967309 571381032 575271130
3644.7E75271130L331482L760695M949332M931926M116297M094541M411340M120886
$$ 575271130 578602612 582363307 587312639 592244565 596360862 600455403 604866743 608987629
3661F08987629L658235L309191K827763K589584L052115K928734K546489L264308L663540
$$ 608987629 612645864 615955055 618782818 621372402 624424517 627353251 629899740 633164048 636827588
3679.4F36827588L319502K957642K491355J978934J946807K524256K799571K485394
$$ 636827588 640147090 643104732 645596087 647575021 649521828 652046084 654845655 657331049
3695.7F57331049K022148J651406J587093J875579J831651J265228Q28921J219929
$$ 657331049 659353197 661004603 662591696 664467275 666298926 667564154 668393075 669613004
3712F69613004K050042K099633J609027J214624J050651J049817J207947J395107J050234
$$ 669613004 671663046 673762679 675371706 676586330 677636981 678686798 679894745 681289852 682340086
3730.3F82340086M24861L98934J151026J801788J441598K83778k7716J059413J008093
$$ 682340086 682764947 683163881 684314907 686116695 687558293 687842071 687814355 688873768 689881861
3748.7F89881861N13196J341403J909017J375735Q63552J030386J105189P95305O63221
$$ 689881861 690395057 691736460 693645477 695021212 695884764 696915150 698020339 698815644 699478865
3767.1F99478865O76870Q98302J151085R59754O18577N60581P94232Q41796P41899
$$ 699478865 700155735 701054037 702205122 703164876 703783453 704344034 705138266 705980062 706721961
3785.4G06721961Q16763Q52227P04050L71695J36375K54095R8288J50621R64403R72331
$$ 706721961 707538724 708390951 709095001 709466696 709603071 709857166 709955454 710106075 711070478 712042809
3805.8G12042809P69794J133382R58800J49012k35975J26779Q0168M60506J277923
$$ 712042809 712812603 713945985 714904785 715053797 714817822 714944601 715024769 715485275 716763198
3824.2G16763198J095891O45996L18646J52528K76745J19209J7404N32091Q74341R30428
$$ 716763198 717859089 718505085 718823731 718976259 719253004 719372213 719389617 719921708 720796049 721726477
3844.6G21726477R07779N63025l34978j266241p9632J659990J394450M71414n9903
$$ 721726477 722634256 723197281 722862303 721596062 721516430 723176420 724570870 725042284 724982381
3862.9G24982381J32441L49284N4180J99080O75022Q20220O35862R8169J04845L93688
$$ 724982381 725114822 725464106 725518286 725717366 726392388 727212608 727848470 727946639 728051484 728445172
3883.3G28445172K39373M09543L97980R5129M31657O17802K3604m64618k82586K14100
$$ 728445172 728684545 729094088 729492068 729587197 730018854 730636656 730660260 730195642 729913056 730127156
3903.7G30127156P46131R29773O25312K74241N5790j06871j729K92719K91645J55389
$$ 730127156 730873287 731803060 732428372 732702613 732758403 732651532 732649803 732942522 733234167 733389556
3924.1G33389556K27690J95682j5795N7936L96669M92692K77936J5438m2498J24156
$$ 733389556 733617246 733812928 733797133 733855069 734251738 734744430 735022366 735037804 734995306 735119462
3944.5G35119462J62661J24574K80082L86357K52605Q1181Q5771J56045J62363K12253
$$ 735119462 735282123 735406697 735686779 736073136 736325741 736406922 736492693 736648738 736811101 737023354
3964.9G37023354K43008J06334K3246J36256K37525K43664J85191J46032J39951Q3924
$$ 737023354 737266362 737372696 737395942 737532198 737769723 738013387 738198578 738344610 738484561 738568485
3985.3G38568485P6592J43111K05695K36690J93775J44601
$$ 738568485 738645077 738788188 738993883 739230573 739424348 739568949
3997.5G39568949
$$ 739568949
##END=$$ End of the data block
