##TITLE=G23-51-CE $$ Begin of the data block
##JCAMP-DX=5.00 $$ ACD/SpecManager v 10.08
##SPECTROMETER/DATA SYSTEM=Alpha
##DATE=23 Oct 2013 10:11:40
##DATA TYPE=INFRARED SPECTRUM
##DATA CLASS=XYDATA
##ORIGIN=
##OWNER=
##NPOINTS=1765
##FIRSTX=399.75695801
##LASTX=3997.56933594
##MAXX=3997.56933594
##MINX=399.75695801
##MAXY=0.81669998
##MINY=0.24537690
##XFACTOR=1.0000000000
##YFACTOR=1.000000000000000e-9
##FIRSTY=0.52393317
##DELTAX=2.03957629
##XUNITS=1/CM
##YUNITS=ARBITRARY UNITS
##XYDATA=(X++(Y..Y))
$$ plain form
399.8 523933172 522366285 520832837 519481838 518942475 519000351 519080639 519166589 518868446 517404020 515938282
420.2 515938282 515339553 514313579 512890816 511661649 510239422 508404851 506494522 505256057 505240321
438.5 505240321 506119132 507333577 508557439 509784222 510802507 511050344 510325074 509062648 507691443
456.9 507691443 506085396 504064977 501748502 499275088 496762633 494457811 492261469 490055650
473.2 490055650 488162845 486628562 485359520 484498620 484030545 483560085 482725590 481458247 480000138
491.5 480000138 478530228 476792961 474560708 471955895 469206035 466543436 463865072 460817665
507.9 460817665 457648546 454817027 452234864 449585497 446930736 444617331 442785978 441485345
524.2 441485345 440782845 440538317 440666914 441438109 442881286 444809884 447165191 449669749 451815516
$$ packed form
399.8E23933172j566887j533448j350999n39363N7876Q0288Q5950k98143j464426j465738
420.2E15938282n98729j025974j422763j229167j422227j834571j910329j238465j5736
438.5E05240321Q78811J214445J223862J226783J018285K47837p25270j262426j371205
456.9E07691443j606047k020419k316475k473414k512455k304822k196342k205819
473.2D90055650j892805j534283j269042q60900m68075m70460q34495j267343j458109
491.5D80000138j469910j737267k232253k604813k749860k662599k678364l047407
507.9D60817665l169119k831519k582163k649367k654761k313405j831353j300633
524.2D41485345p02500k44528J28597P71195J443177J928598K355307K504558K145767
$$ plain form
542.5 451815516 453050792 453242451 452813506 452197433 451468408 450348526 448743969 446964860 445192516
560.9 445192516 443231404 440839410 438033491 435298622 433376759 432598531 432801098 433802038 435520202
579.2 435520202 437962353 441056401 444301724 447084576 449106961 450448424 451269299 451610684 451578170
597.6 451578170 451511532 451670825 451948255 452263892 452615142 452817947 452835441 453055382 453734726 454834014
618 454834014 456355095 458390832 460938960 463802636 466799110 469591379 471889794 473894686 475947887
636.3 475947887 478000551 479796708 481271476 482542843 483697355 484679490 485415190 485927582 486310780
654.7 486310780 486710101 487171322 487522900 487763762 488156945 488977253 490329564 491599888 492846847
673.1 492846847 494296163 495829970 497426569 499075413 500539601 501641929 502522647 503267705 503629208
$$ packed form
542.5D51815516J235276J91659m28945o16073p29025j119882j604557j779109j772344
560.9D45192516j961112k391994k805919k734869j921863p78228K02567J000940J718164
579.2D35520202K442151L094048L245323K782852K022385J341463Q20875L41385l2514
597.6D51578170o6638J59293K77430L15637L51250K02805J7494K19941O79344J099288
618D54834014J521081K035737K548128K863676K996474K792269K298415K004892K053201
636.3D75947887K052664J796157J474768J271367J154512R82135P35700N12392L83198
654.7D86310780L99321M61221L51578K40862L93183Q20308J352311J270324J246959
673.1D92846847J449316J533807J596599J648844J464188J102328Q80718P45058L61503
$$ plain form
691.4 503629208 503333926 502432048 501395881 500868559 501112163 501942337 503114283 504690647 506950319
709.8 506950319 509917021 513197482 516492069 520019889 524190128 528973460 533833206 538341999
726.1 538341999 542413294 546248376 549851835 552845955 555039048 556595266 557788789 558723867 559320629
744.4 559320629 559432507 559146225 558753312 558396399 557818472 556700230 555260003 554038405 553455234
762.8 553455234 553712130 554965556 557336867 560833335 565373600 570662320 576101542 581164002 585726559
781.2 585726559 589795709 593313694 596248448 598649204 600632429 602520049 604734719 607480645
797.5 607480645 610662043 613990486 617228508 620370865 623368859 625891089 627670705 628773212
813.8 628773212 629545331 630131304 630207002 629441142 627883494 625839531 623608053 621290147 618780315
$$ packed form
691.4E03629208k95282r01878j036167n27322K43604Q30174J171946J576364K259672
709.8E06950319K966702L280461L294587L527820M170239M783332M859746M508793
726.1E38341999M071295L835082L603459K994120K193093J556218J193523R35078N96762
744.4E59320629J11878k86282l92913l56913n77927j118242j440227j221598n83171
762.8E53455234K56896J253426K371311L496468M540265N288720N439222N062460M562557
781.2E85726559M069150L517985K934754K400756J983225J887620K214670K745926
797.5F07480645L181398L328443L238022L142357K997994K522230J779616J102507
813.8F28773212P72119N85973P5698p65860j557648k043963k231478k317906k509832
$$ plain form
832.1 618780315 616033077 613158166 610386372 607866347 605489731 603221536 601297319 599886894
848.5 599886894 598911583 598184109 597526014 596853077 596553862 597612083 600706518 605524898 611315191
866.8 611315191 617555022 623736084 629123569 633028030 635060906 635210633 633735418 630900800 626874745
885.2 626874745 622034073 616939485 611939669 607139349 602527976 597970307 593264878 588311315
901.5 588311315 582973540 576971233 570226490 563001037 555636764 548406303 541594625 535580039
917.8 535580039 530747116 527324677 525211394 523978472 523186088 522634685 522341251 522302866 522362411
936.2 522362411 522380531 522285283 521768153 520006478 516071260 509642422 501192093 491529405 481222957
954.5 481222957 470569938 459719062 448681295 437451065 426086932 414786398 403830498
$$ packed form
832.1F18780315k747238k874911k771794k520025k376616k268195j924217j410425
848.5E99886894r75311p27474o58095o72937k99215J058221L094435M818380N790293
866.8F11315191O239831O181062N387485L904461K032876J49727j475215k834618m026055
885.2F26874745m840672n094588m999816m800320m611373m557669m705429m953563
901.5E88311315n337775o002307o744743p225453p364273p230461o811678o014586
917.8E35580039m832923l422439k113283j232922p92384n51403k93434l8385N9545
936.2E22362411J8120r5248n17130j761675l935218o428838q450329r662688j0306448
954.5D81222957j0653019j0850876j1037767j1230230j1364133j1300534j0955900
$$ plain form
968.8 403830498 393431902 383787692 375121117 367660761 361596495 356941789 353528023 351087570
985.1 351087570 349312752 347917765 346746624 345760077 344955713 344425410 344302684 344580561 345017016
1003.5 345017016 345219821 344882905 343927175 342440665 340627193 338709086 336817563 334980756 333148062
1021.8 333148062 331219375 329099774 326837122 324569255 322333544 320075184 317748666 315348715
1038.1 315348715 312946290 310632735 308457524 306498766 304898649 303872794 303594202 304052263 305119336
1056.5 305119336 306696296 308757901 311276764 314057797 316596568 318041712 317787200 316320330
1072.8 316320330 314901263 314559788 315682411 318205982 321884274 326383084 331305563 336310238
1089.1 336310238 341173738 345713109 349733680 353081971 355711371 357642770 359059304 360394478
$$ packed form
968.8D03830498j0398596r644210q666575p460356o064266m654706l413766k440453
985.1C51087570j774818j394987j171141r86547q04364n30303j22726K77877M36455
1003.5C45017016K02805l36916r55730j486510j813472j918107j891523j836807j832694
1021.8C33148062j928687k119601k262652k267867k235711k258360k326518k399951
1038.1C15348715k402425k313555k175211j958758j600117j025855k78592M58061J067073
1056.5C05119336J576960K061605K518863K781033K538771J445144k54512j466870
1072.8C16320330j419067l41475J122623K523571L678292M498810M922479N004675
1089.1C36310238M863500M539371M020571L348291K629400J931399J416534J335174
$$ plain form
1105.4 360394478 362083673 364279240 366869211 369677156 372571349 375394374 377930343 380065858
1121.8 380065858 381889105 383649260 385681927 388245940 391210765 394079596 396396488 397909611
1138.1 397909611 398560494 398472428 397872090 397018313 396162808 395503074 395174742 395306438 396051168 397571564
1158.5 397571564 400007755 403380543 407499492 412121773 417179555 422792286 429134578 436169028
1174.8 436169028 443607956 451210111 458835334 466309071 473371297 479745150 485222012 489638954
1191.1 489638954 492838860 494770229 495587975 495554358 494967312 494125456 493273675 492614210 492280632
1209.5 492280632 492261052 492428780 492588460 492567211 492281228 491639644 490575165 489108413 487333715
1227.8 487333715 485397696 483457118 481648535 480110288 478966862 478317618 478241712 478781462 479914576
$$ packed form
1105.4C60394478J689195K195567K589971K807945K894193K823025K535969K135515
1121.8C80065858J823247J760155K032667K564013K964825K868831K316892J513123
1138.1C97909611O50883q8066o00338q53777q55505o59734l28332J31696P44730J520396
1158.5C97571564K436191L372788M118949M622281N057782N612731O342292P034450
1174.8D36169028P438928P602155P625223P473737P062226O373853N476862M416942
1191.1D89638954L199906J931369Q17746l3617n87046q41856q51781o59465l33578
1209.5D92280632j9580J67728J59680k1249k85983o41584j064479j466752j774698
1227.8D87333715j936019j940578j808583j538247j143426o49244p5906N39750J133114
$$ plain form
1246.2 479914576 481539249 483566552 485885710 488335460 490787387 493170768 495466501 497690409
1262.5 497690409 499889493 502110183 504358530 506571889 508614302 510321200 511624157 512608349
1278.8 512608349 513521492 514588535 515797615 516999304 518028915 518777788 519159913 519017875 518225312
1297.2 518225312 516861022 515127838 513234079 511309683 509374261 507479310 505791366 504528284
1313.5 504528284 503800154 503572702 503714383 503983378 504028440 503523171 502247036 500204384 497676581
1331.8 497676581 495024115 492580146 490583897 489198089 488375813 487823039 487272263 486548960 485516876
1350.2 485516876 484129637 482427478 480502099 478390187 475868970 472755164 469253331 465526342
1366.5 465526342 461753130 458413959 455351293 452142298 448803484 445195824 441199481 437118828
$$ packed form
1246.2D79914576J624673K027303K319158K449750K451927K383381K295733K223908
1262.5D97690409K199084K220690K248347K213359K042413J706898J302957R84192
1278.8E12608349R13143J067043J209080J201689J029611P48873L82125j42038p92563
1297.2E18225312j364290j733184j893759j924396j935422j894951j687944j263082
1313.5E04528284p28130k27452J41681K68995M5062n05269j276135k042652k527803
1331.8D97676581k652466k443969j996249j385808q22276n52774n50776p23303j032084
1350.2D85516876j387239j702159j925379k111912k521217l113806l501833l726989
1366.5D65526342l773212l339171l062666l208995l338814l607660l996343m080653
$$ plain form
1382.8 437118828 433468103 430757135 429380566 428867042 428399622 427901655 427678466 427805156 428382635
1401.2 428382635 429350823 430724949 432466060 434258938 436016530 437796772 439566255 441456527
1417.5 441456527 444008440 446942657 449742675 452430457 454709440 456334263 457308590 457544625 457166970
1435.9 457166970 457097650 457699895 458396465 458973974 459502250 460091770 460659325 460880131 460882694 461720735
1456.2 461720735 464759886 468667775 472009629 475269914 479265630 484098494 490164608 498532832
1472.6 498532832 507926404 516127467 522725701 527611613 530750334 531975091 531196237 528645635
1488.9 528645635 525117517 521212399 516036630 509237707 502605736 496787578 490747243 482256323
1505.2 482256323 470554471 460870564 453042477 444983751 437430382 431572407 427671075 424461186
$$ packed form
1382.8D37118828l650725k710968j376569n13524m67420m97967k23189J26690N77479
1401.2D28382635R68188J374126J741111J792878J757592J780242J769483J890272
1417.5D41456527K551913K934217K800018K687782K278983J624823R74327K36035l77655
1435.9D57166970o9320O02245O96570N77509N28276N89520N67555K20806K563Q38041
1456.2D61720735L039151L907889L341854L260285L995716M832864O066114Q368224
1472.6D98532832R393572Q201063O598234M885912L138721J224757p78854k550602
1488.9E28645635l528118l905118n175769o798923o631971n818158o040335q490920
1505.2D82256323j1701852r683907p828087q058726p553369n857975l901332l209889
$$ plain form
1521.5 424461186 421485364 418556005 415343106 412315726 409259975 406149447 403823465 401716590
1537.8 401716590 399178624 397949338 398527116 399934769 401851803 404366374 407534420 411102176
1554.1 411102176 414570719 418730378 424691886 429705232 433439434 436666489 439531714 442439884
1570.5 442439884 444898129 446500123 447917670 449459881 450550497 450998425 451054990 450786620 450129688
1588.8 450129688 448956579 447183579 444705755 441582859 437774211 433062136 427462041 421109229
1605.1 421109229 413960040 405868173 397234470 388393104 378294945 366596937 356264025 346274197
1621.4 346274197 334452122 322645336 311661839 301151127 291860223 283039093 273941040 267685294
1637.8 267685294 264790297 263404012 262847543 263119698 264548689 266335934 268381357 272096634 276505828
$$ packed form
1521.5D24461186k975822k929359l212899l027380l055751l110528k325982k106875
1537.8D01716590k537966j229286N77778J407653J917034K514571L168046L567756
1554.1D11102176L468543M159659N961508N013346L734202L227055K865225K908170
1570.5D42439884K458245J601994J417547J542211J090616M47928N6565k68370o56932
1588.8D50129688j173109j773000k477824l122896l808648m712075n600095o352812
1605.1D21109229p149189q091867q633703q841366j0098159j1698008j0332912r989828
1621.4C46274197j1822075j1806786j0983497j0510712r290904q821130r098053o255746
1637.8B67685294k894997j386285n56469K72155J428991J787245K045423L715277M409194
$$ plain form
1656.1 276505828 280743361 285602301 291757166 299024582 306140989 313787520 322765589 331467897
1672.4 331467897 340412557 350379288 359944403 368817627 378535897 391471356 404692829 416585505
1688.8 416585505 429488003 442890495 458442450 476305753 494106203 513516426 530004501
1703 530004501 543285608 556094944 567089021 576073349 583486736 589820385 596288502 602840006
1719.3 602840006 608227909 612523139 616250455 619373679 621983588 624080122 626337886 629558682
1735.7 629558682 632765055 635888219 639582038 643805087 648362219 653309762 659200549 666184068
1752 666184068 672865272 678936899 684833229 690344930 695865095 701230347 705814540 709777176 713397861
1770.3 713397861 717238903 721451581 725143373 728129983 730836034 733470500 735948205 738217294
$$ packed form
1656.1B76505828M237533M858940O154865P267416P116407P646531Q978069Q702308
1672.4C31467897Q944660R966731R565115Q873224R718270J2935459J3221473J1892676
1688.8D16585505J2902498J3402492J5551955J7863303J7800450J9410223J6488075
1703E30004501J3281107J2809336J0994077Q984328P413387O333649O468117O551504
1719.3F02840006N387903M295230L727316L123224K609909K096534K257764L220796
1735.7F29558682L206373L123164L693819M223049M557132M947543N890787O983519
1752F66184068O681204O071627N896330N511701N520165N365252M584193L962636L620685
1770.3G13397861L841042M212678L691792K986610K706051K634466K477705K269089
$$ plain form
1786.7 738217294 740081847 741500914 743285954 745581269 747545004 749022782 750598073 752525747
1803 752525747 754367650 755797803 756949008 758262992 759845436 761359513 762639582 763806760 764851391
1821.3 764851391 765759528 766722441 767649055 768479586 769705713 771183372 772328615 773194551 773932815
1839.7 773932815 774354994 774651408 775536180 776733637 777680635 778448284 779164076 779858232 780488729
1858 780488729 781052887 781551063 781940520 782113075 782299280 782985508 783913255 784627795 785203934 785779893
1878.4 785779893 786324143 786822438 787266672 787634254 787990510 788564205 789227605 789673686 790053964 790537775
1898.8 790537775 791060567 791517794 791821003 791956961 792128205 792542040 793003380 793150961 793063879 793236732
1919.2 793236732 793681443 794123113 794506609 794745922 794917881 795205593 795554459 795778811 795832455 795773864
$$ packed form
1786.7G38217294J864553J419067J785040K295315J963735J477778J575291J927674
1803G52525747J841903J430153J151205J313984J582444J514077J280069J167178J044631
1821.3G64851391R08137R62913R26614Q30531J226127J477659J145243Q65936P38264
1839.7G73932815M22179K96414Q84772J197457R46998P67649P15792O94156O30497
1858G80488729N64158M98176L89457J72555J86205O86228R27747P14540N76139N75959
1878.4G85779893N44250M98295M44234L67582L56256N73695O63400M46081L80278M83811
1898.8G90537775N22792M57227L03209J35958J71244M13835M61340J47581q7082J72853
1919.2G93236732M44711M41670L83496K39313J71959K87712L48866K24352N3644n8591
$$ plain form
1939.6 795773864 795763493 796041429 796465397 796702266 796796203 796975076 797290862 797597885 797749579 797811627
1960 797811627 797937393 798148036 798364401 798552275 798681200 798781097 798972845 799230516 799414933 799458504
1980.4 799458504 799477935 799591601 799727917 799760282 799673080 799638808 799802780 800059080 800245047 800287545
2000.8 800287545 800208032 800143540 800155997 800172806 800089419 799869001 799606025 799446583 799402893 799306452 799077153
2023.2 799077153 798794627 798544407 798342109 798170030 797975063 797719896 797441959 797229588 797132432 797064900
2043.6 797064900 796926677 796731710 796609581 796606123 796633780 796631932 796618462 796642244 796724319 796842515 796934187
2066.1 796934187 796956241 796944320 797025442 797230840 797409713 797460139 797463536 797526360 797667861 797805130 797831357
2088.5 797831357 797820330 797930598 798186243 798425853 798511028 798517883 798618078 798836529 799037933 799142480
$$ packed form
1939.6G95773864j0371K77936M23968K36869R3937J78873L15786L07023J51694O2048
1960G97811627J25766K10643K16365J87874J28925R9897J91748K57671J84417M3571
1980.4G99458504J9431J13666J36316L2365q7202l4272J63972K56300J85967M2498
2000.8H00287545p9513o4492J2457J6809q3387k20418k62976j59442m3690r6441k29299
2023.2G99077153k82526k50220k02298j72079j94967k55167k77937k12371r7156o7532
2043.6G97064900j38223j94967j22129l458K7657j848j3470K3782Q2075J18196R1672
2066.1G96934187K2054j1921Q1122K05398J78873N0426L397O2824J41501J37269K6227
2088.5G97831357j1027J10268K55645K39610Q5175O855J00195K18451K01404J04547
$$ plain form
2108.9 799142480 799205422 799333096 799541414 799747169 799853683 799850404 799852490 799971879 800148189 800235093 800246119
2131.3 800246119 800314546 800481260 800651431 800752819 800804675 800863743 800985098 801170051 801355302 801496685
2151.7 801496685 801618874 801755250 801949024 802206695 802445650 802649200 802906036 803237736 803594649 803964615
2172.1 803964615 804361403 804767489 805136561 805473387 805821776 806180656 806526124 806875348 807233870 807574511
2192.5 807574511 807911456 808255255 808580756 808884501 809194624 809513867 809807181 810087800 810402930 810743213
2212.9 810743213 811076880 811377585 811624646 811852098 812111259 812395334 812647045 812830389 812966704 813128173
2233.3 813128173 813366055 813586056 813688874 813754082 813896477 814097643 814265847 814348876 814397454 814503431
2253.7 814503431 814673185 814820051 814885437 814952433 815077007 815217853 815343440 815429628 815487385 815561891
$$ packed form
2108.9G99142480O2942J27674K08318K05755J06514l279K086J19389J76310Q6904J1026
2131.3H00246119O8427J66714J70171J01388N1856N9068J21355J84953J85251J41383
2151.7H01496685J22189J36376J93774K57671K38955K03550K56836L31700L56913L69966
2172.1H03964615L96788M06086L69072L36826L48389L58880L45468L49224L58522L40641
2192.5H07574511L36945L43799L25501L03745L10123L19243K93314K80619L15130L40283
2212.9H10743213L33667L00705K47061K27452K59161K84075K51711J83344J36315J61469
2233.3H13128173K37882K20001J02818O5208J42395K01166J68204Q3029M8578J05977
2253.7H14503431J69754J46866O5386O6996J24574J40846J25587Q6188N7757P4506
$$ plain form
2274.1 815561891 815671742 815749466 815769553 815796494 815846920 815895557 815940499 815973282 815977037 815985620 816015244 816048384
2298.6 816048384 816063285 816066563 816094100 816161633 816265643 816373825 816440225 816462040 816489577 816549659 816633165
2321 816633165 816699982 816688657 816626191 816623032 816629887 816459358 816167057 815937638 815816522 815701723 815309823
2343.5 815309823 814588070 814110816 814133346 814449906 814812064 815034270 815040231 814798474 814352632 813724101
2363.8 813724101 813031316 812370658 811673820 810929835 810233951 809674978 809209406 808746219 808309317 807981491
2384.2 807981491 807740211 807472050 807118714 806734204 806380332 806064904 805752218 805372059 804894149 804395497
2404.6 804395497 803994417 803662181 803253353 802722216 802144885 801615000 801154137 800659418 800021410 799319386
2425 799319386 798711479 798200071 797678709 797060311 796322763 795587718 795003653 794512928 793922484 793176591
$$ packed form
2274.1H15561891J09851P7724K0087K6941N0426M8637M4942L2783L755Q583K9624L3140
2298.6H16048384J4901L278K7537O7533J04010J08182O6400K1815K7537O0082Q3506
2321H16633165O6817j1325o2466l159O855j70529k92301k29419j21116j14799l91900
2343.5H15309823p21753m77254K2530L16560L62158K22206N961k41757m45842o28531
2363.8H13724101o92785o60658o96838p43985o95884n58973m65572m63187m36902l27826
2384.2H07981491k41280k68161l53336l84510l53872l15428l12686l80159m77910m98652
2404.6H04395497m01080l32236m08828n31137n77331n29885m60863m94719o38008p02024
2425G99319386o07907n11408n21362o18398p37548p35045n84065m90725n90444p45893
$$ plain form
2445.4 793176591 792407990 791751206 791203320 790638864 789976776 789241374 788541555 787985682 787490547 786876976
2465.8 786876976 786136925 785427690 784855485 784339190 783718944 782977104 782262325 781696200 781224906 780680895
2486.2 780680895 779985726 779247463 778630674 778153181 777684808 777109861 776441932 775819242 775341690 774944425
2506.6 774944425 774458706 773811340 773134470 772588313 772153258 771675408 771043301 770311952 769671679 769199848
2527 769199848 768728256 768081307 767307580 766570270 765947282 765375257 764707565 763927281 763187826 762576640
2547.4 762576640 762040436 761446714 760722697 759975195 759343863 758803427 758219600 757526398 756780267 756116927
2567.8 756116927 755605578 755108237 754455984 753692925 752977967 752382040 751853883 751263797 750539839 749786198
2588.2 749786198 749159038 748654068 748115838 747413874 746621192 745926142 745343685 744729042 743973911 743102968
$$ packed form
2445.4G93176591p68601o56784n47886n64456o62088p35402o99819n55873m95135o13571
2465.8G86876976p40051p09235n72205n16295o20246p41840p14779n66125m71294n44011
2486.2G80680895o95169p38263o16789m77493m68373n74947o67929o22690m77552l97265
2506.6G74944425m85719o47366o76870n46157m35055m77850o32107p31349o40273m71831
2527G69199848m71592o46949p73727p37310o22988n72025o67692p80284p39455o11186
2547.4G62576640n36204n93722p24017p47502o31332n40436n83827o93202p46131o63340
2567.8G56116927n11349m97341o52253p63059p14958n95927n28157n90086p23958p53641
2588.2G49786198o27160n04970n38230p01964p92682o95050n82457o14643p55131q70943
$$ plain form
2608.6 743102968 742226899 741402864 740584791 739684403 738669991 737591028 736528575 735531688 734530449
2626.9 734530449 733410895 732209325 731042624 729928911 728798509 727596104 726370215 725236118
2643.3 725236118 724202633 723123312 721918166 720650196 719424546 718306661 717224777 716070771
2659.6 716070771 714856923 713658273 712535739 711488724 710430086 709313869 708183050 707108557
2675.9 707108557 706115782 705141187 704136193 703085423 702008724 700999439 700058520 699074268 698032439
2694.3 698032439 696974635 695894659 694801211 693710208 692570806 691328704 690044165 688805699
2710.6 688805699 687625289 686441600 685196400 683906853 682647884 681476414 680348635 679199100
2726.9 679199100 678039849 676915288 675870419 674882650 673850834 672754824 671690226 670715511 669774294
$$ packed form
2608.6G43102968q76069q24035q18073r00388j014412j078963j062453r96887j001239
2626.9G34530449j119554j201570j166701j113713j130402j202405j225889j134097
2643.3G25236118j033485j079321j205146j267970j225650j117885j081884j154006
2659.6G16070771j213848j198650j122534j047015j058638j116217j130819j074493
2675.9G07108557r92775r74595j004994j050770j076699j009285r40919r84252j041829
2694.3F98032439j057804j079976j093448j091003j139402j242102j284539j238466
2710.6F88805699j180410j183689j245200j289547j258969j171470j127779j149535
2726.9F79199100j159251j124561j044869r87769j031816j096010j064598r74715r41217
$$ plain form
2745.2 669774294 668790936 667764783 666754484 665800810 664868772 663905859 662910342 661912501 660923481
2763.6 660923481 659935057 658923149 657840014 656700194 655589461 654514372 653383851 652150512
2779.9 652150512 650835216 649494290 648162961 646797538 645353556 643805504 642189264 640608966
2796.2 640608966 639057338 637434185 635696232 633875549 632046759 630215764 628306568 626280189
2812.5 626280189 624176800 622063518 619925201 617705166 615388393 612985313 610506594 607924402
2828.9 607924402 605195761 602279425 599127054 595701933 591907859 587529600 582379878 576434970
2845.2 576434970 569862545 563118279 556908369 551865101 548234463 545780420 543901265 541880429
2861.5 541880429 539168537 535598874 531379104 526954830 522842109 519378066 516651511 514607370
$$ packed form
2745.2F69774294r83358j026153j010299r53674r32038r62913r95517r97841r89020
2763.6F60923481r88424j011908j083135j139820j110733j075089j130521j233339
2779.9F52150512j315296j340926j331329j365423j443982j548052j616240j580298
2796.2F40608966j551628j623153j737953j820683j828790j830995j909196k026379
2812.5F26280189k103389k113282k138317k220035k316773k403080k478719k582192
2828.9F07924402k728641k916336l152371l425121l794074m378259n149722n944908
2845.2E76434970o572425o744266o209910n043268l630638k454043j879155k020836
2861.5E41880429k711892l569663m219770m424274m112721l464043k726555k044141
$$ plain form
2877.8 514607370 513060808 511766076 510555446 509308815 507914901 506365478 504676461 502802312
2894.1 502802312 500720918 498419225 495884955 493115604 490069330 486647129 482723624 478228122
2910.4 478228122 473140478 467493981 461516052 455608755 450177968 445598811 442181021 440088153
2926.8 440088153 439335883 439817429 441453874 444246531 448089957 452686697 457604438 462386131 466663301
2945.1 466663301 470195055 472884893 474784106 476072639 477073580 478248566 479981184 482443571
2961.4 482443571 485691518 489677995 494329482 499562025 505193889 511016846 516860425 522618711
2977.8 522618711 528189898 533404708 538117945 542292476 545943558 549068987 551630735 553576648
2994.1 553576648 554893732 555585206 555696547 555326521 554529250 553362548 552013338 550690174 549453676
$$ packed form
2877.8E14607370j546562j294732j210630j246631j393914j549423j689017j874149
2894.1E02802312k081394k301693k534270k769351l046274l422201l923505m495502
2910.4D78228122n087644n646497n977929n907297n430787m579157l417790k092868
2926.8D40088153p52270M81546J636445K792657L843426M596740M917741M781693M277170
2945.1D66663301L531754K689838J899213J288533J000941J174986J732618K462387
2961.4D82443571L247947L986477M651487N232543N631864N822957N843579N758286
2977.8E22618711N571187N214810M713237M174531L651082L125429K561748J945913
2994.1E53576648J317084O91474J11341l70026p97271j166702j349210j323164j236498
$$ plain form
3012.4 549453676 548275113 547080994 545758247 544243276 542492688 540455341 538210273 535944402
3028.7 535944402 533754051 531604350 529393315 527061343 524653316 522208452 519689083 517084718
3045.1 517084718 514404893 511668026 508958995 506310761 503680050 501035273 498382211 495802283
3061.4 495802283 493412435 491221845 489170611 487242818 485394955 483572543 481801331 480132937
3077.7 480132937 478514105 476895541 475350291 473889768 472473741 471145123 469906479 468654871
3094 468654871 467332125 465990990 464668572 463324368 461921304 460455984 458930910 457359314 455764174
3112.4 455764174 454126835 452406794 450603336 448747844 446868867 444950044 442944109 440863699
3128.7 440863699 438760787 436637908 434487164 432305872 430100858 427874774 425614357 423325181
$$ packed form
3012.4E49453676j178563j194119j322747j514971j750588k037347k245068k265871
3028.7E35944402k190351k149701k211035k331972k408027k444864k519369k604365
3045.1E17084718k679825k736867k709031k648234k630711k644777k653062k579928
3061.4D95802283k389848k190590k051234j927793j847863j822412j771212j668394
3077.7D80132937j618832j618564j545250j460523j416027j328618j238644j251608
3094D68654871j322746j341135j322418j344204j403064j465320j525074j571596j595140
3112.4D55764174j637339j720041j803458j855492j878977j918823k005935k080410
3128.7D40863699k102912k122879k150744k181292k205014k226084k260417k289176
$$ plain form
3145 423325181 420989990 418615133 416277260 413963228 411573023 409120917 406672210 404248685 401840657
3163.4 401840657 399418890 396987855 394537330 392052561 389574975 387135267 384707093 382284939
3179.7 382284939 379856080 377417296 375028670 372674763 370308012 367973030 365693301 363414049
3196 363414049 361138314 358930618 356798917 354718506 352665246 350594431 348532230 346550882 344612062
3214.3 344612062 342640311 340640157 338680893 336799413 334915131 332970470 331010967 329036176
3230.7 329036176 327016354 324935853 322794199 320630580 318434685 316175461 313880563 311568350
3247 311568350 309197366 306770593 304335147 301873028 299364001 296872616 294452190 292075396 289749533
3265.3 289749533 287526757 285402685 283349037 281421244 279675990 278055280 276547998 275213212
$$ packed form
3145D23325181k335191k374857k337873k314032k390205k452106k448707k423525k408028
3163.4D01840657k421767k431035k450525k484769k477586k439708k428174k422154
3179.7C82284939k428859k438784k388626k353907k366751k334982k279729k279252
3196C63414049k275735k207696k131701k080411k053260k070815k062201j981348j938820
3214.3C44612062j971751k000154j959264j881480j884282j944661j959503j974791
3230.7C29036176k019822k080501k141654k163619k195895k259224k294898k312213
3247C11568350k370984k426773k435446k462119k509027k491385k420426k376794k325863
3265.3B89749533k222776k124072k053648j927793j745254j620710j507282j334786
$$ plain form
3281.6 275213212 274007261 272898167 271913439 271018296 270201087 269506544 268923402 268380553 267869890
3300 267869890 267443627 267102420 266783983 266440868 266116887 265850276 265587687 265330970 265132755 264936864
3320.4 264936864 264675289 264383733 264096171 263811886 263531089 263243020 262947619 262604117 262158811 261660248
3340.8 261660248 261151224 260601431 260043502 259516180 258940995 258250624 257495970 256802380 256218165 255633503
3361.2 255633503 254989117 254365206 253747940 253041357 252246469 251472294 250809699 250239879 249703348 249123305
3381.6 249123305 248548567 248138115 247896567 247661456 247298166 246845618 246473074 246299267 246228948 246015504
3402 246015504 245640039 245400742 245376900 245407984 245443597 245467037 245498642 245636135 245873928 246165156 246593818
3424.4 246593818 247186080 247870803 248587400 249380082 250278980 251114041 251795053 252499998 253386497 254428446
$$ packed form
3281.6B75213212j205951j109094r84728q95143q17209o94543n83142n42849n10663
3300B67869890m26263l41207l18437l43115l23981k66611k62589k56717j98215j95891
3320.4B64936864k61575k91556k87562k84285k80797k88069k95401l43502m45306m98563
3340.8B61660248n09024n49793n57929n27322n75185o90371p54654o93590n84215n84662
3361.2B55633503o44386o23911o17266p06583p94888p74175o62595n69820n36531n80043
3381.6B49123305n74738m10452k41548k35111l63290m52548l72544j73807p0319k13444
3402B46015504l75465k39297k3842L1084L5613K3440L1605J37493K37793K91228M28662
3424.4B46593818N92262O84723P16597P92682Q98898Q35061O81012P04945Q86499J041949
$$ plain form
3444.8 254428446 255569816 256748229 257946163 259184152 260482609 261908710 263476551 265049011
3461.1 265049011 266607732 268334895 270216972 271968514 273469537 274990529 276744843 278726846
3477.4 278726846 280784160 282743335 284690171 286745250 288814306 290847123 292910904 295024335
3493.8 295024335 297218710 299450070 301685899 303945750 306143880 308276176 310503960 312900722
3510.1 312900722 315414041 317915559 320297539 322658002 325146168 327810735 330476910 332997978
3526.4 332997978 335541785 338270128 341125578 344079405 347097635 350073129 353086233 356198281
3542.7 356198281 359350830 362463683 365554243 368717045 372024477 375430614 378854841 382390320
3559 382390320 386010855 389465600 392759800 396524578 400964886 405379921 409554422 413773447 418089449
$$ packed form
3444.8B54428446J141370J178413J197934J237989J298457J426101J567841J572460
3461.1B65049011J558721J727163J882077J751542J501023J520992J754314J982003
3477.4B78726846K057314J959175J946836K055079K069056K032817K063781K113431
3493.8B95024335K194375K231360K235829K259851K198130K132296K227784K396762
3510.1C12900722K513319K501518K381980K360463K488166K664567K666175K521068
3526.4C32997978K543807K728343K855450K953827L018230K975494L013104L112048
3542.7C56198281L152549L112853L090560L162802L307432L406137L424227L535479
3559C82390320L620535L454745L294200L764778M440308M415035M174501M219025M316002
$$ plain form
3577.4 418089449 422468722 426943958 431371719 435623616 440057784 444990456 449884981 454547495
3593.7 454547495 459373832 464443773 469535500 474591047 479512930 484117150 488698363 493579745
3610 493579745 498650014 503776610 508707702 513578534 518970490 524499774 529438794 533656836 537931323
3628.4 537931323 543236136 548708916 553769588 558616757 563289821 567851186 572238207 576107442
3644.7 576107442 579412282 583117247 588056207 593054414 597271919 601450384 605885625 609952748
3661 609952748 613547981 616848707 619636416 622105300 625078857 627993524 630569577 633998156 637820184
3679.4 637820184 641161978 644054234 646447778 648343742 650256515 652809978 655687630 658265889
3695.7 658265889 660322785 661896944 663408220 665320218 667197406 668430328 669182539 670351207
$$ packed form
3577.4D18089449M379273M475236M427761M251897M434168M932672M894525M662514
3593.7D54547495M826337N069941N091727N055547M921883M604220M581213M881382
3610D93579745N070269N126596M931092M870832N391956N529284M939020M218042M274487
3628.4E37931323N304813N472780N060672M847169M673064M561365M387021L869235
3644.7E76107442L304840L704965M938960M998207M217505M178465M435241M067123
3661F09952748L595233L300726K787709K468884K973557K914667K576053L428579L822028
3679.4F37820184L341794K892256K393544J895964J912773K553463K877652K578259
3695.7F58265889K056896J574159J511276J911998J877188J232922P52211J168668
$$ plain form
3712 670351207 672433078 674606979 676251709 677461088 678515673 679567635 680740118 682093441 683112025
3730.3 683112025 683491588 683893681 685144007 687029898 688446760 688564181 688353419 689460218 690575361
3748.7 690575361 691065729 692421556 694396019 695764005 696614265 697701752 698865294 699645460 700245500
3767.1 700245500 700887501 701812267 703028798 704071224 704739571 705243289 705933869 706726551 707462609
3785.4 707462609 708291590 709169686 709913969 710342646 710489154 710700512 710805714 710996568 711967707 712939203
3805.8 712939203 713720620 714863360 715818822 715922892 715608478 715740979 715901017 716390729 717607915
3824.2 717607915 718631148 719289660 719672978 719842672 720082998 720156372 720130861 720661223 721601486 722600341
3844.6 722600341 723548889 724094510 723597825 722122490 722063243 723865986 725327849 725820184 725763798
$$ packed form
3712F70351207K081871K173901J644730J209379J054585J051962J172483J353323J018584
3730.3F83112025L79563M02093J250326J885891J416862J17421k10762J106799J115143
3748.7F90575361M90368J355827J974463J367986Q50260J087487J163542P80166O00040
3767.1G00245500O42001R24766J216531J042426O68347N03718O90580P92682P36058
3785.4G07462609Q28981Q78096P44283M28677J46508K11358J05202J90854R71139R71496
3805.8G12939203P81417J142740R55462J04070l14414J32501J60038M89712J217186
3824.2G17607915J023233O58512L83318J69694K40326P3374k5511N30362R40263R98855
3844.6G22600341R48548N45621m96685j475335n9247J802743J461863M92335n6386
$$ plain form
3862.9 725763798 725869596 726179123 726183474 726354063 727051139 727919221 728625715 728777230 728880048 729255378
3883.3 729255378 729521155 729998231 730397046 730418205 730825663 731475234 731510937 731009245 730646849 730822027
3903.7 730822027 731619716 732610226 733260810 733560085 733657181 733545899 733461559 733715832 734040499 734166265
3924.1 734166265 734364808 734664381 734749973 734786928 735128045 735596955 735873044 735910952 735902309 736065567
3944.5 736065567 736268640 736370683 736582160 736929417 737185478 737304032 737407207 737545788 737688243 737844288
3964.9 737844288 738024473 738186538 738303304 738403916 738563836 738825142 739102483 739320338 739483356 739573717
3985.3 739573717 739593089 739623368 739751577 739951849 740174055 740406692
3997.5 740406692
$$ packed form
3862.9G25763798J05798L09527M351J70589O97076Q68082P06494J51515J02818L75330
3883.3G29255378K65777M77076L98815K1159M07458O49571L5703n01692l62396J75178
3903.7G30822027P97689R90510O50584K99275R7096j11282q4340K54273L24667J25766
3924.1G34166265J98543K99573Q5592L6955L41117M68910K76089L7908q643J63258
3944.5G36065567K03073J02043K11477L47257K56061J18554J03175J38581J42455J56045
3964.9G37844288J80185J62065J16766J00612J59920K61306K77341K17855J63018R0361
3985.3G39573717J9372L0279J28209K00272K22206K32637
3997.5G40406692
##END=$$ End of the data block
