##TITLE=G23-51-CE $$ Begin of the data block
##JCAMP-DX=5.00 $$ ACD/SpecManager v 10.08
##SPECTROMETER/DATA SYSTEM=Alpha
##DATE=23 Oct 2013 10:11:40
##DATA TYPE=INFRARED SPECTRUM
##DATA CLASS=XYDATA
##ORIGIN=
##OWNER=
##NPOINTS=1765
##FIRSTX=399.75695801
##LASTX=3997.56933594
##MAXX=3997.56933594
##MINX=399.75695801
##MAXY=0.81893677
##MINY=0.24505667
##XFACTOR=1.0000000000
##YFACTOR=1.000000000000000e-9
##FIRSTY=0.52572078
##DELTAX=2.03957629
##XUNITS=1/CM
##YUNITS=ARBITRARY UNITS
##XYDATA=(X++(Y..Y))
399.8E25720775k153516k463221j857341o49929M01616N95809J86383m06623j051604
$$ 525720775 523567259 521104038 519246697 518596768 518998384 519594193 519780576 519373953 518322349
418.1E18322349r07123q79825j516103j429022j141071j520217j901209j997888j564503
$$ 518322349 517415226 516535401 515019298 513590276 512449205 510928988 509027779 507029891 505465388
436.5E05465388j35123J347243J653612R96709O98388Q55922M20392n59986j318931
$$ 505465388 505330265 506677508 508331120 509327829 510026217 510882139 511302531 510742545 509423614
454.8E09423614j599968j576841j723110k278865k709180k561390k100170j914978
$$ 509423614 507823646 506246805 504523695 502244830 499535650 496974260 494874090 492959112
471.1D92959112k076238k084852j696288j022607o42717q42631r97037j041740j323938
$$ 492959112 490882874 488798022 487101734 486079127 485436410 484593779 483596742 482555002 481231064
489.5D81231064j481891j515389j783162k089351k315134k500385k518565k683907
$$ 481231064 479749173 478233784 476450622 474361271 472046137 469545752 467027187 464343280
505.8D64343280l039480k944201k742469k943903k930880k521276k128125j686752
$$ 464343280 461303800 458359599 455617130 452673227 449742347 447221071 445092946 443406194
522.1D43406194j242160q78066l35545K96861R28581J531482J973092K354056K471179
$$ 443406194 442164034 441285968 440950423 441247284 442175865 443707347 445680439 448034495 450505674
540.5D50505674J995772J169145L34501l45617o43343p92026j170218j642079k006292
$$ 450505674 452501446 453670591 454005092 453659475 453016132 452224106 451053888 449411809 447405517
558.8D47405517k102196k027929k116561k478927k613157j986832q66353K17139J091898
$$ 447405517 445303321 443275392 441158831 438679904 436066747 434079915 433213562 433430701 434522599
577.2D34522599J856238K498537K970785L123790K783030K033532J254886P30962M80771
$$ 434522599 436378837 438877374 441848159 444971949 447754979 449788511 451043397 451774359 452255130
595.6D52255130L12239N4985m9084N8800J58071K27958K99513L36349M70609P67439
$$ 452255130 452567369 452622354 452573270 452632070 452790141 453018099 453317612 453653961 454124570 454892009
616D54892009J077563J433194J983464K600669K933830K942235K737194K454340K295614
$$ 454892009 455969572 457402766 459386230 461986899 464920729 467862964 470600158 473054498 475350112
634.3D75350112K205908K018780J775980J556605J397341J240015R97335P47174N33074
$$ 475350112 477556020 479574800 481350780 482907385 484304726 485544741 486542076 487289250 487822324
652.7D87822324L44336L58701N00619M34250K90960L52293P95931J473695J256436
$$ 487822324 488166660 488525361 489025980 489460230 489751190 490103483 490899414 492373109 493629545
671D93629545J103193J418858J689971J792997J692772J315832R54807Q46028Q10683
$$ 493629545 494732738 496151596 497841567 499634564 501327336 502643168 503597975 504444003 505254686
689.4E05254686M94778k50936r68992j107514o04808J54912P68840J153827J613677
$$ 505254686 505749464 505498528 504529536 503422022 502817214 502972126 503740966 504894793 506508470
707.7E06508470K299964K902091L252983L442704L683985M232168M755974M804194
$$ 506508470 508808434 511710525 514963508 518406212 522090197 526322365 531078339 535882533
724E35882533M522144M104197L845275L667891L091872K196669J436651J117229J039565
$$ 535882533 540404677 544508874 548354149 552022040 555113912 557310581 558747232 559864461 560904026
742.4E60904026O91116J728m36663m17888l97087p30037j282156j577079j240671m32014
$$ 560904026 561595142 561596870 561160207 560742319 560345232 559615195 558333039 556755960 555515289 555083275
762.8E55083275M12583J289845K301693L456533M618406N340636N358696M971623M536688
$$ 555083275 555495858 556785703 559087396 562543929 567162335 572502971 577861667 582833290 587369978
781.2E87369978M059554L558754L034592K430141J916170J866877K278209K777159
$$ 587369978 591429532 594988286 598022878 600453019 602369189 604236066 606514275 609291434
797.5F09291434L100813L256678L315330L255367L028214K454162J670897J061499
$$ 609291434 612392247 615648925 618964255 622219622 625247836 627701998 629372895 630434394
813.8F30434394P02023M18961l159o90937j469016k064764k380073k471268k548457
$$ 630434394 631136417 631555378 631552219 630861282 629392266 627327502 624947429 622476161 619927704
832.1F19927704k714753k900660k859473k555728k370238k293229j966298j441300
$$ 619927704 617212951 614312291 611452818 608897090 606526852 604233623 602267325 600826025
848.5F00826025r75072o59228n97477o92963l13580J023888L016472M820645N817533
$$ 600826025 599850953 599191725 598594248 597901285 597587705 598611593 601628065 606448710 612266243
866.8F12266243O205022O173014N389452L832162J916170K3186j600206k927482m068255
$$ 612266243 618471265 624644279 630033731 633865893 635782063 635805249 634205043 631277561 627209306
885.2F27209306m891992n163908m985332m725516m618705m672825m803777n026221
$$ 627209306 622317314 617153406 612168074 607442558 602823853 598151028 593347251 588321030
901.5E88321030n477190o136894o794214p212580p297337p143676o754756n960405
$$ 588321030 582843840 576706946 569912732 562700152 555402815 548259139 541504383 535543978
917.8E35543978m762709l389776k112567j219332q09312o09219l16978k5034O0261
$$ 535543978 530781269 527391493 525278926 524059594 523250282 522641063 522324085 522299051 522359312
936.2E22359312J3709q4699n22434j792729l955603o421268q448064r689063j0321856
$$ 522359312 522373021 522288322 521765888 519973159 516017556 509596288 501148224 491459161 481137305
954.5D81137305j0660618j0869533j1039138j1215120j1352182j1312127j0972947
$$ 481137305 470476687 459607154 448568016 437352896 426000714 414688587 403715640
968.8D03715640j0390460r629488q635551p368296n942107m571050l384203k453088
$$ 403715640 393325180 383695692 375060141 367691845 361749738 357178688 353794485 351341397
985.1C51341397j782626j353681j112879r95785q84533n87552j48178K43128L96311
$$ 351341397 349558771 348205090 347092211 346096426 345211893 344624341 344476163 344719291 345115602
1003.5C45115602J81347l33011r41902j468301j820088j930266j855433j783192j819820
$$ 345115602 345296949 344963938 344022036 342553735 340733647 338803381 336947948 335164756 333344936
1021.8C33344936j949221k113550k226264k248466k227694k232551k329916k457708
$$ 333344936 331395715 329282165 327055901 324807435 322579741 320347190 318017274 315559566
1038.1C15559566k421260k259672k108991j904875j552194r95368k78711M45455J065910
$$ 315559566 313138306 310878634 308769643 306864768 305312574 304317206 304038495 304483950 305549860
1056.5C05549860J579642K038300K466083K729833K504319J454890j91570j422017
$$ 305549860 307129502 309167802 311633885 314363718 316868037 318322927 318131357 316709340
1072.8C16709340j407773l18139J143664K514362L641039M454404M905045N028248
$$ 316709340 315301567 314983428 316127092 318641454 322282493 326736897 331641942 336670190
1089.1C36670190M882902M507184L991306L383040K661854J915306J423389J386166
$$ 336670190 341553092 346060276 350051582 353434622 356096476 358011782 359435171 360821337
1105.4C60821337J733332K211392K580434K818883K944350K858877K542824K133757
$$ 360821337 362554669 364766061 367346495 370165378 373109728 375968605 378511429 380645186
1121.8C80645186J822203J759410K025962K547324K951592K852052K281249J510739
$$ 380645186 382467389 384226799 386252761 388800085 391751677 394603729 396884978 398395717
1138.1C98395717O86288p7933o33121q85963q34823o13838l04610J38969P58171J548171
$$ 398395717 399082005 399004072 398370951 397484988 396650165 396036327 395731717 395870686 396628857 398177028
1158.5C98177028K457529L360122M087538M588306N020946N590439O299287O950021
$$ 398177028 400634557 403994679 408082217 412670523 417691469 423281908 429581195 436531216
1174.8D36531216P367134P561088P600575P463306P067949O378621N458981M376262
$$ 436531216 443898350 451459438 459060013 466523319 473591268 479969889 485428870 489805132
1191.1D89805132L142864J873731P58887p6503n62549p87466q50141p04021l47107
$$ 489805132 492947996 494821727 495580614 495504111 494941562 494154096 493303955 492599934 492252827
1209.5D92252827L2842K01315J17242o7145k78622n98043j026690j459390j770377
$$ 492252827 492285669 492486984 492604226 492537081 492258459 491660416 490633726 489174336 487403959
1227.8D87403959j900107j888513j780302j520484j105100o04481l1650N68122J129538
$$ 487403959 485503852 483615339 481835037 480314553 479209453 478604972 478573322 479141444 480270982
1246.2D80270982J623064K037287K320021K444446K432645K359181K312213K267570
$$ 480270982 481894046 483931333 486251354 488695800 491128445 493487626 495799839 498067409
1262.5D98067409K206832K187371K220750K209008K044678J707494J303434R93073
$$ 498067409 500274241 502461612 504682362 506891370 508936048 510643542 511946976 512940049
1278.8E12940049R43899J112342J223564J161516R99034P75337L95775j73450q06272
$$ 512940049 513883948 514996290 516219854 517381370 518380404 519155741 519551516 519378066 518571794
1297.2E18571794j331687j669884j828074j884163j917362j884162j686216j254916
$$ 518571794 517240107 515570223 513742149 511857986 509940624 508056462 506370246 505115330
1313.5E05115330p07626k22087J31369K55704J4603n51641j294494k027333k515167
$$ 505115330 504407704 504185617 504316986 504572690 504587293 504035652 502741158 500713825 498198658
1331.8D98198658k632618k404630j974344j401276q47756n76616n74976p32779j027883
$$ 498198658 495566040 493161410 491187066 489785790 488938034 488361418 487786442 487053663 486025780
1350.2D86025780j395374j716405j910568k088040k532392l156662l551186l761321
$$ 486025780 484630406 482914001 481003433 478915393 476383001 473226339 469675153 465913832
1366.5D65913832l797918l349930l042162l213704l384202l626734l981650m052371
$$ 465913832 462115914 458765984 455723822 452510118 449125916 445499182 441517532 437465161
1382.8D37465161l627300k714098j396537n01185m01825m23580j68830J68323O06328
$$ 437465161 433837861 431123763 429727226 429226041 428824216 428400636 428231806 428400129 429006457
1401.2D29006457J007527J403511J718432J771271J787096J839936J842022J934081
$$ 429006457 430013984 431417495 433135927 434907198 436694294 438534230 440376252 442310333
1417.5D42310333K510607K888322K809048K680570K219915J558662R48041K63393l13788
$$ 442310333 444820940 447709262 450518310 453198880 455418795 456977457 457925498 458188891 457875103
1435.9D57875103n9873N20915O26534N80102N59598N99563N67466K51741Q2463R11206
$$ 457875103 457815230 458336145 458962679 459542781 460102379 460701942 461269408 461521149 461603612 462514818
1456.2D62514818K997517L808201L285080L242850L977806M782229N979568Q279353
$$ 462514818 465512335 469320536 472605616 475848466 479826272 484608501 490588069 498867422
1472.6D98867422R351462Q158207O492198M757702L029228J117229q54313k563835
$$ 498867422 508218884 516377091 522869289 527626991 530656219 531773448 530919135 528355300
1488.9E28355300l576457m028857n286634o851852o642937n805850n996049q392036
$$ 528355300 524778843 520749986 515463352 508611500 501968563 496162713 490166664 481774628
1505.2D81774628j1561394r602993p812918q048683p498771n758047l780574l080278
$$ 481774628 470213234 460610241 452797323 444748640 437249869 431491822 427711248 424630970
1521.5D24630970k893836k892643l147840k919823k945125l027708k260804j984358
$$ 424630970 421737134 418844491 415696651 412776828 409831703 406803995 404543191 402558833
1537.8D02558833k310693j059413O27369J445979J971364K572506L214151L595710
$$ 402558833 400248140 399188727 399816096 401262075 403233439 405805945 409020096 412615806
1554.1D12615806L486186M181296N951494M984379L724783L230214K854020K825856
$$ 412615806 416101992 420283288 426234782 431219161 434943944 438174158 441028178 443854034
1570.5D43854034K329320J515567J364768J471579J018971L75598k8759l32057o83099
$$ 443854034 446183354 447698921 449063689 450535268 451554239 451929837 451901078 451569021 450885922
1588.8D50885922j212329j820445k481610l128349l852964m724502n561620o330699
$$ 450885922 449673593 447853148 445371538 442243189 438390225 433665723 428104103 421773404
1605.1D21773404p134974q049339q613348q841485j0056645j1684477j0396689j0033488
$$ 421773404 414638430 406589091 397975743 389134258 379077613 367393136 356996447 346962959
1621.4C46962959j1826396j1802972j0990947j0527313r289026q787185r058476o270677
$$ 346962959 335136563 323333591 312342644 301815331 292526305 283739120 274680644 268409967
1637.8B68409967k924561j368016m85867L78221J511872J825720K114653L768802M363835
$$ 268409967 265485406 264117390 263631523 264009744 265521616 267347336 269461989 273230791 277594626
1656.1B77594626M218280M904837O200075P259548P098227P654608Q973360Q678972
$$ 277594626 281812906 286717743 292917818 300177366 307275593 314930201 323903561 332582533
1672.4C32582533Q937389R963214R556026Q882820R753585J2943119J3168514J1832624
$$ 332582533 341519922 351483136 361039162 369921982 379675567 392618686 405787200 417619824
1688.8D17619824J2840063J3343841J5516430J7839461J7808259J9458294J6520977
$$ 417619824 430459887 443803728 459320158 477159619 494967878 514426172 530947149
1703E30947149J3303280J2856602J1062205R046316P461191O374716O509900O586969
$$ 530947149 544250429 557107031 568169236 577215552 584676743 591051459 597561359 604148328
1719.3F04148328N424023M335940L744423L123462K641440K167404K317488L220916
$$ 604148328 609572351 613908291 617652714 620776176 623417616 625585020 627902508 631123424
1735.7F31123424L199517L171683L763973M251361M564226M987001N939305O963015
$$ 631123424 634322941 637494624 641258597 645509958 650074184 655061185 661000490 667963505
1752F67963505O614268O009221N843758N494654N542696N372405M569471L957450L648162
$$ 667963505 674577773 680586994 686430752 691925406 697468102 702840507 707409978 711367428 715015590
1770.3G15015590L887773M210055L666818K991974K727330K644777K477825K264917
$$ 715015590 718903363 723113418 726780236 729772210 732499540 735144317 737622142 739887059
1786.7G39887059J854419J434505J816631K281248J923919J472116J600325J926481
$$ 739887059 741741478 743175983 744992614 747273862 749197781 750669897 752270222 754196703
1803G54196703J810432J405954J161635J344562J578271J462042J222671J153469J091361
$$ 754196703 756007135 757413089 758574724 759919286 761497557 762959599 764182270 765335739 766427100
1821.3G66427100R60529R61899R13203Q44657J236260J460195J116455Q57055P48515
$$ 766427100 767387629 768349528 769262731 770107388 771343648 772803843 773920298 774777353 775525868
1839.7G75525868M41074L15786Q77261J186252R44018P40409O75380O74307O37174
$$ 775525868 775966942 776282728 777159989 778346241 779290259 780030668 780706048 781380355 782017529
1858G82017529N86391N13017L87370J83046K06649O73712R06348P19309N92887N97716
$$ 782017529 782603920 783116937 783504307 783687353 783894002 784567714 785474062 786193371 786786258 787383974
1878.4G87383974N45859M55618M18663M07457M04000N63264O19829M31359L93450M94301
$$ 787383974 787929833 788385451 788804114 789211571 789615571 790178835 790798664 791230023 791623473 792117774
1898.8G92117774N34714M32074K28822J23680K37226M47393M50670J47164o6697K01285
$$ 792117774 792652488 793084562 793313384 793437064 793674290 794121683 794572353 794719517 794652820 794854105
1919.2G94854105M50193M12047L53992K39790J91688K99275L46482K13504M3392n5492
$$ 794854105 795304298 795716345 796070337 796310127 796501815 796801090 797147572 797361076 797404468 797348976
1939.6G97348976n543K64108M09067K41220J04725J78635K92599K84791J60993Q5234
$$ 797348976 797343433 797607541 798016608 798257828 798362553 798541188 798833787 799118578 799279571 799364805
1960G99364805J57714K34187J90735J49369J25170J06990K01344K79129K00093M9054
$$ 799364805 799522519 799756706 799947441 800096810 800221980 800328970 800530314 800809443 801009536 801058590
1980.4H01058590J8418J14203J64628O3061r5427n3763J59800K46525J56939J8060
$$ 801058590 801077008 801191211 801355839 801418900 801323473 801269710 801429510 801676035 801832974 801851034
2000.8H01851034q0466n1618K5690K0325o8724j91331k77698k16544q0406q4222j87337
$$ 801851034 801770568 801718950 801744640 801764965 801696241 801504910 801227212 801010668 800930262 800846040 800658703
2023.2H00658703k60234k39790j54376j19447k17140l20911k72274j54257q2433q7977
$$ 800658703 800398469 800158679 800004303 799884856 799667716 799346805 799074531 798920274 798837841 798749864
2043.6G98749864j46449j91390j27137r358L3737m888l8564J9550J22666J54257R2328
$$ 798749864 798603415 798412025 798284888 798275530 798309267 798304379 798265815 798285365 798408031 798562288 798654616
2066.1G98654616J8656J1385R7036J84298J59680L9816j6570O1274J60098J62721O4730
$$ 798654616 798673272 798684657 798781693 798965991 799125671 799165487 799148917 799210191 799370289 799533010 799597740
2088.5G99597740K7895J27673K31803K09152R9838N0664J31667K13265J87695J03712
$$ 799597740 799625635 799753308 799985111 800194263 800294101 800344765 800476432 800689697 800877392 800981104
2108.9H00981104M0412R2686K10762K32935J23322L0875N6207J45674J76668Q3268
$$ 800981104 801021516 801114202 801324964 801557899 801681221 801712096 801768303 801913977 802090645 802173913
2129.3H02173913K682O2346J61410J64151J03116M1246L9458J24753K01404J87159
$$ 802173913 802176595 802238941 802400351 802564502 802667618 802708864 802748322 802873075 803074479 803261638
2149.7H03261638J31249J41740J92225K11835K24411K43426K45094K64645L21686L61740
$$ 803261638 803392887 803534627 803726852 803938687 804163098 804406524 804651618 804916263 805237949 805599689
2170.1H05599689L68357L70145L71277L60668L61621L75033L77059L69966L70622L69191
$$ 805599689 805968046 806338191 806709468 807070136 807431757 807806790 808183849 808553815 808924437 809293628
2190.5H09293628L49223L29972L12090L03864L25084L51131L43203K98977K72811K93433
$$ 809293628 809642851 809972823 810284913 810588777 810913861 811264992 811608195 811907172 812179983 812473416
2210.9H12473416L21091L15487K91169K74121K59579K57015K63154K38896J94788J62244
$$ 812473416 812794507 813109994 813401163 813675284 813934863 814191878 814455032 814693928 814888716 815050960
2231.3H15050960J75297K21431J93715J08242Q5950J33276J60456J42157J09851R5845
$$ 815050960 815226257 815447688 815641403 815749645 815835595 815968871 816129327 816271484 816381335 816477180
2251.7H16477180J34289J77860J30296L2127L7372J13249J55091J49965R6500M8995
$$ 816477180 816611469 816789329 816919625 816951752 816989124 817102373 817257464 817407429 817503929 817552924
2272.1H17552924O7413J22547Q1182o438m530L9936O1094M9174J8716j7047l934O9499
$$ 817552924 817620337 817742884 817824066 817817628 817813098 817853034 817914128 817963302 817982018 817964971 817961037 818030536
2296.5H18030536J14083P8142K8849K6583M6313O9142P5876L9697M2677J24872J45912
$$ 818030536 818144619 818222761 818251610 818278193 818324506 818393648 818469524 818509221 818551898 818676770 818822682
2319H18822682Q3148L0935j1384k9922J4544l2664j98960k08139j26541j39296k34902
$$ 818822682 818905830 818936765 818925381 818895459 818910003 818877339 818678379 818470240 818343699 818204403 817969501
2341.4H17969501m87626p23123m64618L8921L77000M61519L48210Q9347l35157o21676
$$ 817969501 817481875 816758752 816294134 816333055 816710055 817171574 817519784 817609131 817273974 816652298
2361.8H16652298n91457n39422o74128q10624p82132o38187n45919n68211n80728m97877
$$ 816652298 816060841 815521419 814847291 814036667 813254535 812616348 812070429 811502218 810921490 810423613
2382.2H10423613l39032k18808k60234l81351m22775l80874k91050k54035l52323m66764
$$ 810423613 810084581 809865773 809605539 809224188 808801413 808420539 808129489 807875454 807523131 807056367
2402.6H07056367m80532m01020l56198m34935n51760n82039n08786m33445m76837o37948
$$ 807056367 806575835 806174815 805818617 805383682 804831922 804249883 803741097 803307652 802830815 802192867
2423H02192867p39932o69658n37634n00918n96940p19548p10666n81622n10037n97596
$$ 802192867 801452935 800783277 800245643 799744725 799147785 798428237 797717571 797135949 796625912 796028316
2443.4G96028316p49469p73728o32465n04612n52714o91414p51257o80745n48482n30660
$$ 796028316 795278847 794505119 793872654 793368042 792815328 792123914 791372657 790691912 790143430 789612770
2463.8G89612770o66499p43091o55413n45144n30600o22392p28190p05183n62906m80592
$$ 789612770 788946271 788203180 787547767 787002623 786472023 785849631 785121441 784416258 783853352 783372760
2484.2G83372760n71728p15673p27832n82755m26411m35472n87463o79016o03080m57228
$$ 783372760 782801032 782085359 781357527 780774772 780348361 779912889 779325426 778646410 778043330 777586102
2504.6G77586102m13179n27859o54041o29068m98950m39227n23269o68645p20978n91695
$$ 777586102 777172923 776645064 775991023 775361955 774863005 774423778 773900509 773231864 772510886 771919191
2525G71919191m37260m88817o78659p73132p05242n63443n38349p09712q48234p74443
$$ 771919191 771481931 770993114 770314455 769541323 768836081 768272638 767734289 767024577 766176343 765401900
2545.4G65401900n89967m95732n94795p38740p24613o11723n61058n96106o65426o96004
$$ 765401900 764811933 764316201 763721406 762982666 762258053 761646330 761085272 760489166 759823740 759127736
2565.8G59127736o34968n37992n38885o73473p76410p01309n56111n28872o35147p39932
$$ 759127736 758492768 757954776 757415891 756742418 755966008 755264699 754708588 754179716 753544569 752804637
2586.2G52804637p18534n96404n29349n83649o85930p39336o65367n62310o33240q17120
$$ 752804637 752086103 751489699 750960350 750376701 749690771 748951435 748286068 747723758 747090518 746273398
2606.6G46273398q82208q20637p92205q49664r39310r96291j014591j003146r83357
$$ 746273398 745391190 744570553 743778348 742928684 741989374 740993083 739978492 738975346 737991989
2624.9G37991989j040340j154899j186848j134992j093507j116395j198947j226604
$$ 737991989 736951649 735796750 734609902 733474910 732381403 731265008 730066061 728839457
2641.2G28839457j143873j070976j104295j187921j225769j187504j128435j122236
$$ 728839457 727695584 726624608 725520313 724332392 723106623 721919119 720790684 719668448
2657.5G19668448j169264j214028j200497j117885j031816j033783j083672j086831
$$ 719668448 718499184 717285156 716084659 714966774 713934958 712901175 711817503 710730672
2673.9G10730672j045048j020015j021981j001537j007080j041889j009345r44257
$$ 710730672 709685624 708665609 707643628 706642091 705635011 704593122 703583777 702639520
2690.2G02639520r57370j039445j110613j115501j067937j076698j160264j228333
$$ 702639520 701682150 700642705 699532092 698416591 697348654 696271956 695111692 693883359
2706.5F93883359j238763j210272j192808j228929j287281j292229j220763j143396
$$ 693883359 692644596 691434324 690241516 689012587 687725306 686433077 685212314 684068918
2722.8F84068918j134932j142442j125693j093150j037955j007974j044273j092017
$$ 684068918 682933986 681791544 680665851 679572701 678534746 677526772 676482499 675390482
2739.1F75390482j039326r37581r27449r84609j028657j026988r82225r43243r62973
$$ 675390482 674351156 673413575 672486126 671501517 670472860 669445872 668463647 667520404 666557431
2757.5F66557431j019001j035034r95875r68695r88721j037598j089633j094520j082480
$$ 666557431 665538430 664503396 663507521 662538826 661550105 660512507 659422874 658328354 657245874
2775.8F57245874j146495j252711j305222j309157j326561j363277j412630j505554
$$ 657245874 656099379 654846668 653541446 652232289 650905728 649542451 648129821 646624267
2792.2F46624267j586497j571476j567006j663149j760423j801610j819968j864553
$$ 646624267 645037770 643466294 641899288 640236139 638475716 636674106 634854138 632989585
2808.5F32989585j926899j989603k074539k127946k149522k213240k315700k411663
$$ 632989585 631062686 629073083 626998544 624870598 622721076 620507836 618192136 615780473
2824.8F15780473k493263k602458k758562k951682l173113l443360l823221m390001
$$ 615780473 613287210 610684752 607926190 604974508 601801395 598358035 594534814 590144813
2841.1E90144813n150378n958080o588161o778419o284177n101383l629625k455294
$$ 590144813 584994435 579036355 572448194 565669775 559385598 554284215 550654590 548199296
2857.4E48199296j933932k085805k731383l567159m242003m466415m144907l477633
$$ 548199296 546265364 544179559 541448176 537881017 533639014 529172599 525027692 521550059
2873.7E21550059k751350k079725j547933j263916j203835j297772j469076j590908
$$ 521550059 518798709 516718984 515171051 513907135 512703300 511405528 509936452 508345544
2890.1E08345544j670658j841426k095938k330661k545982k795577l082663l429800
$$ 508345544 506674886 504833460 502737522 500406861 497860879 495065302 491982639 488552839
2906.4D88552839l911168m503399n105257n631387n930722n901605n486220m595339
$$ 488552839 484641671 480138272 475033015 469401628 463470906 457569301 452083081 447487742
2922.7D47487742l368974k080590q08179M61340J678318K809405L819823M560560M871518
$$ 447487742 444118768 442038178 441229999 441691339 443369657 446179062 449998885 454559445 459430963
2941D59430963M751205M312694L621966K770454J942575J287013R85145J208425J811832
$$ 459430963 464182168 468494862 472116828 474887282 476829857 478116870 479102015 480310440 482122272
2959.4D82122272K532780L302962M055321M713118N261183N648792N854070N901814
$$ 482122272 484655052 487958014 492013335 496726453 501987636 507636428 513490498 519392312
2975.7E19392312N855619N694509N302250M759074M236638L720701L160238K592743
$$ 519392312 525247931 530942440 536244690 541003764 545240402 548961103 552121341 554714084
2992E54714084K006054J374423P44701J72317l27051p65741j102328j266957j280844
$$ 554714084 556720138 558094561 558839262 559011579 558684528 557918787 556816459 555549502 554268658
3010.4E54268658j223206j169622j194597j300811j472950j743734k042234k214492
$$ 554268658 553045452 551875830 550681233 549380422 547907472 546163738 544121504 541907012
3026.7E41907012k224504k171159k156079k213597k318740k411247k465188k523601
$$ 541907012 539682508 537511349 535355270 533141673 530822933 528411686 525946498 523422897
3043E23422897k597630k669513k701760k681493k678216k671838k619087k574027k504677
$$ 523422897 520825267 518155754 515453994 512772501 510094285 507422447 504803360 502229333 499724656
3061.4D99724656k376884k274215k148748j962095j833707j793772j775861j716047
$$ 499724656 497347772 495073557 492924809 490962714 489129007 487335235 485559374 483843327
3077.7D83843327j642108j604051j571506j507431j408756j305282j244903j251280
$$ 483843327 482201219 480597168 479025662 477518231 476109475 474804193 473559290 472308010
3094D72308010j295954j328498j341343j391143j462161j487553j515717j577019j613677
$$ 472308010 471012056 469683558 468342215 466951072 465488911 464001358 462485641 460908622 459294945
3112.4D59294945j667261j744777j768828j821905j946360k020716k027542k039879
$$ 459294945 457627684 455882907 454114079 452292174 450345814 448325098 446297556 444257677
3128.7D44257677k085388k130926k153754k191991k215802k224773k296418k383113
$$ 444257677 442172289 440041363 437887609 435695618 433479816 431255043 428958625 426575512
3145D26575512k385497k294660k238750k351195k516419k543270k473027k412259k403856
$$ 426575512 424190015 421895355 419656605 417305410 414788991 412245721 409772694 407360435 404956579
3163.4D04956579k449453k492427k494246k459735k434403k477169k549439k509565
$$ 404956579 402507126 400014699 397520453 395060718 392626315 390149146 387599707 385090142
3179.7C85090142k414047k411425k428890k397686k376586k379179k359361k331525
$$ 385090142 382676095 380264670 377835780 375438094 373061508 370682329 368322968 365991443
3196C65991443k294302k212405k140611k105713k081275k099961k117038k052486j977235
$$ 365991443 363697141 361484736 359344125 357238412 355157137 353057176 350940138 348887652 346910417
3214.3C46910417j966894j982480j990676j981586j960188j968116j997292k029180
$$ 346910417 344943523 342961043 340970367 338988781 337028593 335060477 333063185 331034005
3230.7C31034005k067447k120465k176076k211660k237380k256095k290637k339691
$$ 331034005 328966558 326846093 324670017 322458357 320220977 317964882 315674245 313334554
3247C13334554k389103k444565k477020k475858k462178k454579k464056k443522k350957
$$ 313334554 310945451 308500886 306023866 303548008 301085830 298631251 296167195 293723673 291372716
3265.3B91372716k238750k137721k031237j910567j784861j682788j569003j414984
$$ 291372716 289133966 286996245 284965008 283054441 281269580 279586792 278017789 276602805
3281.6B76602805j286298j151681r89497q93921q26686p15703o08981n52654n16057
$$ 276602805 275316507 274164826 273175329 272281408 271454722 270739019 270130038 269577384 269061327
3300B69061327m57287l95238l39210k96921l20703l43203k83837k43187k60026k49713
$$ 269061327 268604040 268208802 267869592 267572671 267251968 266908765 266624928 266381741 266121715 265872002
3320.4B65872002k32965k75165l36140l71129l38643k81215l42518m55499m67509m71055
$$ 265872002 265639037 265363872 265027732 264656603 264317960 264036745 263694227 263238728 262771219 262300164
3340.8B62300164n40257o05285o29991o05405o21587o91265p06374o82593o62297o64323
$$ 262300164 261759907 261154622 260524631 259919226 259297639 258606374 257900000 257217407 256555110 255890787
3361.2B55890787o79911o63310o75410p38025p88718p88540p14898o33567o14345o04704
$$ 255890787 255210876 254547566 253872156 253134131 252345413 251556873 250841975 250208408 249594063 248989359
3381.6B48989359n27516m43131l36856k12788k88040m85405m60893k13921m9725j60888
$$ 248989359 248461843 248018712 247681856 247469068 247181028 246695623 246234730 246020809 245971084 245810196
3402B45810196l63156l04059q6307R000R090J2413M0113J07602K15649L22208M14878
$$ 245810196 245447040 245142981 245056674 245065674 245074764 245087177 245127290 245234892 245450541 245772749 246187627
3424.4B46187627N33372O81952P49454Q09580R17450Q51765O53803O74546R14753J101344
$$ 246187627 246720999 247402951 248152405 248961985 249879435 250731200 251385003 252059549 252974302 254075646
3444.8B54075646J176298J174122J196623J290023J416266J529008J567215J501143
$$ 254075646 255251944 256426066 257622689 258912712 260328978 261857986 263425201 264926344
3461.1B64926344J511157J747131J938999J824170J543850J486897J701296J974940
$$ 264926344 266437501 268184632 270123631 271947801 273491651 274978548 276679844 278654784
3477.4B78654784K088010J979292J930952K036452K064973K044648K139002K229154
$$ 278654784 280742794 282722086 284653038 286689490 288754463 290799111 292938113 295167267
3493.8B95167267K250463K230108K242803K294362K261847K185524K222329K400577
$$ 295167267 297417730 299647838 301890641 304185003 306446850 308632374 310854703 313255280
3510.1C13255280K574027K535522K394885K432644K578914K716512K695143K553821
$$ 313255280 315829307 318364829 320759714 323192358 325771272 328487784 331182927 333736748
3526.4C33736748K597391K805382K931237K985984L036112L027409L084183L205538
$$ 333736748 336334139 339139521 342070758 345056742 348092854 351120263 354204446 357409984
3542.7C57409984L234744L148317L137678L247380L393859L492266L521383L610462
$$ 357409984 360644728 363793045 366930723 370178103 373571962 377064228 380585611 384196073
3559C84196073L674209L533989L435791L931105M509121M405498M175753M252016M403502
$$ 384196073 387870282 391404271 394840062 398771167 403280288 407685786 411861539 416113555 420517057
3577.4D20517057M507095M598707M561394M375845M489690M984379N022258M842251
$$ 420517057 425024152 429622859 434184253 438560098 443049788 448034167 453056425 457898676
3593.7D57898676M985452N165339N155980N120784M996538M702390M722029N035430
$$ 457898676 462884128 468049467 473205447 478326231 483322769 488025159 492747188 497782618
3610D97782618N148560N148053N006790N004466N517482N597413M936576M222035M388333
$$ 497782618 502931178 508079231 513086021 518090487 523607969 529205382 534141958 538363993 542752326
3628.4E42752326N451202N522728N044937M800200M662097M626155M454493L910125
$$ 542752326 548203528 553726256 558771193 563571393 568233490 572859645 577314138 581224263
3644.7E81224263L343463L732264M926622M958331M176319M123807M408121M089594
$$ 581224263 584567726 588299990 593226612 598184943 602361262 606485069 610893190 614982784
3661F14982784L600120L287316K815306K533376K996922K886951K490639L255427L701031
$$ 614982784 618582904 621870220 624685526 627218902 630215824 633102775 635593414 638848841 642549872
3679.4F42549872L347874K976239K495408J938820J871466K524853K884388K540827
$$ 642549872 645897746 648873985 651369393 653308213 655179679 657704532 660588920 663129747
3695.7F63129747K017736J648724J627803J904071J793027J215159P81417J148761
$$ 663129747 665147483 666796207 668424010 670328081 672121108 673336267 674117684 675266445
3712F75266445K053260K156616J590073J145542J038908J090348J234889J368285R95337
$$ 675266445 677319705 679476321 681066394 682211936 683250844 684341192 685576081 686944366 687939703
3730.3F87939703L94345L92794J175225J843453J449644J96099j97768J020074J081348
$$ 687939703 688334048 688726842 689902067 691745520 693195164 693391263 693193495 694213569 695294917
3748.7F95294917N47766J378715J951337J367569Q38280J046896J136899P64727N73159
$$ 695294917 695842683 697221398 699172735 700540304 701378584 702425480 703562379 704327106 704900265
3767.1G04900265O11484Q98599J182378J015782O69122N40256P54416Q22306P04587
$$ 704900265 705511749 706410348 707592726 708608508 709277630 709817886 710572302 711394608 712099195
3785.4G12099195P73370Q35538P07268L72649J27673K61843J66833K25246R52423R00149
$$ 712099195 712872565 713708103 714415371 714788020 714915693 715177536 715344369 715569615 716522038 717422187
3805.8G17422187P10488J118481R33230R6917k31981K13980J49370M57286J230240
$$ 717422187 718132675 719251156 720184386 720281303 720049322 720263302 720412672 720869958 722100198
3824.2G22100198J040876O38128L56316J58370K56359J16587q166M96924R04441J004875
$$ 722100198 723141074 723779202 724135518 724293888 724550247 724666834 724658668 725155592 726060033 727064908
3844.6G27064908R61959N73218l78728j377821j46806J741349J477778M65453p5996
$$ 727064908 728026867 728600085 728221357 726843536 726696730 728438079 729915857 730381310 730305314
3862.9G30305314J34468L06606j5735J66178O82234Q37624O71745J18613O9380L54290
$$ 730305314 730439782 730746388 730730653 730896831 731579065 732416689 733088434 733207047 733276427 733630717
3883.3G33630717K53081M78685M59611Q9109L80278N79715Q881m94838l19421K32637
$$ 733630717 733883798 734362483 734822094 734911203 735291481 735871196 735880077 735385239 735065818 735298455
3903.7G35298455P96020R33051O13391L47913J80125n9784m9233K32577K58804J23381
$$ 735298455 736094475 737027526 737640917 737988830 738168955 738109171 738059938 738292515 738551319 738674700
3924.1G38674700J99378J91510J3351J21117M21762M37319K25366N2869N5790J78575
$$ 738674700 738874078 739065588 739078939 739200056 739621818 740059137 740284503 740337372 740393162 740571737
3944.5G40571737J24514M6432K25842L64840L10660K03669J02222N8353J18553K08438
$$ 740571737 740696251 740742683 740968525 741333365 741644025 741847694 741949916 742008269 742126822 742335260
3964.9G42335260K08974J53541J43469J56522J55806J61469J45614J56343K01941J75297
$$ 742335260 742544234 742697775 742841244 742997766 743153572 743315041 743460655 743616998 743818939 743994236
3985.3G43994236J19865J16050J24812J51575K25067K40564
$$ 743994236 744114101 744230151 744354963 744506538 744731605 744972169
3997.5G44972169
$$ 744972169
##END=$$ End of the data block
