##TITLE=G2-SalenCo $$ Begin of the data block
##JCAMP-DX=5.00 $$ ACD/SpecManager v 10.08
##SPECTROMETER/DATA SYSTEM=Alpha
##DATE=16 Apr 2014 10:35:00
##DATA TYPE=INFRARED SPECTRUM
##DATA CLASS=XYDATA
##ORIGIN=
##OWNER=
##NPOINTS=1765
##FIRSTX=399.75695801
##LASTX=3997.56933594
##MAXX=3997.56933594
##MINX=399.75695801
##MAXY=0.88970721
##MINY=0.41819739
##XFACTOR=1.0000000000
##YFACTOR=1.000000000000000e-9
##FIRSTY=0.82232445
##DELTAX=2.03957629
##XUNITS=1/CM
##YUNITS=ARBITRARY UNITS
##XYDATA=(X++(Y..Y))
399.8H22324455j434684j294076K205252J889169m365086q426428l861904K903521
416.1H09940219L824532j85370k378643p33554Q37147k557457r378850j3096511j2392760
434.4G73878753j3110459j7510056j8885076p560671J4785409K8958142K4753094J2506843
450.7G97815979N431592M529953L736556j132250q414746j5150308k3749352l3957302
467.1G29110122l1542123p238388K3177028L6340177K9561460J5187383M076063J162053
483.4G99833775L368139L723681l69907n077600m692435K071499P752240O059706J768291
501.7H14437389J641393L798902L030300p47680k985597j331270Q02875r82106m639804
520.1H13024402l834963J577914N774974M569769L33011j453995O84559K808154J304507
$$ y = [822324455, 820889771, 819595695, 821800947, 823690116, 819325030, 810898602, 807036698, 809940219, 813764751, 813579381, 811200738, 810467184, 811304331, 808746874, 799368024, 786271513, 773878753, 760768294, 743258238, 724373162, 716812491, 731597900, 760556042, 785309136, 797815979, 803247571, 807777524, 811514080, 810381830, 801967084, 786816776, 763067424, 729110122, 697567999, 690329611, 713506639, 749846816, 779408276, 794595659, 798671722, 799833775, 803201914, 806925595, 806555688, 801478088, 796785653, 798857152, 806609392, 812669098, 814437389, 816078782, 819877684, 822907984, 822160304, 819174707, 817843437, 818646312, 817664206, 813024402, 809189439, 810767353, 816542327, 821112096, 821445107, 819991112, 820675671, 823483825, 824788332]
538.4H24788332k018273k833485m07577J385033p61032m267812l674269J071871M064023
556.8H17346811K090574j386524j818716O78837J788497j108765n259216o804288m404723
575.2H01122487J085043M865229L887832J982808J743674K84076m576266j0358214
591.5H00036669j1627138p002115j131237M249573R028733J0511815R108007O354571
607.8H19528878K529323k68877k24650R06587o52850p031023j4622927j3672531m056990
626.1G82434940R85504L078460J1047483J6286790J2703061O338060J203299j681745
642.5H32395852j498044N38766J290739p43091m279494p548750p771075k348542N038917
660.8H15075278Q308828P203460O226420O240249L310919J150131J320899K185642
$$ y = [824788332, 822770059, 819936574, 819528997, 820914030, 820152998, 815885186, 812210917, 813282788, 817346811, 819437385, 818050861, 816232145, 816910982, 818699479, 817590714, 812331498, 805527210, 801122487, 802207530, 807072759, 810960591, 812943399, 814687073, 814971149, 810394883, 800036669, 788409531, 781407416, 780276179, 784525752, 793554485, 804066300, 813174307, 819528878, 822058201, 821789324, 821564674, 822471261, 821818411, 814787388, 800164461, 786491930, 782434940, 783420444, 786498904, 797546387, 813833177, 826536238, 832874298, 834077597, 832395852, 830897808, 831436574, 832727313, 831984222, 827704728, 820155978, 812384903, 810036361, 815075278, 823384106, 830587566, 836813986, 843054235, 846365154, 847515285, 848836184, 851021826]
677.1H51021826J859844M40896l27945L77476J417995J297771K22147l22819M21405
695.5H56408596J397967J196981N6863m55499K74420J127064R21249n0127m95315N4181
715.9H60436380P06851N05150l65019r28640q68857j129389k666950n092442p373929
734.2H43223155q359373p371366o601334p818997q527994p120251n955160p838011
750.6G83630669j1983931j6290247k4567068m2544067n7234049l6284327K0665109
764.8F15392089O3841045O3321471M1123629K3955762J6148388J2398124R430707O801784
781.2H52412999M547894K427637M0293l092706p091165j0957837j1819541n729497
797.5H20738077O315887J5491486J5736997J0727465O064594L422379K191305J564026
$$ y = [851021826, 852881670, 853322566, 852994621, 853372097, 854790092, 856087863, 856310010, 855987191, 856408596, 857806563, 859003544, 859060407, 858604908, 858879328, 860006392, 860927641, 860877514, 860382199, 860436380, 861143231, 861648381, 861283362, 860354722, 859485865, 858356476, 855689526, 850597084, 843223155, 834863782, 827492416, 820891082, 813072085, 804544091, 797423840, 791468680, 783630669, 771646738, 755356491, 730789423, 688245356, 631011307, 594726980, 615392089, 679233134, 742554605, 783678234, 807633996, 823782384, 836180508, 845611215, 852412999, 856960893, 859388530, 859428823, 856336117, 849244952, 838287115, 826467574, 820738077, 827053964, 842545450, 858282447, 869009912, 875074506, 878496885, 880688190, 882252216]
813.8H82252216J135588Q01086O44029O52611O38425M85301K53976O4253K4975M589
834.2H86957049m39286j739859m143000o782115o251037r22143L844678L579676J383603
852.5H75487566P21037J087249J112461O55532M70638P49469Q33690K77817n18262
870.9H80877197p49290j46508O25968O61611k04742j502573l233612o467998j1502385
889.3H58357668j5117407j3766766j0520517j1282206j6545296j8131077l492892K1889508
905.6G91391015L4435988K7640998J5632987Q097052M878462L256559J645029K22623
921.9H87200713l21865j14381o9440n57601r18865o22571N3942L41773k67982j344740
942.3H83378983j969696j734376j250505j569867k510309k963305k759754k592326
$$ y = [882252216, 883387804, 884188890, 884832919, 885485530, 886123955, 886609256, 886863232, 886927485, 886952460, 886957049, 886517763, 884777904, 880634904, 873852789, 867601752, 866679609, 870524287, 874103963, 875487566, 876208603, 877295852, 878408313, 879063845, 879534483, 880283952, 881117642, 881395459, 880877197, 880127907, 879981399, 880607367, 881268978, 881064236, 879561663, 876328051, 869860053, 858357668, 843240261, 829473495, 818952978, 807670772, 791125476, 772994399, 769501507, 791391015, 825827003, 853468001, 869100988, 877198040, 882076502, 885333061, 886978090, 887200713, 886878848, 886764467, 886695027, 886137426, 885218561, 884595990, 884649932, 884991705, 884723723, 883378983, 881409287, 879674911, 878424406, 876854539, 874344230, 871380925, 868621171, 866028845]
958.6H66028845k367854j523375p21991r62854k128899l182650k852797j042724L16680
977H51562381J151085L565848N654394M704118K753258J650810M71950j021088j718759
995.3H68773997j204848r61245k690136o858170j4913619k7236759k9203415o581128
1011.6G79124677J8312395K0735204J2152314O446004K473414j673639n251646o041229
1027.9H26277494k512991K162635L490150L509045N900085Q442461P319808L339172
1044.3H57927859k23160k422392m968942r499847j4752329j4880657l111601J3972163
1060.6H22041094J9515753J1883140L239095q76129k628267m072725m233659j826942
1076.9H43041360Q43823M53234l240704p482410p695675j182854P581294J1182367
$$ y = [866028845, 863660991, 862137616, 861415625, 860452771, 858323872, 855141222, 852288425, 851245701, 851562381, 852713466, 856279314, 861933708, 866637826, 869391084, 871041894, 871513844, 870492756, 868773997, 867569149, 866607904, 863917768, 857059598, 842145979, 814909220, 785705805, 779124677, 797437072, 818172276, 830324590, 836770594, 839244008, 837570369, 832318723, 826277494, 823764503, 825927138, 829417288, 832926333, 838826418, 847268879, 854588687, 857927859, 857704699, 855282307, 850313365, 840813518, 826061189, 811180532, 808068931, 822041094, 841556847, 853439987, 856679082, 855802953, 853174686, 849101961, 844868302, 843041360, 843885183, 844338417, 841097713, 833615303, 825919628, 824736774, 832318068, 843500435]
1093.2H43500435Q689225M791081K791405K270519J301289o56962k183497j964271
1109.5H58539224q65996j229048m227459q856416j3039947j5084743j5417278j4198482
1125.8G85619855p229149O313622J8032074K1231114J6948522R514212K907396k786398
1142.2H50551248j1433900k3888588k8577566j4003456P926345J8742204J8516004
1156.4H17832291J5395761J2716412J0336042P501125M081309J290262M96864J218140
1172.7H70868206J454592J30355j546919j921177j230896j362562l460884o978214
1189.1H55952501j1117875j5512824j8601895j7296850r668231J146018Q471429R402931
1205.4H02775204O007612J539707j566231k529204k235353k228081k834499k788365
$$ y = [843500435, 852189660, 856980741, 859772146, 862042665, 863343954, 862686992, 860503495, 858539224, 857673228, 856444180, 852216721, 843360305, 830320358, 815235615, 799818337, 785619855, 778390706, 784704328, 802736402, 823967516, 840916038, 850430250, 853337646, 850551248, 839117348, 815228760, 786651194, 772647738, 780574083, 799316287, 817832291, 833228052, 845944464, 856280506, 863781631, 867862940, 869153202, 869650066, 870868206, 872322798, 872453153, 870906234, 868985057, 867754161, 866391599, 862930715, 855952501, 844834626, 829321802, 810719907, 793423057, 783754826, 784900844, 793372273, 802775204, 808782816, 810322523, 808756292, 806227088, 803991735, 801763654, 798929155, 796140790]
1221.7G96140790k167761l843367p753432p424116J93536O690979L161788o293237
1238G78705180j0774732o467879L571689J5070558K2136211K0273686J2758612P114411
1254.3H42387736M808724K083778k007186n689562p777571p001221k632022L251791
1270.6H27424467P784843R948254R328186N748451J017213k050221k641022k565325
1287H53994846l703057n800784p143259p006526o652713p649243r578287j0407448
1303.3G96053529r177029o925464m940093k737701R79662N450309P925927O399393
1319.6G93028533K10405r916902k0584941k3543298j1390090Q094192J6527831J1976302
1335.9G64402032J1103690J6487836J3040007J066148r793341j9004762k1875084p154941
$$ y = [796140790, 793973029, 790129662, 782376230, 774952114, 775145650, 781836629, 784998417, 778705180, 767930448, 761462569, 765034258, 780104816, 802241027, 822514713, 835273325, 842387736, 847196460, 849280238, 847273052, 841583490, 833805919, 826804698, 824172676, 827424467, 835209310, 845157564, 854485750, 860234201, 861251414, 859201193, 856560171, 853994846, 850291789, 844491005, 837347746, 830341220, 823688507, 816039264, 806460977, 796053529, 786876500, 779951036, 775010943, 772273242, 773252904, 778703213, 786629140, 793028533, 793238938, 783322036, 762737095, 739193797, 727803707, 735897899, 752425730, 764402032, 775505722, 791993558, 805033565, 806099713, 796306372, 777301610, 755426526, 748271585]
1352.2G48271585J8062114L2458604L0193686K0993531J2037694N652428K637565J848996
1368.5H72156203R56595j184941l064155l456116m013896o069124q195161p519961
1384.9H39609444k504706L545701M139543o75798o958186j0258019p435143J193523
1401.2H20656359R048760J1761904J0075569O986737M101813J082301j491546k587021
1417.5H59634876j657307r83417k546906m432917n459130o780505r222746j4215588
1433.8H14336360k2457541k3709237j6630709k0640135l8126946o0056924p1652830
1448.1E61062038n1556766r399116K9534161O2817872P3332071M6731353K7515947
1462.4G40037560J9158304J0859311M575014K302706R15289M61638O144881J7278374
$$ y = [748271585, 766333699, 798792303, 828985989, 849979520, 862017214, 867669642, 870307207, 872156203, 873112798, 871927857, 868863702, 865407586, 861393690, 855324566, 847129405, 839609444, 837104738, 840650439, 844789982, 844114184, 837155998, 826897979, 819462836, 820656359, 829705119, 841467023, 851542592, 858529329, 862631142, 863713443, 862221897, 859634876, 857977569, 856994152, 854447246, 850014329, 844555199, 837774694, 828551948, 814336360, 791878819, 768169582, 751538873, 730898738, 692771792, 632714868, 561062038, 509505272, 500106156, 529640317, 592458189, 665790260, 712521613, 740037560, 759195864, 770055175, 774630189, 776932895, 777848184, 778309822, 784454703, 801733077]
1478.7H01733077K5572359K3226082J2982607M399419J121044J779735K149582M64976
1495H73428881r56058k94507P82192J42634k135098l206194r87351k98261j663029
1513.4H64813209m797817q992076j4636397k6025891l4187496k6511133k703488J8163562
1529.7G65122473J8245697R713948M208744K624154N377829J0532677J1100352Q750319
1546H35676193N612254L717125K898335J520872j511633p616758j2302578q562803
1562.3H19431007k032280O460845J0799528Q053779K485871k198576n929590p618189
1578.6H29452395r140849j1370063j3101398j6075612k2109806l2251477m7496379
1592.9F77906811o3399672o1755538l0132771J4914990M6895086N6033671M9893797
$$ y = [801733077, 827305436, 850531518, 863514125, 867913544, 869034588, 870814323, 872963905, 873428881, 872472823, 872178316, 872960508, 873103142, 870968044, 867761850, 866774499, 866476238, 864813209, 860015392, 851023316, 836386919, 810361028, 776173532, 749662399, 746958911, 765122473, 783368170, 793082118, 797290862, 799915016, 805292845, 815825522, 826925874, 835676193, 841288447, 845005572, 847903907, 849424779, 847913146, 840296388, 827993810, 819431007, 817398727, 823859572, 834659100, 842712879, 845198750, 843000174, 837070584, 829452395, 820311546, 808941483, 795840085, 779764473, 757654667, 725403190, 677906811, 614507139, 552751601, 522618830, 537533820, 584428906, 640462577, 690356374]
1607.2F90356374L6505043K0430148O660700l390789j1760652j7781198k8764189m9612164
1623.5F42643273o6161990p1599424n9715122k6969344J1009098N0276905O0551494
1637.8E40034890M4138193L3697188K7566970K5714457K2140264J0126650o525635
1652F96892977k4629295j7467022L213286K6934922M5469999M2983234K6894808J7130733
1668.4H17423642J2886762Q205653N270063M757345L544629J419604k18809Q18491
1684.7H54107380K740085K125323J097858j8478n81443L79920J866639L468275L412664
1703H68598223K287864K423883K366006J151204l31819j192033r6858J973570J879156
1721.4H79059196P03752L45885M56691L90113q7619j33872J136779J343966R41694
$$ y = [690356374, 726861417, 747291565, 753952265, 750561476, 738800824, 721019626, 692255437, 642643273, 576481283, 504881859, 445166737, 418197393, 429206491, 479483396, 540034890, 584173083, 617870271, 645437241, 671151698, 693291962, 703418612, 696892977, 672263682, 654796660, 658009946, 684944868, 730414867, 773398101, 800292909, 817423642, 830310404, 838516057, 843786120, 848543465, 852088094, 853507698, 853288889, 854107380, 856847465, 858972788, 860070646, 860052168, 859470725, 859850645, 861717284, 865185559, 868598223, 870886087, 873309970, 875675976, 876827180, 876495361, 875303328, 875206470, 877180040, 879059196, 879762948, 880108833, 880565524, 880955637, 880868018, 880734146, 881870925, 883214891, 884156585]
1739.7H84156585Q98003M56512j49905j97351M40836J242160R22084J15156P3255K79486
1760.1H88236821M43518M19676k22444p15912o35803m9352P21454N39303p450m3094
1780.5H88686717L1888k22981l59535l60310l30866L57867Q06212K19882k32876J66536
1800.9H88762534O36279L08395l37780n30720p8737L10838J2040m40240l82304j75238
1821.3H88085067k80201m47810o16252m72009M26054P80999K26855r3519m1068j64270
1841.7H87403846j68920K85685L15786N2571R9123J26242j64568n00798m40717p7605
1862.1H86930645l2187o13987r62139k89321L82245K79009j74999n26488m17709J14918
1882.5H84689987M96685K48373k58982j62602K65241L87728K13802j90318m40240k54810
$$ y = [884156585, 885054588, 885511100, 885361195, 885163844, 885604680, 886846840, 887768924, 887884080, 887957335, 888236821, 888680339, 889100015, 888877571, 888161659, 887525856, 887476504, 888197958, 888737261, 888729811, 888686717, 888718605, 888495624, 888136089, 887775779, 887444913, 887802780, 888608992, 888828874, 888595998, 888762534, 889398813, 889707208, 889369428, 888838708, 888759971, 889070809, 889082849, 888642609, 888260305, 888085067, 887804866, 887357056, 886740804, 886268795, 886694849, 887475848, 887702703, 887609184, 887568116, 887403846, 887234926, 887520611, 887836397, 887888968, 887988091, 888114333, 887949765, 887448967, 887008250, 886930645, 886898458, 886284471, 885322332, 885033011, 885415256, 885694265, 885519266, 884992778, 884575069, 884689987, 885186672, 885435045, 885176063, 885013461, 885278702, 885666430, 885880232, 885689914, 885249674, 884994864]
1902.9H84994864j7166j84834n20944n00679k06530j80483m78804o66917o25193k49207
1923.3H81364107K57433J71423k99633m51446j47581J49966l3677n99921q47816k81573
1943.7H79281282K91884R6739m56214o78122l26753J74284K27511j48594l99888k85327
1964.1H77776802m5419P808k28822l47018R5248P35104Q97944N17428J43587J70589
1984.5H79723251L02970R1195l51250m22537k4617K74837J43111k76625n31733l45052
2004.9H78583550l7491q3864m00006m65036n2094M69267N18084L2961l60846k36035
2025.3H77968490J07587J47163j81496l86774j31905K31862K03132j39773l27706j25110
2045.7H77365470K07901K31028j08779l08990k2173L71217L56615m0770l36349j73390
$$ y = [884994864, 884977698, 884792864, 884271920, 883771241, 883564711, 883384228, 882905424, 882238507, 881613314, 881364107, 881621540, 881792963, 881493330, 881041884, 880894303, 881044269, 881010592, 880410671, 879562855, 879281282, 879573166, 879669905, 879213691, 878535569, 878208816, 878383100, 878610611, 878462017, 878062129, 877776802, 877731383, 877739191, 877510369, 877163351, 877258599, 877993703, 878891647, 879409075, 879552662, 879723251, 880026221, 880117416, 879766166, 879343629, 879319012, 879593849, 879736960, 879460335, 878928602, 878583550, 878546059, 878462195, 878062189, 877597153, 877545059, 878014326, 878532410, 878565371, 878204525, 877968490, 878076077, 878223240, 878041744, 877654970, 877523065, 877754927, 877958059, 877818286, 877490580, 877365470, 877573371, 877804399, 877695620, 877386630, 877364457, 877735674, 878092289, 878051519, 877715170, 877541780]
2066.1H77541780J93656K37882o0797k34663k1398K96175K94626l4451k88308j75238
2086.5H77749264J06633J43707j33991l29257j49726J84476K76446L3856k24352j32620
2106.9H77524436J95086K88724L0578k00510j01388J46210J89066j7106k05100j38521
2127.3H77711475J17421K40743O1870j56224j06692J42872K51532N8889j86086j55449
2147.7H77980351J16826K90691J48714j12832j12235J46210K88725J21713j47045j80125
2168H78540993N7399K19941O9142j97828k42353n603K04564R5129j96517k79427p1764
2190.5H78193676J19389M8816k05398l09408q4281J86384J38462j56284k85446q5473
2210.9H77560437J54257J26838j12474k21371l3141K00391J44899j66952l60311k08020
$$ y = [877541780, 877735436, 877973318, 877912521, 877677858, 877656460, 877952635, 878247261, 878212810, 877924502, 877749264, 877855897, 877999604, 877865613, 877536356, 877386630, 877571106, 877847552, 877881408, 877657056, 877524436, 877719522, 878008246, 878038824, 877838314, 877736926, 877883136, 878072202, 878055096, 877849996, 877711475, 877828896, 878069639, 878131509, 877975285, 877868593, 878011465, 878262997, 878321886, 878135800, 877980351, 878097177, 878387868, 878536582, 878423750, 878311515, 878457725, 878746450, 878868163, 878721118, 878540993, 878598392, 878818333, 878887475, 878689647, 878447294, 878441691, 878646255, 878741384, 878544867, 878265440, 878193676, 878313065, 878361881, 878156483, 877847075, 877762794, 877949178, 878087640, 877931356, 877645910, 877560437, 877714694, 877841532, 877729058, 877507687, 877474546, 877674937, 877819836, 877652884, 877292573, 877084553]
2231.3H77084553N5194N3644k19881m07934k64705K6226Q4103j37449k59816n6804
2251.7H75957131K44022L17097J11162q1301L2604K92778K67506r5487l98397l32058
2272.1H76315057p0810R417j51574k68936j20759J46329J88053q8513l55065k99931
2292.5H75303268l9219M9233j92285m95910m49300q9467O3360j84357m51624m10557
2312.9H73103142k17617k50220n31495o99520n29647k11239j48117n00083q19981n82814
2333.3H68612409j07110J6511k24293l91721J9669Q67546R70721M6432r97126j443863
2353.6H67369175j164019o32227k86638j21653K19047P11739R65535Q15809N21422
2372H68398190L99947N22792O25253M67002K31743K02239L06189K90811N3882k31683
$$ y = [877084553, 877139747, 877193391, 876973510, 876565576, 876300871, 876327097, 876411200, 876273751, 876013935, 875957131, 876201153, 876518250, 876629412, 876548111, 876580715, 876873493, 877140999, 877045512, 876647115, 876315057, 876244247, 876253664, 876102090, 875833154, 875712395, 875858724, 876046777, 875958264, 875603199, 875303268, 875264049, 875313282, 875120997, 874625087, 874175787, 874086320, 874149680, 873965323, 873513699, 873103142, 872885525, 872635305, 872103810, 871404290, 870874643, 870663404, 870515287, 870015204, 869195223, 868612409, 868505299, 868521810, 868297517, 867905796, 867925465, 868793011, 869763732, 869810164, 868813038, 867369175, 866205156, 865572929, 865286291, 865164638, 865383685, 866095424, 867060959, 867876768, 868398190, 868798137, 869320929, 869946182, 870413184, 870644927, 870847166, 871153355, 871444166, 871498048, 871266365]
2392.4H71266365k72214l7372J64091Q0526j41799j53721P7605K36333J02639j83105
2412.8H71139348k56360o8009O0380n8890l00288l38197p9334J42634P0036j64390
2433.2H70146930k59340j19865J0550p8380k64704l02851j41919J3590l9160k66373
2453.6H68698478l78847k10464J5735J4603j91569k82943r6917J10984P4565j27018
2474H67626607k22206q5175Q9884K7239k23159l68655k38240l0041n3584k42532l54111
2496.4H65926027k97129j32859m9650j26362j78874n0723J48177J67668o0141k72095
2516.8H65074039k26141o5147p9692k55108l26514j74045N9545J37925k6882k19524
2537.2H63898456j74165j8298n6207k56658l44575k00152K4736R7036p0631k86877
$$ y = [871266365, 870994151, 870956779, 871120870, 871201396, 871059597, 870905876, 870983481, 871219814, 871322453, 871139348, 870882988, 870814979, 870875359, 870816469, 870516181, 870177984, 870098650, 870241284, 870311320, 870146930, 869887590, 869767725, 869778275, 869699895, 869435191, 869132340, 868990421, 869004011, 868964851, 868698478, 868319631, 868109167, 868124902, 868139505, 867947936, 867664993, 867568076, 867679060, 867753625, 867626607, 867404401, 867319226, 867409110, 867436349, 867213190, 866844535, 866606295, 866576254, 866522670, 866280138, 865926027, 865628898, 865496039, 865446389, 865320027, 865141153, 865090430, 865238607, 865406275, 865346134, 865074039, 864847898, 864782751, 864703059, 864447951, 864121437, 863947392, 864006937, 864144862, 864117980, 863898456, 863724291, 863705993, 863649786, 863393128, 863048553, 862848401, 862873137, 862970173, 862899542, 862612665]
2557.6H62612665k86758j27852o8248j81555k95460k38359r3997o9320j88589k95222
2578H60767305k45810m3392R8348K9683p1466l7372N4002N5730q7917k44021k13981
2600.4H60061109m7266K8371n6207j58489j22547K9683R5189l9101k21490k58863j65642
2622.9H59144747j00434j62422k84136l22520k31147j50621k29538l85463m62532m43935
2643.3H56371999m37141n15282n74291m98294l19124j91211k15114l41177m40061m05252
2663.7H52435052l02016k43903j99973p8559R2506J83583J33097L1531K1338J09255
2684.1H52181911J88709J62422L6955m6849j4543M8875L9637m9591j27554j32620j21355
2706.5H52165997j95265l45409m25100l66628k83539k75553l08931l15308k77400k94566
$$ y = [862612665, 862325907, 862198055, 862129807, 861948252, 861652792, 861414433, 861320436, 861251116, 861062527, 860767305, 860521495, 860478103, 860576451, 860606134, 860534668, 860497296, 860551298, 860607028, 860519111, 860275090, 860061109, 860013843, 860042214, 859986007, 859827518, 859704971, 859734654, 859829843, 859790742, 859569252, 859310389, 859144747, 859044313, 858881891, 858597755, 858275235, 858044088, 857893467, 857663929, 857278466, 856815934, 856371999, 855934858, 855419576, 854845285, 854346991, 854027867, 853836656, 853621542, 853280365, 852840304, 852435052, 852133036, 851889133, 851689160, 851610601, 851703107, 851886690, 852019787, 852051318, 852072656, 852181911, 852370620, 852533042, 852569997, 852523148, 852508605, 852557480, 852597117, 852547526, 852419972, 852287352, 852165997, 851970732, 851625323, 851200223, 850833595, 850550056, 850274503, 849965572, 849650264, 849372864, 849078298]
2726.9H49078298l78907l47555j91867m0651J9670o4909k08915k54512j88171j50919
2747.3H47271562k52426m01795m19676k94745j90914k25842l33607m01378l99411l88741
2767.7H43963027m33981m65632m44710m75943n22077m82142l85523k63453j41859q5771
2788.1H40261936k12908m62234n77628m73142l34024l10064k97367k52009k28047k38359
2808.5H36876154l77953o22630p77424q20040q75295r64999j058876j206577j413107
2826.8H28759253j659274k031684k363563j952231l13043J553535K142728J485526
2843.1H25621247M65215m70698j245499j769781j828611j327574m31955N18501J222849
2861.5H20753694J492500J272857P72238L51131J35064j49906n53906p04884n75662
$$ y = [849078298, 848699391, 848351836, 848159969, 848119318, 848138988, 848074079, 847865164, 847610652, 847422481, 847271562, 847019136, 846617341, 846197665, 845902920, 845712006, 845486164, 845152557, 844751179, 844351768, 843963027, 843529046, 843063414, 842618704, 842142761, 841620684, 841138542, 840753019, 840489566, 840347707, 840261936, 840049028, 839586794, 839009166, 838536024, 838202000, 837891936, 837594569, 837342560, 837114513, 836876154, 836498201, 835875571, 835098147, 834278107, 833402812, 832437813, 831378937, 830172360, 828759253, 827099979, 825068295, 822704732, 820752501, 820439458, 821992993, 824135721, 825621247, 826086462, 825615764, 824370265, 822600484, 820771873, 819444299, 819012344, 819530845, 820753694, 822246194, 823519051, 824291289, 824642420, 824777484, 824627578, 824073672, 823368788, 822793126]
2879.9H22793126m95016n65231o90639q05021r05394j018763j172840j336158j490712
2898.2H14313352j656473j871109k228856k770185l428459m135251m871905n427897
2914.5G87923217n231440l871978j871764l70205K18690O28114J470625K291798K350986
2932.9G83538043J627505P95305L64125J69814r4653k38478P5519O07968Q20756O72519
2953.3G88338423Q13186J548350K152562K022266J462043J051664R62853R84133J006067
2971.6H00341547J036286R61304Q15987O77109M73261L57628M31180N12421O03258
2990H06209981O49751N25176M52340L37064j6749l69310q11100j447618j806259j495421
3010.4H02227855p28965n6505J68681K0206j99199l09110m00602n63801p03931q54313
$$ y = [822793126, 822298110, 821732879, 821042240, 820237219, 819331825, 818313062, 817140222, 815804064, 814313352, 812656879, 810785770, 808556914, 805786729, 802358270, 798223019, 793351114, 787923217, 782691777, 778819799, 776948035, 776577830, 776796520, 777424634, 778895259, 781187057, 783538043, 785165548, 785960853, 786324978, 786494792, 786400139, 786161661, 786237180, 786845148, 787665904, 788338423, 789151609, 790699959, 792852521, 794874787, 796336830, 797388494, 798351347, 799335480, 800341547, 801377833, 802339137, 803155124, 803832233, 804305494, 804663122, 805094302, 805606723, 806209981, 806859732, 807384908, 807837248, 808174312, 808157563, 807788253, 806977153, 805529535, 803723276, 802227855, 801498890, 801442385, 801611066, 801631272, 801432073, 801122963, 800722361, 800158560, 799454629, 798600316]
3030.8G98600316j177728j639247j649618q71182m04417j164139k399027k801537j628578
3049.1G84864843N62668K264857K626538J954019J084328N92351M05252K28107j77026
3067.5G94405937p48038j031458o74427M72486J871347K389014J950503J315832P33673
3085.8H00684869L15428J32978j1206p9035J7106R6858K3961j34647j67668o5207j49489
3108.3H00663948m35650m17590p3970l7670m34458r05037j126289r14217n77092m96566
3128.7G95245409o27518o96659n54204l77595m77016q18789r27746p17879n70059n21719
3149.1G88956225m97043o94990r94087j048386r96768r67801q37266o85156o78062
3167.4G81556666q04067r12249r19282r04560r68159j051545j078903j054228j007378
$$ y = [798600316, 797422588, 795783341, 794133723, 793262541, 792858124, 791693985, 789294958, 786493421, 784864843, 785427511, 787692368, 790318906, 792272925, 793357253, 793949604, 794354856, 794582963, 794405937, 793657899, 792626441, 791952014, 792424500, 794295847, 796684861, 798635364, 799951196, 800684869, 801000297, 801133275, 801122069, 801043034, 801060140, 801156998, 801180959, 801046312, 800878644, 800813437, 800663948, 800228298, 799810708, 799736738, 799699068, 799264610, 798359573, 797233284, 796319067, 795741975, 795245409, 794617891, 793921232, 793367028, 792989433, 792512417, 791693628, 790765882, 790048003, 789477944, 788956225, 788459182, 787764192, 786770105, 785721719, 784724951, 783757150, 782919884, 782234728, 781556666, 780752599, 779840350, 778921068, 778016508, 777048349, 775996804, 774917901, 773863673, 772856295]
3185.8G72856295j008153j081467j148641j125097j043916j065611j227975j338423
3202.1G63817012j324534j284778j291692j343072j380503j351655j284480j278162
3218.4G53278136j355648j406908j348197j249969j189292j123726j093030j237869
3234.7G43273497j372695j288116j200974j198113j108825r81451j006484j076936
3251.1G34039903j009643q87931q10861p81417p88451q57710r52125r86040r81867
3269.4G25983858j029193j134932j196564j159548j110971j143098j273096j419663
3285.7G16516793j419246j300991j318514j526952j699686j734257j717269j640439
3302G04159439j531423j646280j936674k083957k139151k200902k243042k302646k388716
$$ y = [772856295, 771848142, 770766675, 769618034, 768492937, 767449021, 766383410, 765155435, 763817012, 762492478, 761207700, 759916008, 758572936, 757192433, 755840778, 754556298, 753278136, 751922488, 750515580, 749167383, 747917414, 746728122, 745604396, 744511366, 743273497, 741900802, 740612686, 739411712, 738213599, 737104774, 736123323, 735116839, 734039903, 733030260, 732142329, 731331468, 730550051, 729761600, 728903890, 727951765, 726965725, 725983858, 724954665, 723819733, 722623169, 721463621, 720352650, 719209552, 717936456, 716516793, 715097547, 713796556, 712478042, 710951090, 709251404, 707517147, 705799878, 704159439, 702628016, 700981736, 699045062, 696961105, 694821954, 692621052, 690378010, 688075364, 685686648]
3320.4F85686648k468288k579749k785146k903461k859652k888561k916574k753318
3336.7F63531899k746820l022075l232419l396392l381789l009140k942503l418267
3353F38382494l671407l476143l234148l225863l332675l181576k972842l152609l544270
3371.4F08590961l596724l258228k968311k801717k686738k651215k593041k302646
3387.7E85732341j812935j744270k214075k364456j838029j367747j701773k292931
3404E70396125k165615j644671j386821j363338j443803j481414j319527j071573q64029
3422.4E57655334p04288n80966m38750l42489j70290J09434J192m13596l71576Q5890
3442.8E54829895L73900M74990N56946O46710P59780Q73447J015127J186192J227319
$$ y = [685686648, 683218360, 680638611, 677853465, 674950004, 672090352, 669201791, 666285217, 663531899, 660785079, 657763004, 654530585, 651134193, 647752404, 644743264, 641800761, 638382494, 634711087, 631234944, 628000796, 624774933, 621442258, 618260682, 615287840, 612135231, 608590961, 604994237, 601736009, 598767698, 595965981, 593279243, 590628028, 588034987, 585732341, 583919406, 582175136, 579961061, 577596605, 575758576, 574390829, 572689056, 570396125, 568230510, 566585839, 565199018, 563835680, 562391877, 560910463, 559590936, 558519363, 557655334, 556951046, 556370080, 555931330, 555588841, 555418551, 555527985, 555529177, 555115581, 554744005, 554829895, 555203795, 555678785, 556235731, 556882441, 557642221, 558515668, 559530795, 560716987, 561944306]
3461.1E61944306J312911J663864J829088J422226R36210J083911J614511J941502
3477.4E73748529J875818J601398J673281J977444J924216J756907J846075K008915
3493.8E88412583K104044K004206J844823J899600J918376J763523J718103J916886
3510.1F03582144K243519K269804J965106J827895J954854K177894K191245J971186
3526.4F20183647J949787K104521K187848K268135K229154J998306J950800K087832
3542.7F36960030K044975J721561J365066J078069O18637l09348k117813n421042j0571957
3561.1F25368178j6209245j7499864o942272J2571931K4465918K4413228J8408954
3575.3F64576828J2126387Q207440O143928M832625L970146L968716M338562L904224
$$ y = [561944306, 563257217, 564921081, 566750169, 568172395, 569108605, 570192516, 571807027, 573748529, 575624347, 577225745, 578899026, 580876470, 582800686, 584557593, 586403668, 588412583, 590516627, 592520833, 594365656, 596265256, 598183632, 599947155, 601665258, 603582144, 605825663, 608095467, 610060573, 611888468, 613843322, 616021216, 618212461, 620183647, 622133434, 624237955, 626425803, 628693938, 630923092, 632921398, 634872198, 636960030, 639005005, 640726566, 642091632, 643169701, 643788338, 643478990, 641361177, 635940135, 625368178, 609158933, 591659069, 584716797, 597288728, 621754646, 646167874, 664576828, 676703215, 684910655, 691054583, 695887208, 699857354, 703826070, 708164632, 712068856]
3591.7G12068856L359139L461301L659606L542304L338993L002405K551317K647340
3608G37631261L055096L050745K948343K717078K669096L377914L602088K781212J983106
3626.3G63815939K647460M228115M042149L306627L012299K739489K457023J972199
3642.6G88221300J083195M54962J510024L364742L061414J939118K035498K348304
3659H04018557J717210R55045M46916j07527j50979N13018L15487K85387J657367K122938
3679.4H11773419J548469Q30412O2526l03388K28584J095116J244366P82728K01583
3697.7H17463815j64449J4365L67701j967p33435p63417M00961J318097Q22723K9802
3718.1H18754196l04937k76387o7413K23279K16067m20213j045704o33776P01010J173556
$$ y = [712068856, 715427995, 718889296, 722548902, 726091206, 729430199, 732432604, 734983921, 737631261, 740686357, 743737102, 746685445, 749402523, 752071619, 755449533, 759051621, 761832833, 763815939, 766463399, 770691514, 774733663, 778040290, 781052589, 783792078, 786249101, 788221300, 789304495, 789759457, 791269481, 794634223, 797695637, 799634755, 801670253, 804018557, 805735767, 806690812, 807137728, 807030201, 806879222, 807392240, 807707727, 807993114, 809650481, 811773419, 813321888, 814152300, 814214826, 813911438, 814140022, 815235138, 816479504, 817262232, 817463815, 817299366, 817313731, 817681432, 817679465, 816946030, 816182613, 816583574, 817901671, 818724394, 818754196, 818449259, 818172872, 818105459, 818328738, 818544805, 818124592, 817078888, 816445112, 817146122, 818319678]
3738.5H18319678J6153j357436j106083M6432j53840K682J193106J151085K33889l5048
3758.9H18310618L64423K59698k45035l92735j09971M76361O48319P1168m94897l74556
3779.3H18513393O2406N5373l4332Q7440J00672q9943n15282q77202r19223r29236
3799.7H15454066l77953M16875K74539L38435O25968M2915q44002j002669p08818o19293
3820.1H13600063K68758R27567M20094m6134l10719m25756m50135p18772n84543K51413
3840.5H12931836P76827P82013L04878p39932j896561j738846P23541J725912O32823
3858.8H13502491l72828o39557k70069k39968n57244j02818N26965N13315j0491o07431
3879.2H11742365m48227p6472J2338J26839j25170j35124L67641J43290p14064j086890
$$ y = [818319678, 818335831, 816978395, 815872312, 815918744, 815764904, 815767586, 816960692, 818111777, 818345666, 818310618, 818675041, 818934739, 818689704, 818296969, 818186998, 818663359, 819311678, 819382846, 818887949, 818513393, 818575799, 818631172, 818596840, 818684280, 818784952, 818695009, 818179727, 817302525, 816383302, 815454066, 815076113, 815492988, 815767527, 816105962, 816731930, 816774845, 815930843, 814928174, 814219356, 813600063, 813868821, 814796388, 815216482, 815170348, 814859629, 814433873, 813983738, 813264966, 812680423, 812931836, 813708663, 814490676, 814795554, 814055622, 812159061, 810420215, 811143756, 812869668, 813502491, 813129663, 812490106, 812220037, 811980069, 811422825, 811320007, 811846972, 812360287, 812349796, 811742365, 811294138, 811217666, 811230004, 811356843, 811231673, 811096549, 811464190, 811607480, 810893416, 809806526]
3899.6H09806526o75738J00076P91490Q22246L13103j19686l97324n44071l08037M470
3920H09793055m5717j71959r8467j31786k61247n2452K51174J39356k23816m69208
3940.4H08728933l62217q3864r2089j77920k3484J36435J49071R6142L0995K146K8908
3962.9H08433056Q166p2897p6830L0339J35898J34111K9087q3864r3162O318K8908
3985.3H08479130j12891k15173j37746j788M8637J5855
3997.5H08076024
$$ y = [809806526, 809130788, 809230864, 810022354, 810844600, 811157703, 811038017, 810640693, 810096622, 809788585, 809793055, 809747338, 809575379, 809476912, 809345126, 809083879, 809031427, 809282601, 809421957, 809198141, 808728933, 808366716, 808282852, 808190763, 808012843, 807989359, 808125794, 808274865, 808371007, 808402002, 808404148, 808433056, 808441222, 808368325, 808291495, 808321834, 808457732, 808591843, 808620930, 808537066, 808443904, 808450222, 808479130, 808366239, 808151066, 808013320, 808011532, 808060169, 808076024]
##END=$$ End of the data block
