##TITLE=G2-Salen $$ Begin of the data block
##JCAMP-DX=5.00 $$ ACD/SpecManager v 10.08
##SPECTROMETER/DATA SYSTEM=Alpha
##DATE=08 Apr 2014 08:54:24
##DATA TYPE=INFRARED SPECTRUM
##DATA CLASS=XYDATA
##ORIGIN=
##OWNER=
##NPOINTS=1765
##FIRSTX=399.75695801
##LASTX=3997.56933594
##MAXX=3997.56933594
##MINX=399.75695801
##MAXY=0.82922900
##MINY=0.26842594
##XFACTOR=1.0000000000
##YFACTOR=1.000000000000000e-9
##FIRSTY=0.81696904
##DELTAX=2.03957629
##XUNITS=1/CM
##YUNITS=ARBITRARY UNITS
##XYDATA=(X++(Y..Y))
$$ plain form
399.8 816969037 814808846 819042683 818485320 813027382 814019918 816265762 811518192 808384538 810258687
418.1 810258687 806184888 800994515 800788879 794405043 778159857 764141142 759459615 762975514
434.4 762975514 776838005 795567632 804649115 804286182 807059467 810420156 806694627 804146945
450.7 804146945 807016134 805690348 800589025 800575554 799404562 791555703 785182655 778526902 759591341
469.1 759591341 738262475 735934377 746995330 756112218 764182091 770360172 765898287 757083416
485.4 757083416 763072550 781096935 795650661 806218624 813581109 812356830 809418857 812548339
501.7 812548339 813493609 809185863 809403062 812341452 809385538 806489646 809514105 809732914 805316806
520.1 805316806 806100190 809112608 805874825 803091109 806038797 805779219 801186383 801465333 803671420
$$ packed form
399.8H16969037k160191M233837n57363n457938R92536K245844m747570l133654J874149
418.1H10258687m073799n190373k05636o383836j6245186j4018715m681527L515899
434.4G62975514J3862491J8729627R081483l62933K773285L360689l725529k547682
450.7H04146945K869189j325786n101323j3471j170992p848859o373048o655753j8935561
469.1G59591341k1328866k328098J1060953R116888Q069873O178081m461885q814871
485.4G57083416N989134J8024385J4553726J0567963P362485j224279k937973L129482
501.7H12548339R45270m307746K17199K938390k955914k895892L024459K18809m416108
520.1H05316806P83384L012418l237783k783716K947688k59578m592836K78950K206087
$$ plain form
538.4 803671420 800012887 796667516 798002899 795297086 787023008 780564487 773228526 761129975
554.8 761129975 752716660 749546528 742407084 740002632 757170379 781114221 792741477 796962202
571.1 796962202 802134514 802813172 799332321 800338268 802696168 799976289 798564315 802081525 802481115
589.4 802481115 799362004 800640941 802997231 800197124 798557699 801686049 801699340 798401356 799559236
607.8 799559236 801951885 799216866 797283888 799896896 799721420 796569288 797851622 800366104 797780395
626.1 797780395 795419335 796713531 794397771 787469804 782886326 777848125 764486015 743434548
642.5 743434548 715720356 686828315 682563186 717566431 763392568 790334880 802147627 810581505
658.8 810581505 813607752 811261535 810906708 811828017 808881164 808795154 812877417 813836753 810523748
$$ packed form
538.4H03671420l658533l345371J335383k705813q274078o458521p335961j2098551
554.8G61129975q413315l170132p139444k404452J7167747K3943842J1627256M220725
571.1G96962202N172312O78658l480851J005947K357900k719879j411974L517210L99590
589.4H02481115l119111J278937K356290k800107j639425L128350J3291l297984J157880
607.8G99559236K392649k735019j932978K613008j75476l152132J282334K514482k585709
626.1G97780395k361060J294196k315760o927967m583478n038201j3362110k1051467
642.5G43434548k7714192k8892041m265129L5003245M5826137K6942312J1812747Q433878
658.8H10581505L026247k346217l54827R21309k946853q6010M082263R59336l313005
$$ plain form
677.1 810523748 810182214 812165320 809922934 807024062 808314323 808133185 804164350 802977145 804002106
695.5 804002106 800914526 796990395 797064424 795866430 790778100 787947953 787256420 782752693 776979685
713.8 776979685 774516225 770777822 762779713 755880892 750137985 739686787 725635648 710773528
730.2 710773528 689895928 658261418 613507509 544279873 453758150 404973656 438970029
744.4 438970029 463555396 416601032 396976650 455854565 510179102 520897090 544193447
758.7 544193447 610584497 680983543 721054018 731250942 714673102 675659239 637561321
773 637561321 629147828 656002581 700845897 744286120 774794817 792056978 804183722 813747823
789.3 813747823 816960931 816366434 817142069 816606700 812529445 809609234 808148861 802737176 794831634
$$ packed form
677.1H10523748l41534J983106k242386k898872J290261j81138l968835j187205J024961
695.5H04002106l087580l924131P4029j197994n088330k830147o91533m503727n773008
713.8G76979685k463460l738403p998109o898821n742907j0451198j4051139j4862120
730.2G10773528k0877600l1634510m4753909o9227636r0521723m8784494L3996373
744.4D38970029K4585367m6954364j9624382N8877915N4324537J0717988K3296357
758.7E44193447O6391050P0399046M0070475J0196924j6577840l9013863l8097918
773F37561321q413493K6854753M4843316M3440223L0508697J7262161J2126744R564101
789.3H13747823L213108n94497P75635n35369m077255k920211j460373n411685p905542
$$ plain form
807.7 794831634 790931046 790578425 789703429 789191365 789045990 785530150 779977083 776369333 772250354
826 772250354 764856219 757519245 751403153 742665529 731355667 720476270 707725942 689778984
842.3 689778984 668550611 645342112 618063450 588164568 560973525 539586902 525637448
856.6 525637448 523281693 537450671 569599092 615737379 665056884 702019393 717414439 719548821
872.9 719548821 724055290 733686626 742720902 750549078 757482111 760836303 761460960 762325108 761572123
891.3 761572123 755900264 744689524 729212165 721625566 738009930 769499779 792656600 801566601
907.6 801566601 805179954 808793187 810490251 810234964 811255395 812666535 811724544 810487330 810894132
926 810894132 810032487 805966735 798016369 781882823 765534639 770000279 791611433 806874514
$$ packed form
807.7G94831634l900588l52621q74996n12064j45375l515840n553067l607750m118979
826G72250354p394135p336974o116092q737624j1309862j0879397j2750328j7946958
842.3F89778984k1228373k3208499k7278662k9898882k7191043k1386623j3949454
856.6E25637448k355755J4168978L2148421M6138287M9319505L6962509J5395046K134382
872.9G19548821M506469R631336R034276P828176O933033L354192O24657Q64148p52985
891.3G61572123n671859j1210740j5477359p586599J6384364L1489849K3156821Q910001
907.6H01566601L613353L613233J697064k55287J020431J411140r41991j237214M06802
926H10894132q61645m065752p950366j6133546j6348184M465640K1611154J5263081
$$ plain form
942.3 806874514 810685873 811892927 813338339 812794566 811324298 811225533 810328543 806817353 802759767
960.6 802759767 797841072 787806094 768295050 735282958 699043989 683477402 689828575 695466399
977 695466399 686370254 677587271 697570741 739251673 770822108 784860313 790816963 792240977
993.3 792240977 790401459 788160026 785329282 779929042 773142636 766330481 757351995 744523346
1009.6 744523346 727995992 705070138 669966638 619467199 568572760 559967041 617772222
1023.9 617772222 702448428 759734333 777691841 770663202 747377574 704444110 638861179
1038.1 638861179 568264246 535674512 569486856 645072281 717025101 765156567 792095125
1052.4 792095125 806637168 815362871 819786191 821032643 821790338 822168231 820631742 818400502
$$ packed form
942.3H06874514L811359J207054J445412n43773j470268r8765q96990l511190m057586
960.6H02759767m918695j0034978j9511044l3012092l6238969j5566587O351173N637824
977F95466399r096145q782983J9983470M1680932L1570435J4038205N956650J424014
993.3G92240977j839518k241433k830744n400240o786406o812155q978486j2828649
1009.6G44523346j6527354k2925854l5103500n0499439n0894439q605719N7805181
1023.9F17772222Q4676206N7285905J7957508p028639k3285628m2933464o5582931
1038.1F38861179p0596933l2589734L3812344P5585425P1952820M8131466K6938558
1052.4G92095125J4542043Q725703M423320J246452P57695L77893j536489k231240
$$ plain form
1068.7 818400502 817156196 815711856 813566506 812550008 812511146 811324000 809401870 808284879 806847453
1087.1 806847453 804124594 801523328 799034059 794420898 787244856 778023541 765081108 748744011
1103.4 748744011 735937834 731381953 726959229 713180304 699423373 706193328 735146642 767233551
1119.7 767233551 788246036 797371745 799513519 799527943 798994899 797116101 794223964 790638685 784571469
1138.1 784571469 773573875 753213167 711517811 642150164 572541177 558280587 622996271
1152.4 622996271 716250062 777631819 802308738 809659898 810673237 810056865 808589816 806309760
1168.7 806309760 804709852 804075241 802587688 799978912 797366500 794214606 789281368 782968819
1185 782968819 775208056 764097691 747992158 724901021 692110121 655759633 636266172 646989286
$$ packed form
1068.7H18400502j244306j444340k145350j016498l8862j187146j922130j116991j437426
1087.1H06847453k722859k601266k489269m613161p176042r221315j2942433j6337097
1103.4G48744011j2806177m555881m422724j3778925j3756931O769955K8953314L2086909
1119.7G67233551K1012485R125709K141774J4424n33044j878798k892137l585279o067216
1138.1G84571469j0997594k0360708m1695356o9367647o9608987j4260590O4715684
1152.4F22996271R3253791O1381757K4676919P351160J013339o16372j467049k280056
1168.7H06309760j599908o34611j487553k608776k612412l151894m933238o312549
1185G82968819p760763j1110365j6105533k3091137l2790900l6350488j9493461J0723114
$$ plain form
1201.3 646989286 676130295 702934861 717570364 720159888 714356661 704037666 691178739 678997576
1217.6 678997576 675965488 688648462 711646020 733508348 749587834 761714399 770301819 774055183
1233.9 774055183 773584068 770189226 763728440 753859282 740789711 726342499 718815327 728710532
1250.3 728710532 751962423 771570861 778816998 777162433 770980537 762780428 754837930 746280134
1266.6 746280134 732736409 711059511 680440784 639817476 587777138 525685191 462240905
1280.8 462240905 422527373 441361904 517570734 597673953 638505161 649876773 661005795
1295.1 661005795 683653116 712918162 741424322 763597488 776690543 782649457 784946978 783152997
1311.4 783152997 774343848 761846840 758740902 773131013 794197500 808451712 814297557 814995706
$$ packed form
1201.3F46989286K9141009K6804566J4635503K589524n803227j0318995j2858927j2181163
1217.6F78997576l032088J2682974K2997558K1862328J6079486J2126565Q587420L753364
1233.9G74055183m71115l394842o460786r869158j3069571j4447212p527172R895205
1250.3G28710532K3251891J9608438P246137j654565o181896q200109p942498q557796
1266.6G46280134j3543725k1676898l0618727m0623308n2040338o2091947o3444286
1280.8D62240905l9713532J8834531P6208830Q0103219M0831208J1371612J1129022
1295.1F61005795K2647321K9265046K8506160K2173166J3093055N958914K297521j793981
1311.4G83152997q809149j2497008l105938J4390111K1066487J4254212N845845O98149
$$ plain form
1327.8 814995706 813436091 811459661 808985293 805927873 803467155 802118063 801092625 800182343
1344.1 800182343 799611509 798524857 796347916 793980479 791727781 788398206 783549428 776845515
1360.4 776845515 765429616 747368097 723617077 696350396 675486505 672169328 685823023
1374.7 685823023 703488648 715945601 723081172 726548851 727325797 725733936 722415686 717913628
1391 717913628 710771203 699983060 687439382 673721731 660539150 650237143 642544270 637358904
1407.3 637358904 633521080 628039241 618115008 604422748 591749310 590014696 604944706 631879151
1423.6 631879151 662752032 689291835 711311519 728586435 739921510 746018887 746774375 743904233
1439.9 743904233 738006592 728147030 713616073 691641450 660847902 624998271 595027030 580356121
$$ packed form
1327.8H14995706j559615j976430k474368l057420k460718j349092j025438r10282
1344.1H00182343n70834j086652k176941k367437k252698l329575m848778o703913
1360.4G76845515j1415899j8061519k3751020k7266681k0863891l317177J3653695
1374.7F85823023J7665625J2456953P135571L467679P76946j591861l318250m502058
1391G17913628p142425j0788143j2543678j3717651j3182581j0302007p692873n185366
1407.3F37358904l837824n481839r924233j3692260j2673438j734614J4930010K6934445
1423.6F31879151L0872881K6539803K2019684J7274916J1335075O097377P55488k870142
1439.9G43904233n897641r859562j4530957k1974623l0793548l5849631k9971241j4670909
$$ plain form
1456.2 580356121 573675036 568532884 580607116 623223364 677149653 710643470 726752281 734152377
1472.6 734152377 735481024 732937276 726568460 715331852 699414134 679509759 652523816 613313675
1488.9 613313675 565883875 523782551 485776961 457177401 466048777 512085199 570379078
1503.2 570379078 634834588 706060708 745125711 758829534 766153753 769079745 767840862 764562309
1519.5 764562309 760182023 755945802 753860652 754672527 757776439 761742413 765864730 768773794
1535.8 768773794 769442976 766759694 761921525 757273376 752006769 746133983 738843977 730032444
1552.1 730032444 720508754 711317003 697360456 676962376 662901282 648517787 629346311 602232814
1568.4 602232814 564019263 526996970 493432343 467111200 470134228 499619395 542543590
$$ packed form
1456.2E80356121o681085n142152J2074232M2616248N3926289L3493817J6108811P400096
1472.6G34152377J328647k543748o368816j1236608j5917718j9904375k6985943l9210141
1488.9F13313675m7429800m2101324l8005590k8599560Q871376M6036422N8293879
1503.2E70379078O4455510P1226120L9065003J3703823P324219K925992j238883l278553
1519.5G64562309m380286m236221k085150Q11875L103912L965974M122317K909064
1535.8G68773794O69182k683282m838169m648149n266607n872786p290006q811533
1552.1G30032444r523690r191751j3956547k0398080j4061094j4383495j9171476k7113497
1568.4F02232814l8213551l7022293l3564627k6321143L023028K9485167M2924195
$$ plain form
1582.7 542543590 584574580 614840686 631563187 637621164 635549903 627111077 614938140 600994110
1599 600994110 584499657 564630270 543429732 525106847 513854921 511212409 514433026 520633101
1615.3 520633101 527740061 531522214 528979659 514730453 485323071 439479738 381474197 327419847
1631.6 327419847 283815533 268425941 316114664 404487580 497533232 572300375 632344544
1645.9 632344544 679448128 705113947 725332260 749303043 761936367 768305182 773276985 776428521
1662.2 776428521 778065979 779364586 780725420 782080293 783560097 784346938 784423172 786087513 790870070
1680.6 790870070 798481822 807395399 812742949 814723790 815221131 815102458 815049171 815043211 815270543
1699 815270543 815991879 817191064 818013072 818260729 818398595 818526030 818528473 818519711 818536520 818639517 819459796
$$ packed form
1582.7E42543590M2030990L0266106J6722501O057977k071261q438826j2172937j3944030
1599F00994110j6494453j9869387k1200538j8322885j1251926k642512L220617O200075
1615.3E20633101P106960L782153k542555j4249206k9407382m5843333n8005541n4054350
1631.6C27419847m3604314j5389592M7688723Q8372916R3045652P4767143O0044169
1645.9F32344544M7103584K5665819K0218313K3970783J2633324O368815M971803L151536
1662.2G76428521J637458J298607J360834J354873J479804P86841P6234J664341M782557
1680.6G90870070P611752Q913577N347550J980841M97341j18673n3287n960K27332
1699H15270543P21336J199185Q22008K47657J37866J27435K443q762J6809J02997Q20279
$$ plain form
1721.4 819459796 821049511 822917223 824415624 825709939 826953888 827662289 827925086 828456879 829002917
1739.7 829002917 829127491 829122782 829228997 829188883 828550518 827806532 827401042 826790750 825961709 825354397
1760.1 825354397 824662685 823911488 823482394 823229015 822729707 821575642 820450306 819660068 818699419
1778.5 818699419 817560613 816451788 815060377 813331902 811733365 809711039 806764960 804397285
1794.8 804397285 803397894 803251088 803841472 805282474 807156920 808892131 810328662 811525404 812305748
1813.2 812305748 812605441 812663198 812705338 812640786 812324226 811858296 811343074 810613573 810098290 810240626
1833.6 810240626 810530424 810697258 811031938 811467171 811483502 811227500 811139643 810971439 810668826 810524821
1854 810524821 810535431 810373366 810026646 809722424 809409499 808807909 807686269 806121588 804424107 803070426
$$ packed form
1721.4H19459796J589715J867712J498401J294315J243949P08401K62797N31793N46038
1739.7H29002917J24574m709J06215m0114o38365p43986m05490o10292q29041o07312
1760.1H25354397o91712p51197m29094k53379m99308j154065j125336p90238r60649
1778.5H18699419j138806j108825j391411j728475j598537k022326k946079k367675
1794.8H04397285r99391j46806N90384J441002J874446J735211J436531J196742P80344
1813.2H12305748K99693N7757M2140o4552l16560m65930n15222p29501n15283J42336
1833.6H10240626K89798J66834L34680M35233J6331k56002q7857j68204l02613j44005
1854H10524821J0610j62065l46720l04222l12925o01590j121640j564681j697481j353681
$$ plain form
1874.4 803070426 802871943 803910196 805263519 806291580 806794107 806600571 805770934 804858565 804216683
1892.7 804216683 803507149 802576661 801367164 799522758 797285080 795607686 794757545 794293642 794331431
1911.1 794331431 795181513 796470344 797764361 799004734 799930811 800085008 799494147 798448980 796892881
1929.4 796892881 794824123 792542517 790243328 787917078 785846710 784745336 785467386 787977159
1945.7 787977159 791138709 793795407 795426607 796214104 796628237 796782792 796565533 796169341 795763910
1964.1 795763910 795142353 794316888 793705463 793313503 792842150 792389214 792153955 791933477 791593492 791348398
1984.5 791348398 791177392 790794253 790230453 789726496 789249718 788691401 788233876 787976682 787665725 787310004
2004.9 787310004 787192285 787209451 787147343 787173867 787316978 787223935 786912978 786758244 786693037 786431551
$$ packed form
1874.4H03070426j98483J038253J353323J028061N02527j93536q29637r12369o41882
1892.7H04216683p09534r30488j209497j844406k237678j677394q50141m63903L7789
1911.1G94331431Q50082J288831J294017J240373R26077J54197n90861j045167j556099
1929.4G96892881k068758k281606k299189k326250k070368j101374P22050K509773
1945.7G87977159L161550K656698J631200P87497M14133J54555k17259l96192m05431
1964.1G95763910o21557q25465o11425l91960m71353m52936k35259k20478l39985k45094
1984.5G91348398j71006l83139n63800n03957m76778n58317m57525k57194l10957l55721
2004.9G87310004j17719J7166o2108K6524J43111r3043l10957j54734o5207k61486
$$ plain form
2025.3 786431551 786110759 785868406 785442531 784789383 784286320 784005046 783645630 783236265 782940447 782508075
2045.7 782508075 781781316 781048000 780351281 779465914 778647721 778336048 778405368 778561652 778853238 779216468
2066.1 779216468 779345751 779252470 779184282 779024899 778586686 778141975 777863681 777446747 776772916 776097596
2086.5 776097596 775390744 774514318 773868918 773814380 774028599 774200439 774455547 774687290 774552882 774223089
2106.9 774223089 774036884 773806274 773370087 773010850 772792697 772391260 771862566 771533310 771276712 770919383
2127.3 770919383 770702362 770677805 770510852 770172536 769934058 769726932 769335508 768959522 768772721 768497407
2147.7 768497407 768085241 767860830 767755926 767444074 767036557 766724706 766270876 765583515 765010238 764602661
2168 764602661 764095783 763646185 763543248 763591290 763612032 763843179 764264643 764456570 764389813 764351070 764251947
$$ packed form
2025.3G86431551l20792k42353m25875o53148n03063k81274l59416m09365k95818m32372
2045.7G82508075p26759p33316o96719q85367q18193l11673O9320J56284K91586L63230
2066.1G79216468J29283r3281o8188j59383m38213m44711k78294m16934o73831o75320
2086.5G76097596p06852q76426o45400n4538K14219J71840K55108K31743j34408l29793
2106.9G74223089j86205k30610m36187l59237k18153m01437n28694l29256k56598l57329
2127.3G70919383k17021k4557j66953l38316k38478k07126l91424l75986j86801k75314
2147.7G68497407m12166k24411j04904l11852m07517l11851m53830o87361n73277m07577
2168G64602661n06878m49598j02937M8042K0742K31147M21464J91927o6757l8743r9123
$$ plain form
2190.5 764251947 763953090 763719141 763654530 763453186 763092697 762908220 762857497 762628794 762304544 762066960
2210.9 762066960 761716485 761173248 760710716 760294259 759648860 758952498 758475661 757963657 757201970 756429434
2231.3 756429434 755692482 754789114 753925264 753455877 753244698 753032029 752901435 752819300 752470911 751937628
2251.7 751937628 751612902 751416624 751079679 750754416 750523925 750098407 749518394 749175608 748990893 748612463
2272.1 748612463 748171568 747955084 747774839 747449756 747268379 747315824 747286856 747164965 747105777 746874213
2292.5 746874213 746221185 745395124 744634748 743828714 743058980 742505014 741898596 740952313 739920020
2310.8 739920020 739090562 738228559 737136662 736034989 734980345 733824909 732728422 731763661 730652750
2329.2 730652750 729426026 728374660 727326155 726004899 724767447 724179387 724259555 724889755 725838304
$$ packed form
2190.5G64251947k98857k33949o4611k01344l60489j84477n0723k28703l24250k37584
2210.9G62066960l50475n43237m62532m16457o45399o96362m76837n12004p61687p72536
2231.3G56429434p36952r03368q63850m69387k11179k12669j30594q2135l48389n33283
2251.7G51937628l24726j96278l36945l25263k30491m25518n80013l42786j84715l78430
2272.1G48612463m40895k16484j80245l25083j81377M7445k8968j21891n9188k31564
2292.5G46874213o53028q26061p60376q06034p69734n53966o06418r46283j032293
2310.8G39920020q29458q62003j091897j101673j054644j155436j096487r64761j110911
2329.2G30652750j226724j051366j048505j321256j237452n88060Q0168O30200R48549
$$ plain form
2347.5 725838304 726234972 725370169 723526537 721777499 720538437 719705939 719479620 719813406 720173657
2365.9 720173657 720410645 720820248 721349180 721697986 721947789 722233653 722354829 722235441 722038925 721675277
2386.3 721675277 720907032 719867289 718881726 717995584 717230737 716828704 716715991 716429651 715829611
2404.6 715829611 715219736 714739084 714301229 714031935 714038372 714075148 714040220 714116395 714172542 713897765 713449657
2427.1 713449657 713145554 712856531 712421954 712055504 711805701 711395800 710829735 710331678 709825814 709195554
2447.5 709195554 708622515 708171487 707620442 706964314 706416309 705907583 705220222 704421520 703644395 702818155
2467.9 702818155 701998830 701439619 701138973 700873494 700637221 700438797 699980378 699109852 698093116
2486.2 698093116 697090805 696021974 695060313 694473684 694106340 693696499 693322718 693030119 692597628
$$ packed form
2347.5G25838304L96668q64803j843632j749038j239062q32498k26319L33786L60251
2365.9G20173657K36988M09603N28932L48806K49803K85864J21176j19388j96516l63648
2386.3G21675277p68245j039743r85563q86142p64847m02033j12713k86340o00040
2404.6G15829611o09875m80652m37855k69294O437L6776l4928P6175N6147k74777m48108
2427.1G13449657l04103k89023m34577l66450k49803m09901n66065m98057n05864o30260
2447.5G09195554n73039m51028n51045o56128n48005n08726o87361p98702p77125q26240
2467.9G02818155q19325n59211l00646k65479k36273j98424m58419q70526j016736
2486.2F98093116j002311j068831r61661n86629l67344m09841l73781k92599m32491
$$ plain form
2504.6 692597628 692003250 691429794 690809011 690027058 689308941 688879788 688625991 688413680 688270509 688035250
2525 688035250 687465429 686721861 686092854 685533226 684999883 684708178 684636891 684453309 684054494 683518231
2545.4 683518231 682708204 681529820 680289924 679345369 678844392 678893805 679393113 679896593 680110335
2563.7 680110335 680200160 680283844 680154622 679765642 679378927 679072082 678739607 678504288 678490877 678501189
2584.1 678501189 678393185 678315759 678339660 678409338 678678811 679349542 680206299 680852294 681220889 681365132
2604.5 681365132 681225955 680913925 680703521 680638254 680581093 680592895 680738211 680774987 680512428 679994881
2624.9 679994881 679103494 677629054 675818682 674308002 673615634 673947096 675128579 676603913 677848458
2643.3 677848458 678789794 679552674 680058122 680222571 680238903 680279315 680279016 680309951 680660427 681441128 682530224
$$ packed form
2504.6F92597628n94378n73456o20783p81953p18117m29153k53797k12311j43171k35259
2525F88035250n69821p43568o29007n59628n33343k91705p1287j83582l98815n36263
2545.4F83518231q10027j178384j239896r44555n00977M9413M99308N03480K13742
2563.7F80110335Q9825Q3684j29222l88980l86715l06845l32475k35319j3411J0312
2584.1F78501189j08004p7426K3901O9678K69473O70731Q56757O45995L68595J44243
2604.5F81365132j39177l12030k10404o5267n7161J1802J45316L6776k62559n17547
2624.9F79994881q91387j474440j810372j510680o92368L31462J181483J475334J244545
2643.3F77848458R41336P62880N05448J64449J6332M0412k99L0935L50476P80701J089096
$$ plain form
2665.7 682530224 683853507 685348153 686814725 688189626 689620137 691059947 692247450 693120241
2682 693120241 693815529 694340587 694694817 695047617 695426583 695599258 695412338 694845021 693750679 692033470
2702.4 692033470 689988375 688006341 686209321 684697509 683641315 682965040 682459712 682147563 682096601
2720.8 682096601 682164013 682271421 682470381 682701170 682866454 682959735 682966173 682793736 682508707 682452738
2741.2 682452738 682853162 683606982 684565723 685660303 686751723 687732160 688689411 689672112 690558374
2759.5 690558374 691373050 692345083 693506539 694720685 695965171 697176278 698056698 698226810 697566211
2777.9 697566211 696239591 694519818 692829251 691550851 690704882 690095723 689711213 689649940 689831674
2796.2 689831674 690116763 690467417 690878034 691350162 691942632 692652047 693336904 693953276 694588959 695181251
$$ packed form
2665.7F82530224J323283J494646J466572J374901J430511J439810J187503Q72791
2682F93120241O95288N25058L54230L52800L78966J72675j86920n67317j094342j717209
2702.4F92033470k045095j982034j797020j511812j056194o76275n05328l12149n0962
2720.8F82096601O7412J07408J98960K30789J65284R3281O438j72437k85029n5969
2741.2F82452738M00424P53820R58741J094580J091420R80437R57251R82701Q86262
2759.5F90558374Q14676R72033J161456J214146J244486J211107Q80420J70112o60599
2777.9F97566211j326620j719773j690567j278400q45969o09159l84510o1273J81734
2796.2F89831674K85089L50654M10617M72128N92470P09415O84857O16372O35683N92292
$$ plain form
2816.6 695181251 695552349 695646524 695484161 695032418 694268286 693266869 692086160 690767765 689516604
2835 689516604 688502967 687530637 686345875 684999406 683572352 682021320 680345237 678572714 676592708
2853.3 676592708 674183249 671287119 667943716 664207160 660561621 657825053 656504929 656748354
2869.7 656748354 658517718 661388934 664694309 667958796 670858979 673048258 674206257 674115360 672588885
2888 672588885 669375777 664261758 657205701 648675621 640726089 637336075 641428173 651148319 661102772
2906.4 661102772 667286813 669317722 668772697 667267561 665922344 665241659 664932072 664203763 662372828
2924.7 662372828 659502506 656832755 656192958 658783078 664343655 671321094 677919447 683009446
2941 683009446 686227381 687641919 687523127 686319768 684664488 683188856 682615995 683804214 687037408
$$ packed form
2816.6F95181251L71098R4175j62363m51743p64132j001417j180709j318395j251161
2835F89516604j013637r72330j184762j346469j427054j551032j676083j772523j980006
2853.3F76592708k409459k896130l343403l736556l645539k736568j320124K43425
2869.7F56748354J769364K871216L305375L264487K900183K189279J157999r0897j526475
2888F72588885l213108n114019p056057q530080p949532l390014M092098R720146R954453
2906.4F61102772O184041K030909n45025j505136j345217o80685l09587p28309j830935
2924.7F62372828k870322k669751o39797K590120N560577O977439O598353N089999
2941F83009446L217935J414538j18792j203359j655280j475632n72861J188219L233194
$$ plain form
2959.4 687037408 691580772 696221232 700087249 702867031 704517424 705118954 704824328 703761637 702052593
2977.8 702052593 699861467 697409689 695040941 693189085 692111611 691644907 691318572 690744221 689817429
2996.1 689817429 688516557 686811984 684834123 682808340 680981100 679850757 680205822 682560265
3012.4 682560265 686494231 690865993 694676995 697532535 699535728 700892925 701689780 701984644 701777518
3030.8 701777518 701049685 699724078 697740257 695376813 692794442 689766765 686304152 682951331
3047.1 682951331 680502713 679505229 680066645 681672275 683077574 683722198 685050488 688785970 694330156
3065.5 694330156 699423373 702855051 705003798 706591129 708056152 709451258 710606277 711583197
3081.8 711583197 712576330 713454366 714069426 714532614 714870930 715066433 715239525 715512812 715796292 715909064
$$ packed form
2959.4F87037408M543364M640460L866017K779782J650393O01530k94626j062691j709044
2977.8G02052593k191126k451778k368748j851856j077474m66704l26335n74351r26792
2996.1F89817429j300872j704573j977861k025783j827240j130343L55065K354443
3012.4F82560265L933966M371762L811002K855540K003193J357197P96855K94864k07126
3030.8G01777518p27833j325607j983821k363444k582371l027677l462613l352821
3047.1F82951331k448618r97484N61416J605630J405299O44624J328290L735482N544186
3065.5F94330156N093217L431678K148747J587331J465023J395106J155019R76920
3081.8G11583197R93133Q78036O15060M63188L38316J95503J73092K73287K83480J12772
$$ plain form
3102.2 715909064 715947390 716091990 716235816 716228962 716262519 716500640 716703475 716686785 716495216 716140032
3122.6 716140032 715710223 715408146 715291202 715193570 714997172 714801669 714666128 714475930 714171767 713836193
3143 713836193 713502169 713099718 712593555 712010443 711398423 710799575 710253656 709771931 709338427 708963573
3163.4 708963573 708628654 708277464 707904398 707548857 707221150 706869245 706451416 705978870 705444336 704841137
3183.7 704841137 704208493 703575313 702917099 702205896 701453626 700644255 699752092 698848665 697995543 697157264
3204.1 697157264 696352661 695608735 694846451 694031835 693244398 692485094 691637993 690699995 689768076 688836038
3224.5 688836038 687837601 686783731 685761154 684785903 683730185 682534873 681283712 679979444 678574026
3242.9 678574026 677096665 675548255 673891604 672327399 671315968 671124458 671553373 672136426 672494709
$$ packed form
3102.2G15909064L8326J44600J43826o854L3557K38121K02835j6690j91569l55184
3122.6G16140032m29809l02077j16944r7632j96398j95503j35541j90198l04163l35574
3143G13836193l34024m02451n06163n83112o12020n98848n45919m81725m33504l74854
3163.4G08963573l34919l51190l73066l55541l27707l51905m17829m72546n34534o03199
3183.7G04841137o32644o33180o58214p11203p52270q09371q92163r03427q53122q38279
3204.1F97157264q04603p43926p62284q14616p87437p59304q47101r37998r31919r32038
3224.5F88836038r98437j053870j022577r75251j055718j195312j251161j304268j405418
3242.9F78574026j477361j548410j656651j564205j011431j91510M28915N83053L58283
$$ plain form
3261.2 672494709 672481418 672151446 671626925 670991719 670368731 669800878 669178486 668449521 667612195 666654885
3281.6 666654885 665579796 664436400 663340151 662325978 661295354 660159409 658898473 657508492
3298 657508492 656086028 654835105 653751552 652530193 650921226 648992479 646978378 645012617 643080056
3316.3 643080056 641173780 639305830 637454391 635563076 633435547 630992174 628486872 626112461
3332.6 626112461 623843670 621580005 619138420 616433561 613551319 610564888 607673228 605039477
3348.9 605039477 602325022 599208891 595933497 592795014 589748442 586596191 583382428 580389619
3365.3 580389619 577554703 574443340 570917130 567406833 564300537 561471462 558740377 556080818
3381.6 556080818 553482592 551054835 548985660 547283292 545542061 543421149 541266322 539571524
$$ packed form
3261.2F72494709j3291l29972n24521o35206o22988n67853o22392p28965q37326r57310
3281.6F66654885j075089j143396j096249j014173j030624j135945j260936j389981
3298F57508492j422464j250923j083553j221359j608967j928747k014101j965761j932561
3316.3F43080056j906276j867950j851439j891315k127529k443373k505302k374411
3332.6F26112461k268791k263665k441585k704859k882242k986431k891660k633751
3348.9F05039477k714455l116131l275394l138483l046572l152251l213763k992809
3365.3E80389619k834916l111363l526210l510297l106296k829075k731085k659559
3381.6E56080818k598226k427757k069175j702368j741231k120912k154827j694798
$$ plain form
3397.9 539571524 538144171 536344647 534150898 532226324 530785382 529486239 528113663 526591659
3414.2 526591659 525049686 523786962 522764444 521810472 521031857 520553827 520284176 519995987 519729018
3432.6 519729018 519660592 519569337 519231260 518908620 518918991 519269109 519786775 520310640 520879447 521606266
3453 521606266 522477686 523495793 524643242 525698900 526744306 528145075 529728353 530927896 531639218
3471.3 531639218 532367527 533446491 534834325 536273122 537442446 538549006 539942980 541355312
3487.6 541355312 542543650 543803930 545297027 546822727 548208773 549560785 550965250 552229226
3504 552229226 553340673 554578245 556094527 557851017 559566200 560987175 562323213 563914955 565778136
3522.3 565778136 567500412 568882108 570268273 571879089 573683679 575676620 577676654 579472959
$$ packed form
3397.9E39571524j427353j799524k193749j924574j440942j299143j372576j522004
3414.2E26591659j541973j262724j022518r53972p78615m78030k69651k88189k66969
3432.6E19729018o8426r1255l38077l22640J0371L50118N17666N23865N68807P26819
3453E21606266Q71420J018107J147449J055658J045406J400769J583278J199543P11322
3471.3E31639218P28309J078964J387834J438797J169324J106560J393974J412332
3487.6E41355312J188338J260280J493097J525700J386046J352012J404465J263976
3504E52229226J111447J237572J516282J756490J715183J420975J336038J591742J863181
3522.3E65778136J722276J381696J386165J610816J804590J992941K000034J796305
$$ plain form
3538.6 579472959 581339777 583458185 585471809 587104201 588690698 590510309 592388034 594253719
3554.9 594253719 596225023 598327518 600468874 602437377 604156435 606109202 608522236 610845685
3571.3 610845685 612981081 615222931 617684960 620386660 623277247 626129687 628689408 630997777
3587.6 630997777 633487046 636160553 638790190 641422808 644139588 646820307 649404109 651914835
3603.9 651914835 654263556 656561494 658999562 661432683 663732529 665813386 667685568 669704139
3620.2 669704139 671901345 674006224 675743520 677065551 678671956 680512905 682124972 683582723
3636.5 683582723 684991002 686370134 687765658 689095676 690067470 690565825 691197515 692139149 692928135
3654.9 692928135 693685293 694604635 695278108 695630968 696097434 696530282 696411967 696370125 696611047 696159422
$$ packed form
3538.6E79472959J866818K118408K013624J632392J586497J819611J877725J865685
3554.9E94253719J971304K102495K141356J968503J719058J952767K413034K323449
3571.3F10845685K135396K241850K462029K701700K890587K852440K559721K308369
3587.6F30997777K489269K673507K629637K632618K716780K680719K583802K510726
3603.9F51914835K348721K297938K438068K433121K299846K080857J872182K018571
3620.2F69704139K197206K104879J737296J322031J606405J840949J612067J457751
3636.5F83582723J408279J379132J395524J330018R71794M98355O31690R41634P88986
3654.9F92928135P57158R19342O73473L52860M66466M32848j18315m1842K40922m51625
$$ plain form
3675.3 696159422 695717454 696077645 696732223 697498620 698297381 698821127 698737383 698595583 698936999 699437082
3695.7 699437082 699790299 699905574 699837923 699946642 700285554 700476944 700226367 699826658 699961722 700332701
3716.1 700332701 700460851 700335979 700115085 699886680 699760854 699977100 700357854 700442553 700075209 699769557
3736.5 699769557 700045049 700479865 700187385 699271083 699196875 699271262 698554993 698297977 698817968 699137509
3756.9 699137509 698991299 698896348 698966205 698861420 698608756 698266029 698026657 698124945 698284149 698185742
3777.3 698185742 697789609 697416723 697168589 696897209 696706057 696651578 696662664 696576476 696335256 696189761
3797.7 696189761 695885658 695318758 695236266 695188224 694895744 695016384 695401967 695470512 695182323 695086718
3818 695086718 694760382 694159925 694099724 694229126 694302499 694331288 694294393 694302917 694017947 693323135 692945004
$$ packed form
3675.3F96159422m41968L60191O54578P66397P98761N23746q3744j41800L41416N00083
3695.7F99437082L53217J15275o7651J08719L38912J91390k50577l99709J35064L70979
3716.1G00332701J28150j24872k20894k28405j25826K16246L80754Q4699l67344l05652
3736.5F99769557K75492M34816k92480r16302p4208P4387p16269k57016N19991L19541
3756.9F99137509j46210r4951O9857j04785k52664l42727k39372R8288J59204r8407
3777.3F98185742l96133l72886k48134k71380j91152n4479J1086q6188k41220j45495
3797.7F96189761l04103n66900q2492m8042k92480J20640L85583O8545k88189r5605
3818F95086718l26336o00457o0201J29402P3373K8789l6895Q524k84970o94812l78131
$$ plain form
3840.5 692945004 692955971 693138659 693566501 694045842 693935871 692464530 691170275 691547990 692180216
3858.8 692180216 692390323 692168355 691906512 691857457 691537380 691038013 690820694 690860271 691043437 690906167
3879.2 690906167 690561593 690429807 690218151 690090179 690056801 689757168 689551890 689637303 689562082 689119041
3899.6 689119041 688489258 687885940 687584341 687579215 687565506 687507689 687443972 687200785 686786532 686479092
3920 686479092 686277151 686010182 685815156 685752213 685566068 685215294 684928536 684705019 684440494 684139132
3940.4 684139132 683850408 683744013 683802426 683920503 684162080 684466064 684745371 685039520 685311794 685454547
3960.8 685454547 685506344 685544491 685515285 685422897 685349941 685275137 685197711 685178339 685161650 685095727 684990525
3983.2 684990525 684833109 684674561 684570670 684474349 684354961 684258044 684192598
$$ packed form
3840.5F92945004J0967J82688M27842M79341j09971j471341j294255L77715O32226
3858.8F92180216K10107k21968k61843m9055l20077m99367k17319L9577J83166j37270
3879.2F90906167l44574j31786k11656j27972l3378k99633k05278Q5413p5221m43041
3899.6F89119041o29783o03318l01599n126j3709n7817o3717k43187m14253l07440
3920F86479092k01941k66969j95026o2943j86145l50774k86758k23517k64525l01362
3940.4F84139132k88724j06395N8413J18077K41577L03984K79307K94149K72274J42753
3960.8F85454547N1797L8147k9206r2388p2956p4804p7426j9372j6689o5923j05202
3983.2F84990525j57416j58548j03891r6321j19388r6917o5446
$$ plain form
3997.5 684192598
$$ packed form
3997.5F84192598
##END=$$ End of the data block
