##TITLE=G2 - CuSO4 $$ Begin of the data block
##JCAMP-DX=5.00 $$ ACD/SpecManager v 10.08
##SPECTROMETER/DATA SYSTEM=Alpha
##DATE=15 Apr 2015 09:49:12
##DATA TYPE=INFRARED SPECTRUM
##DATA CLASS=XYDATA
##ORIGIN=
##OWNER=
##NPOINTS=1765
##FIRSTX=399.76428223
##LASTX=3997.64306641
##MAXX=3997.64306641
##MINX=399.76428223
##MAXY=1.00294316
##MINY=0.21307060
##XFACTOR=1.0000000000
##YFACTOR=0.000000010000000
##FIRSTY=1.00000000
##DELTAX=2.03961372
##XUNITS=1/CM
##YUNITS=ARBITRARY UNITS
##XYDATA=(X++(Y..Y))
$$ plain form
399.8 100000000 99728835 99206823 98724252 98571783 98364580 97614074 96542060 95348793 92602593
418.1 92602593 87831163 85402870 86159766 86945534 86876410 88226402 91102982 93242323 93606371
436.5 93606371 92746943 91354311 89641654 88038564 87204373 87372994 88206607 89023590 89447856
454.8 89447856 89715880 89937389 89810157 89245427 88565040 88083512 87661207 86967725 85990906 85038197
475.2 85038197 84408885 84535027 85620803 87165004 88428062 89045787 89211029 89326805 89480925
493.6 89480925 89438969 89168739 88952345 88873219 88658535 88181525 87631571 87059516 86050719 83995479
514 83995479 80789113 77962148 77825820 80183458 82999486 85147893 86462253 87046015 87097222
532.3 87097222 86738127 85799980 84303236 82960981 82472569 83043486 84317917 85474169 86107832
$$ packed form
399.8A00000000k71165n22012m82571j52469k07203p50506j072014j193267k746200
418.1I2602593m771430k428293P56896P85768o9124J349992K876580K139341L64048
436.5I3606371q59428j392632j712657j603090q34191J68621Q33613Q16983M24266
454.8H9447856K68024K21509j27232n64730o80387m81528m22305o93482r76819r52709
475.2H5038197o29312J26142J085776J544201J263058O17725J65242J15776J54120
493.6H9480925m1956k70230k16394p9126k14684m77010n49954n72055j008797k055240
514H3995479l206366k826965j36328K357638K816028K148407J314360N83762N1207
532.3H7097222l59095r38147j496744j342255m88412N70917J274431J156252O33663
$$ plain form
550.7 86107832 86376017 86345357 85949600 85209650 84110516 82909870 82632250 83791655 85383832
569.1 85383832 86379570 86727321 86738873 86659676 86584729 86459410 86243033 85990751 85725468 85359520
589.4 85359520 84730220 83688021 82065964 79578322 75965971 71357703 66404974 62335867 60459071
607.8 60459071 60682583 61272633 60667801 58833224 57015610 56486923 57388538 59129149 61280143
626.2 61280143 63764018 66502684 69299251 71926373 74219573 76115406 77650714 78856522 79653555
644.5 79653555 79723680 78697753 77313977 77251810 79038197 81658196 83796036 84753942 84746605 84484851
664.9 84484851 84699106 85916096 87281960 88267177 88971704 89478499 89875692 90158963 90362740 90582132
685.3 90582132 90835059 91049051 91198885 91355324 91571772 91780454 91906404 92004448 92165107 92336237
$$ packed form
550.7H6107832K68185l0660l95757p39950j099134j200646k77620J159405J592177
569.1H5383832R95738L47751J1552p9197p4947j25319k16377k52282k65283l65948
589.4H5359520o29300j042199j622057k487642l612351m608268m952729m069107j876796
607.8F0459071K23512N90050o04832j834577j817614n28687R01615J740611K150994
626.2F1280143K483875K738666K796567K627122K293200J895833J535308J205808P97033
644.5G9653555P0125j025927j383776o2167J786387K619999K137840R57906p337k61754
664.9H4484851K14255J216990J365864R85217P04527N06795L97193K83271K03777K19392
685.3I0582132K52927K13992J49834J56439K16448K08682J25950R8044J60659J71130
$$ plain form
705.7 92336237 92402065 92368233 92313814 92197311 91866463 91191250 90138048 89013070 88234067 87278169
726.1 87278169 85508245 84495765 85877436 88149005 89396590 89725304 89613897 88986558 87645048
744.5 87645048 85430342 82066655 77280128 70967758 62831599 52680391 42472667 36267152
760.8 36267152 36963382 44905463 56805104 67194831 73838061 77237105 77962673 78375983 81207705
779.1 81207705 85975242 90348881 93244022 94989258 96192503 97195691 98006409 98501170 98726612
797.5 98726612 98906535 99129164 99253380 99194729 99074805 98969924 98730671 98150718 97117120 95511252
817.9 95511252 93534684 92340761 93019110 94854021 96256262 96668595 96456033 96074229 95694917
836.2 95694917 95186311 94401860 93350345 91975963 90255880 88990182 89406753 91299099 93063569
$$ packed form
705.7I2336237O5828l3832n4419j16503l30848o75213j053202j124978p79003r55898
726.1H7278169j769924j012480J381671K271569J247585L28714j11407o27339j341510
744.5H7645048k214706l363687m786527o312370q136159j0151208j0207724o205515
760.8C6267152O96230P942081J1899641J0389727O643230L399044P25568M13310K831722
779.1H1207705M767537M373639K895141J745236J203245J003188Q10718M94761K25442
797.5I8726612J79923K22629J24216n8651j19924j04881k39253n79953j033598j605868
817.9I5511252j976568j193923O78349J834911J402241M12333k12562l81804l79312
836.2I5694917n08606p84451j051515j374382j720083j265698M16571J892346J764470
$$ plain form
854.6 93063569 93634260 93057835 91659021 89472032 86689234 84090072 82197547 81202102 81786603
873 81786603 83833224 85542887 85532260 84092939 82205522 80554223 79251599 78198642 77440053
891.3 77440053 76806718 75779986 73976237 71499538 69051504 67791915 68680364 71610975 75415707
909.7 75415707 78927654 81756759 84023601 85867888 87386388 88717997 89927840 90881807 91397369
928 91397369 91438413 91082644 90494609 90009469 89872158 89842463 89299881 87654674 84815818 81816626
948.4 81816626 80515110 81729841 84317595 86533415 87490147 87190807 85951090 84294462 82864338
966.8 82864338 81909168 81343687 81291586 81833565 82466644 82461733 81809747 81539279 82562459 84290987
987.2 84290987 85364771 85342461 84657139 83673108 82475489 81089598 79552174 77832603 75789142
$$ packed form
854.6I3063569N70691n76425j398814k186989k782798k599162j892525r95445N84501
873H1786603K046621J709663j0627j439321j887417j651299j302624j052957p58589
891.3G7440053o33335j026732j803749k476699k448034j259589Q88449K930611L804732
909.7G5415707L511947K829105K266842J844287J518500J331609J209843R53967N15562
928I1397369M1044l55769n88035m85140j37311k9695n42582j645207k838856k999192
948.4H1816626j301516J214731K587754K215820R56732k99340j239717j656628j430124
966.8H2864338r55170n65481n2101N41979O33079m911o51986k70468J023180J728528
987.2H4290987J073784k2310o85322r84031j197619j385891j537424j719571k043461
$$ plain form
1005.5 75789142 73252451 70100617 66270715 62039113 58654350 57645899 58580941 58933866 57056099
1023.9 57056099 54413205 53442305 53925210 53794646 52189839 49700785 46761951 43424863 40521809
1042.2 40521809 39198646 38850391 37694058 35100156 31770501 28858647 27013326 25759426 24467871
1060.6 24467871 23184483 22109078 21385032 21307060 21926497 22800475 23498179 23968320 24435692 25313792
1081 25313792 26998699 29599139 32880795 36409226 39657700 42073810 43204945 42775032 40746382
1099.4 40746382 37434307 33609608 30418041 28863773 28759795 29162654 29911610 30887681 31221709
1117.7 31221709 30547494 29428858 28649867 28864002 30498543 33673027 38046944 42915124 47579578
1136.1 47579578 51537621 54509640 56470710 57617205 58238399 58620483 58964413 59232599 59064192
$$ packed form
1005.5G5789142k536691l151834l829902m231602l384763j008451R35042L52925j877767
1023.9E7056099k642894r70900M82905j30564j604807k489054k938834l337088k903054
1042.2D0521809j323163l48255j156333k593902l329655k911854j845321j253900j291555
1060.6B4467871j283388j075405p24046p7972O19437Q73978O97704M70141M67372Q78100
1081B5313792J684907K600440L281656L528431L248474K416110J131135m29913k028650
1099.4D0746382l312075l824699l191567j554268j03978M02859P48956R76071L34028
1117.7C1221709o74215j118636p78991K14135J634541L174484M373917M868180M664454
1136.1D7579578L958043K972019J961070J146495O21194L82084L43930K68186j68407
$$ plain form
1154.4 59064192 58003449 56023699 54551452 55378151 57841903 60376793 63084507 66461074 70282793
1172.8 70282793 74050695 77397919 80165625 82333177 83931106 84956187 85358685 85115278 84348595
1191.1 84348595 83448869 83132917 84064221 86195356 88757747 90991825 92606801 93637007 94131255
1209.5 94131255 94049400 93572891 93293190 93578130 94130552 94578493 94844806 94880342 94555354 93790972
1229.9 93790972 92667770 91518956 90732867 90212959 89429492 87975830 85659957 82301599 77702051
1248.2 77702051 71843910 65401536 60175616 58017588 58815110 60863680 62970817 65053052 67264223
1266.6 67264223 69734168 72982132 76859772 79861933 80974436 80965275 81135386 81741691 82299381
1285 82299381 82000178 79706389 76037663 74418718 77046120 82016593 86464059 89564312 91758341
$$ packed form
1154.4E9064192j060743j979750j472247Q26699K463752K534890K707714L376567L821719
1172.8G0282793L767902L347224K767706K167552J597929J025081M02498k43407p66683
1191.1H4348595q99726l15952R31304K131135K562391K234078J614976J030206M94248
1209.5I4131255q1855m76509k79701K84940N52422M47941K66313L5536l24988p64382
1229.9I3790972j123202j148814p86089n19908p83467j453662k315873l358358m599548
1248.2G7702051n858141o442374n225920k158028P97522K048570K107137K082235K211171
1266.6F7264223K469945L247964L877640L002161J112503r161J70111O06305N57690
1285H2299381k99203k293789l668726j618945K627402M970473M447466L100253K194029
$$ plain form
1303.3 91758341 93451613 94755632 95642257 96142185 96389991 96470112 96330279 95883119 95219207 94711208
1323.7 94711208 94721198 95150936 95568854 95648396 95167863 93849552 91452807 88751900 87435091 87381727
1344.1 87381727 87243462 87189621 88183624 89883578 91246021 91818804 91753173 91256565 90345794 89116508
1364.5 89116508 87746233 86208504 84573078 82829547 80734819 78280973 75369895 71887618
1380.8 71887618 68670231 66948849 66793191 67296773 68040580 69194078 70770627 72652614 74950939
1399.2 74950939 77509940 80118418 82788503 85100603 86870128 88190860 89061642 89563465 89766043
1417.5 89766043 89535934 88833851 87584275 85652906 83184576 80008548 76052111 71743804 67811513
1435.9 67811513 66223109 66835392 67138362 66158909 64689052 63642490 62992644 62236375 60935056
$$ packed form
1303.3I1758341J693272J304019Q86625M99928K47806Q0121j39833m47160o63912n07999
1323.7I4711208R990M29738M17918P9542m80533j318311k396745k700907j316809n3364
1344.1H7381727j38265n3841R94003J699954J362443N72783o5631m96608r10771j229286
1364.5H9116508j370275j537729j635426j743531k094728k453846k911078l482277
1380.8G1887618l217387j721382j55658N03582P43807J153498J576549J881987K298325
1399.2G4950939K559001K608478K670085K312100J769525J320732Q70782N01823K02578
1417.5H9766043k30109p02083j249576j931369k468330l176028l956437m308307l932291
1435.9F7811513j588404O12283L02970r79453j469857j046562o49846p56269j301319
$$ plain form
1454.3 60935056 57333189 50966346 46782917 46455258 50989133 59503329 67602664 74192739 79721785
1472.6 79721785 83120990 84513986 84965897 84808385 84017098 82504791 80066723 76694608 73560256
1491 73560256 72204268 73060548 76599801 81527340 85327893 87542313 88922948 89993268 90854251
1509.3 90854251 91863877 92890638 93618137 94225675 95218068 96757561 98062384 98783880 99211973
1527.7 99211973 99466681 99674511 99768800 99749845 99838495 100000000 99886477 99595118 99351162 99206716
1548.1 99206716 99087960 98933142 98797929 98752207 98568892 97881961 97287428 96798474 96107227 94598079
1568.5 94598079 91826957 89425093 88847220 90043026 91031754 90723127 89407194 87319326 84268379
1586.8 84268379 79353815 72208220 64955050 61324912 63087136 68007308 72063202 72577929 69445819
$$ packed form
1454.3F0935056l601867o366843m183429l27659M533875Q514196Q099335O590075N529046
1472.6G9721785L399205J392996M51911j57512p91287j512307k438068l372115l134352
1491G3560256j355988Q56280L539253M927539L800553K214420J380635J070320Q60983
1509.3I0854251J009626J026761P27499O07538R92393J539493J304823P21496M28093
1527.7I9211973K54708K07830R4289j8955Q8650J61505j13523k91359k43956j44446
1548.1I9206716j18756j54818j35213m5722j83315o86931n94533m88954o91247j509148
1568.5I4598079k771122k401864n77873J195806R88728l08627j315933k087868l050947
1586.8H4268379m914564p145595p253170l630138J762224M920172M055894N14727l132110
$$ plain form
1605.2 69445819 63947266 57849300 53832006 54074955 59645855 69156611 76309699 80089229 82190740
1623.5 82190740 82925653 82865715 82534742 82290053 82345337 82764524 83277279 83770841 84353667 85039330
1643.9 85039330 85856748 86569393 86993504 87479740 88002449 88185376 88326824 88549161 88770121 88874203
1664.3 88874203 88916355 88963872 88956577 88949960 89107454 89475238 90018737 90731215 91616088 92534131 93071795
1686.8 93071795 93413705 93734390 94015461 94324917 94615269 94793433 94857436 94871163 94896454 94893003 94860190
1709.2 94860190 94871891 94962144 95106566 95169669 95073766 94990307 94980347 95005435 95049840 95128161 95233494
1731.7 95233494 95296025 95242816 95213342 95260966 95325673 95396692 95498544 95631099 95728439 95741951 95742559 95779455
1756.1 95779455 95825541 95871943 95901614 95912039 95968592 96087438 96224988 96295303 96267337 96240366 96262920
$$ packed form
1605.2F9445819n498553o097966m017294K42949N570900R510756P153088L779530K101511
1623.5H2190740P34913n9938l30973k44689N5284M19187N12755M93562N82826O85663
1643.9H5039330Q17418P12645M24111M86236N22709J82927J41448K22337K20960J04082
1664.3H8874203M2152M7517p295o617J57494L67784N43499P12478Q84873R18043N37664
1686.8I3071795L41910L20685K81071L09456K90352J78164O4003J3727K5291l451l2813
1709.2I4860190J1701R0253J44422O3103r5903q3459r960K5088M4405P8321J05333
1731.7I5233494O2531n3209k9474M7624O4707P1019J01852J32555R7340J3512O08L6896
1756.1I5779455M6086M6402K9671J0425N6553J18846J37550P0315k7966k6971K2554
$$ plain form
1778.6 96262920 96297002 96309912 96311659 96319991 96367633 96443117 96446997 96364331 96295929 96260941 96221840 96175498
1803 96175498 96164495 96207368 96277171 96317786 96304667 96271765 96232212 96186823 96169955 96211618 96294248 96398401
1827.5 96398401 96501762 96553230 96583688 96633494 96672022 96693784 96736819 96788687 96799159 96795750 96825254 96896785
1852 96896785 96995944 97096515 97183663 97260028 97328502 97395700 97467142 97498655 97444499 97366762 97323322 97310799
1876.5 97310799 97318178 97330225 97331154 97323781 97327584 97336614 97307378 97245604 97188008 97141898 97107124 97074383 97031367
1903 97031367 96994376 96987402 96995288 96994382 97002560 97033787 97055137 97052282 97081161 97168106 97276872 97382075 97470629
1929.5 97470629 97527510 97545326 97519439 97458524 97398990 97377855 97398937 97460532 97564286 97697842 97834063
1951.9 97834063 97943312 98017329 98065299 98094368 98111665 98135781 98166400 98172617 98142326 98092699 98037416 97980940
$$ packed form
1778.6I6262920L4082J2910J747Q332M7642P5484L880q2666o8402l4988l9101m6342
1803I6175498j1003M2873O9803M0615j3119l2902l9553m5389j6868M1663Q2630J04153
1827.5I6398401J03361N1468L0458M9806L8528K1762M3035N1868J0472l409K9504P1531
1852I6896785R9159J00571Q7148P6365O8474O7198P1442L1513n4156p7737m3440j2523
1876.5I7310799P379J2047R29p373L803R030k9236o1774n7596m6110l4774l2741m3016
1903I7031367l6991o974P886r06Q178L1227K1350k855K8879Q6945J08766J05203Q8554
1929.5I7470629N6881J7816k5887o0915n9534k1135K1082O1595J03754J33556J36221
1951.9I7834063J09249P4017M7970K9069J7297K4116L0619O217l0291m9627n5283n6476
$$ plain form
1976.4 97980940 97923934 97868663 97830313 97821617 97831297 97841042 97844845 97836155 97815102 97790611 97764385 97738504 97713232
2002.9 97713232 97679955 97627693 97552550 97453421 97327805 97166139 96961117 96739417 96547902 96408850
2023.3 96408850 96339768 96363026 96434790 96475023 96465349 96438152 96424836 96437418 96470875 96508890 96536100 96544683
2047.8 96544683 96534830 96515739 96497226 96482843 96473819 96469522 96470803 96479398 96488804 96493077 96491492 96481192 96458834
2074.3 96458834 96423531 96375144 96317953 96260047 96204722 96151799 96100730 96049768 95996034 95939779 95885164 95835137
2098.8 95835137 95789170 95746082 95705646 95669049 95639527 95616913 95595711 95573735 95557028 95553613 95565534 95587528
2123.3 95587528 95612824 95637751 95665073 95700294 95743173 95787358 95826077 95855445 95869190 95867717 95864230 95864296 95857310
2149.8 95857310 95834261 95799226 95759869 95720237 95681924 95645863 95614707 95587778 95560402 95537376 95526356 95518959
$$ packed form
1976.4I7980940n7006n5271l8350q696R680R745L803q690k1053k4491k6226k5881k5272
2002.9I7713232l3277n2262p5143r9129j25616j61666k05022k21700j91515j39052
2023.3I6408850o9082K3258P1764M0233r674k7197j3316J2582L3457L8015K7210Q583
2047.8I6544683r853j9091j8513j4383r024m297J281Q595R406M273j585j0300k2358
2074.3I6458834l5303m8387n7191n7906n5325n2923n1069n0962n3734n6255n4615n0027
2098.8I5835137m5967m3088m0436l6597k9522k2614k1202k1976j6707l415J1921K1994
2123.3I5587528K5296K4927K7322L5221M2879M4185L8719K9368J3745j473l487O6o986
2149.8I5857310k3049l5035l9357l9632l8313l6061l1156k6929k7376k3026j1020p397
$$ plain form
2174.3 95518959 95497984 95457524 95406246 95354992 95305872 95251942 95191091 95130289 95070630 95003277 94921726 94831407
2198.7 94831407 94738275 94637811 94527823 94416791 94314659 94222558 94137686 94062513 93997186 93932837 93860698
2221.2 93860698 93781286 93701351 93620515 93529391 93426836 93321019 93217349 93114418 93006724 92895466
2241.6 92895466 92789131 92687124 92579991 92470139 92372125 92291027 92215151 92132050 92041343 91945904 91841787
2264 91841787 91722637 91593367 91466528 91342664 91215920 91088998 90966487 90848142 90732056 90617174
2284.4 90617174 90503830 90391523 90276778 90154302 90024883 89895219 89765304 89627916 89482647 89336550
2304.8 89336550 89188576 89031351 88861972 88680810 88497412 88330203 88185227 88061142 87965000 87887377
2325.2 87887377 87799633 87693679 87585288 87484002 87382495 87278247 87180001 87088180 87002468 86934477 86881137
$$ packed form
2174.3I5518959k0975m0460n1278n1254m9120n3930o0851o0802n9659o7353q1551r0319
2198.7I4831407r3132j00464j09988j11032j02132r2101q4872p5173o5327o4349p2139
2221.2I3860698p9412p9935q0836r1124j02555j05817j03670j02931j07694j11258
2241.6I2895466j06335j02007j07133j09852r8014q1098p5876q3101r0707r5439j04117
2264I1841787j19150j29270j26839j23864j26744j26922j22511j18345j16086j14882
2284.4I0617174j13344j12307j14745j22476j29419j29664j29915j37388j45269j46097
2304.8H9336550j47974j57225j69379j81162j83398j67209j44976j24085r6142p7623
2325.2H7887377q7744j05954j08391j01286j01507j04248r8246r1821q5712o7991n3340
$$ plain form
2347.6 86881137 86807644 86678731 86487663 86267281 86051387 85841548 85643905 85493410 85408294 85378009
2368 85378009 85381538 85402113 85432583 85464901 85483342 85472184 85427082 85349745 85241377 85111105 84970927 84823072
2392.5 84823072 84664702 84491563 84302664 84102160 83891070 83668566 83439517 83210772 82980710 82746303
2412.9 82746303 82513332 82284707 82051098 81799370 81526053 81242216 80959040 80676436 80392349 80107558
2433.3 80107558 79819155 79520488 79208869 78894550 78593880 78312856 78056896 77845711 77695686 77597409
2453.7 77597409 77522516 77448285 77373499 77308238 77246225 77161872 77032089 76844692 76596498 76299959 75988686
2476.1 75988686 75697678 75434625 75187701 74952185 74736685 74543566 74365473 74209386 74095130 74029076
2496.5 74029076 73995721 73971474 73940820 73901337 73859853 73824978 73802197 73787338 73765385 73728645 73690873 73675603
$$ packed form
2347.6H6881137p3493j28913j91068k20382k15894k09839j97643j50495q5116l0285
2368H5378009L529K0575L0470L2318J8441j1158m5102p7337j08368j30272j40178j47855
2392.5H4823072j58370j73139j88899k00504k11090k22504k29049k28745k30062k34407
2412.9H2746303k32971k28625k33609k51728k73317k83837k83176k82604k84087k84791
2433.3H0107558k88403k98667l11619l14319l00670k81024k55960k11185j50025r8277
2453.7G7597409p4893p4231p4786o5261o2013q4353j29783j87397k48194k96539l11273
2476.1G5988686k91008k63053k46924k35516k15500j93119j78093j56087j14256o6054
2496.5G4029076l3355k4247l0654l9483m1484l4875k2781j4859k1953l6740l7772j5270
$$ plain form
2521 73675603 73687881 73699576 73663485 73534817 73290139 72937959 72510880 72053337 71605152 71183270 70786291
2543.4 70786291 70410669 70056683 69723427 69407010 69113404 68860871 68661451 68512237 68405187 68338025
2563.8 68338025 68318117 68350625 68432707 68565792 68751258 68978322 69227743 69483173 69731992 69956040
2584.2 69956040 70128900 70230931 70263034 70235276 70151711 70015776 69844830 69671279 69523245 69412416
2604.6 69412416 69349682 69355303 69441772 69600636 69813567 70069277 70361269 70679653 71019536 71391964
2625 71391964 71814167 72290981 72809565 73351067 73901081 74440384 74938059 75370049 75734848 76039547
2645.4 76039547 76280731 76448548 76541781 76560771 76495355 76337916 76097339 75790453 75425929 75004071
2665.8 75004071 74534142 74046737 73572016 73110920 72655010 72212058 71791917 71398371 71042633 70748556
$$ packed form
2521G3675603J2278J1695l6091j28668k44678l52180m27079m57543m48185m21882l96979
2543.4G0786291l75622l53986l33256l16417k93606k52533j99420j49214j07050o7162
2563.8F8338025j9908L2508Q2082J33085J85466K27064K49421K55430K48819K24048
2584.2F9956040J72860J02031L2103k7758q3565j35935j70946j73551j48034j10829
2604.6F9412416o2734N621Q6469J58864K12931K55710K91992L18384L39883L72428
2625G1391964M22203M76814N18584N41502N50014N39303M97675M31990L64799L04699
2645.4G6039547K41184J67817R3233J8990o5416j57439k40577l06886l64524m21858
2665.8G5004071m69929m87405m74721m61096m55910m42952m20141l93546l55738k94077
$$ plain form
2686.2 70748556 70543903 70444208 70443457 70522952 70666093 70861405 71090239 71322346 71534795 71725142 71897578
2708.6 71897578 72059506 72228509 72411376 72583234 72703755 72752601 72752100 72751260 72783959 72871447 73045129
2731.1 73045129 73322809 73693091 74128240 74600774 75100648 75625461 76159722 76682079 77179569 77638912
2751.4 77638912 78038496 78355825 78573781 78691530 78721589 78667200 78527564 78327680 78115165 77922773
2771.8 77922773 77755529 77609366 77478260 77341253 77170140 76963359 76747370 76541007 76332885 76107574
2792.2 76107574 75870949 75629765 75376701 75102353 74800676 74462259 74081969 73669982 73247826 72845411
2812.6 72845411 72498351 72231877 72048944 71933758 71863002 71813905 71768063 71721745 71682620 71652180 71620208
2835.1 71620208 71576929 71508223 71405786 71298140 71214402 71135849 71013391 70817173 70555413 70258856
$$ packed form
2686.2G0748556k04653r9695p51P9495J43141J95312K28834K32107K12449J90347J72436
2708.6G1897578J61928J69003J82867J71858J20521M8846n01q40L2699Q7488J73682
2731.1G3045129K77680L70282M35149M72534M99874N24813N34261N22357M97490M59343
2751.4G7638912L99584L17329K17956J17749L0059n4389j39636j99884k12515j92392
2771.8G7922773j67244j46163j31106j37007j71113k06781k15989k06363k08122k25311
2792.2G6107574k36625k41184k53064k74348l01677l38417l80290m11987m22156m02415
2812.6G2845411l47060k66474j82933j15186p0756m9097m5842m6318l9125l0440l1972
2835.1G1620208m3279o8706j02437j07646q3738p8553j22458j96218k61760k96557
$$ plain form
2855.5 70258856 69951630 69625431 69267786 68900323 68560958 68275619 68069422 67970234 67977136 68054962
2875.9 68054962 68164277 68276966 68375117 68445492 68465900 68405253 68242234 67977756 67620265 67160773
2896.3 67160773 66584748 65901887 65128988 64260024 63286299 62229997 61136109 60043412 58977371
2914.6 58977371 57954890 57001698 56165427 55494380 55002356 54659683 54408509 54173088 53882164 53522062
2935 53522062 53188205 53033239 53138232 53511500 54177076 55072963 55953521 56648690 57324362 58321995
2955.4 58321995 59764665 61427879 62998480 64311439 65350747 66153026 66755128 67203093 67539579
2973.8 67539579 67781520 67945868 68059903 68144739 68226987 68341720 68510634 68730998 68966222 69166911
2994.2 69166911 69319493 69430715 69506752 69557554 69581091 69574624 69551355 69510305 69417775 69259316 69077605
$$ packed form
2855.5G0258856l07226l26199l57645l67463l39365k85339k06197r9188O902P7826
2875.9F8054962J09315J12689R8151P0375K0408o0647j63019k64478l57491m59492
2896.3F7160773n76025o82861p72899q68964r73725j056302j093888j092697j066041
2914.6E8977371j022481r53192q36271o71047m92024l42673k51174k35421k90924l60102
2935E3522062l33857j54966J04993L73268O65576Q95887Q80558O95169O75672R97633
2955.4E8321995J442670J663214J570601J312959J039308Q02279O02102M47965L36486
2973.8F7539579K41941J64348J14035Q4836Q2248J14733J68914K20364K35224K00689
2994.2F9166911J52582J11222P6037N0802K3537o467k3269m1050r2530j58459j81711
$$ plain form
3016.6 69077605 68919849 68775254 68595165 68335527 67979848 67541546 67012101 66365689 65625179 64917618
3037 64917618 64448583 64323288 64458156 64689958 64892536 65008533 65013468 64914566 64751744 64540720 64287579
3059.4 64287579 64040625 63872451 63826197 63863587 63894552 63845408 63677675 63426650 63182753 62998706
3079.8 62998706 62873369 62754619 62545645 62190628 61699516 61102527 60466439 59871107 59335047 58798218
3100.2 58798218 58197409 57542104 56864977 56155813 55406541 54695302 54108638 53619862 53162748 52701664
3120.6 52701664 52226543 51768178 51369649 51056826 50849098 50771773 50845939 51056290 51336402 51615626
3141 51615626 51897347 52221465 52595580 53024840 53508437 54010224 54518276 55074018 55702901 56392628
3161.4 56392628 57121521 57878071 58664131 59478217 60309237 61144835 61978632 62804520 63611615 64390588
$$ packed form
3016.6F9077605j57756j44595j80089k59638l55679m38302n29445o46412p40510p07561
3037F4917618m69035j25295J34868K31802K02578J15997M935r8902j62822k11024k53141
3059.4F4287579k46954j68174m6254L7390L0965m9144j67733k51025k43897j84047
3079.8F2998706j25337j18750k08974l55017m91112n96989o36088n95332n36060n36829
3100.2E8798218o00809o55305o77127p09164p49272p11239n86664m88776m57114m61084
3120.6E2701664m75121m58365l98529l12823k07728p7325P4166K10351K80112K79224
3141E1615626K81721L24118L74115M29260M83597N01787N08052N55742O28883O89727
3161.4E6392628P28893P56550P86060Q14086Q31020Q35598Q33797Q25888Q07095P78973
$$ plain form
3181.8 64390588 65144473 65878594 66584355 67246628 67854458 68404239 68898511 69336450 69718128 70053929
3202.2 70053929 70355046 70626819 70868391 71078283 71258819 71409744 71534109 71642524 71742755 71840411
3222.6 71840411 71940935 72042167 72133911 72211730 72276390 72318649 72337908 72351825 72369862 72390884 72415662
3245 72415662 72431880 72424042 72405660 72393250 72377294 72340274 72283465 72220951 72157782 72093785 72034419 71975130
3269.5 71975130 71883583 71748501 71596426 71442014 71286660 71129692 70968330 70801109 70630509 70465976
3289.9 70465976 70297819 70101023 69872022 69621795 69371396 69147247 68944597 68719357 68435287 68105239
3310.3 68105239 67767888 67444235 67129451 66816831 66505158 66197813 65891999 65561748 65202272 64837331
3330.7 64837331 64475852 64125985 63788968 63430220 63030058 62608176 62173444 61740363 61330169 60907447
$$ packed form
3181.8F4390588P53885P34121P05761O62273O07830N49781M94272M37939L81678L35801
3202.2G0053929L01117K71773K41572K09892J80536J50925J24365J08415J00231R7656
3222.6G1840411J00524J01232R1744P7819O4660M2259J9259J3917J8037K1022K4778
3245G2415662J6218p838j8382j2410j5956l7020n6809o2514o3169o3997n9366n9289
3269.5G1975130r1547j35082j52075j54412j55354j56968j61362j67221j70600j64533
3289.9G0465976j68157j96796k29001k50227k50399k24149k02650k25240k84070l30048
3310.3F8105239l37351l23653l14784l12620l11673l07345l05814l30251l59476l64941
3330.7F4837331l61479l49867l37017l58748m00162m21882m34732m33081m10194m22722
$$ plain form
3351.1 60907447 60435349 59944540 59473538 59022522 58567679 58110440 57682014 57270986 56827289 56340301
3371.5 56340301 55861032 55431455 55036813 54655260 54280365 53917122 53582281 53295863 53065306 52840555
3391.9 52840555 52565378 52286243 52080494 51925331 51735777 51506108 51316899 51197231 51115465 51052570
3412.3 51052570 51002777 50980610 51013917 51090777 51186872 51319516 51509053 51740640 51978338 52221465 52483946
3434.7 52483946 52732044 52934945 53125918 53343779 53581464 53814644 54019147 54197609 54365474 54525906
3455.1 54525906 54692239 54869348 55019724 55140406 55283821 55445939 55561501 55611670 55657077 55747616
3475.5 55747616 55882019 56018639 56115621 56199342 56306165 56401426 56463695 56522393 56582320 56626219 56636453
3497.9 56636453 56626230 56615210 56572616 56496179 56442809 56435841 56463659 56501853 56538612 56609637 56750947 56961799
$$ packed form
3351.1F0907447m72098m90809m71002m51016m54843m57239m28426m11028m43697m86988
3371.5E6340301m79269m29577l94642l81553l74895l63243l34841k86418k30557k24751
3391.9E2840555k75177k79135k05749j55163j89554k29669j89209j19668q1766o2895
3412.3E1052570m9793k2167L3307P6860R6095J32644J89537K31587K37698K43127K62481
3434.7E2483946K48098K02901J90973K17861K37685K33180K04503J78462J67865J60432
3455.1E4525906J66333J77109J50376J20682J43415J62118J15562N0169M5407R0539
3475.5E5747616J34403J36620R6982Q3721J06823R5261O2269N8698N9927M3899J0234
3497.9E6636453j0223j1020m2594p6437n3370o968K7818L8194L6759P1025J41310K10852
$$ plain form
3522.4 56961799 57185340 57393116 57631499 57923609 58261746 58658004 59095412 59541988 60038704 60620350
3542.8 60620350 61258292 61895233 62523812 63201076 63936323 64684463 65454113 66270727 67101425 67910248
3563.2 67910248 68752462 69679284 70536774 71275288 72026581 72832423 73653048 74479228 75309116 76123714
3583.6 76123714 76948899 77791405 78555870 79249710 79980284 80743140 81489712 82228273 82942510 83611232
3604 83611232 84282792 85002953 85711789 86381364 87026203 87630695 88253832 88873410 89375496 89818287
3624.4 89818287 90312189 90902591 91414315 91744524 92020345 92250299 92404962 92532539 92731774 93096268
3644.8 93096268 93661022 94320190 94759637 94945347 95113456 95340145 95540810 95713729 95924306 96210420
3665.2 96210420 96588206 97048527 97458923 97758961 98035711 98202038 98263723 98337740 98449248 98611295
$$ packed form
3522.4E6961799K23541K07776K38383K92110L38137L96258M37408M46576M96716N81646
3542.8F0620350O37942O36941O28579O77264P35247P48140P69650Q16614Q30698Q08823
3563.2F7910248Q42214R26822Q57490P38514P51293Q05842Q20625Q26180Q29888Q14598
3583.6G6123714Q25185Q42506P64465O93840P30574P62856P46572P38561P14237O68722
3604H3611232O71560P20161P08836O69575O44839O04492O23137O19578N02086M42791
3624.4H9818287M93902N90402N11724L30209K75821K29954J54663J27577J99235L64494
3644.8I3096268N64754O59168M39447J85710J68109K26689K00665J72919K10577K86114
3665.2I6210420L77786M60321M10396L00038K76750J66327O1685P4017J11508J62047
$$ plain form
3685.6 98611295 98841977 99026680 99040055 99010342 99039918 99107319 99181104 99242800 99277413 99324095 99417412
3708 99417412 99523932 99561691 99526995 99502939 99520987 99565458 99612349 99644566 99654502 99664330 99726576 99860328
3732.5 99860328 99983203 100000000 99959779 99927747 99930429 99962533 99994630 100025952 100040913 99994367 99943829 99936944
3756.9 99936944 99937314 99904621 99874264 99878448 99893183 99889386 99849701 99800915 99795425 99841458 99880266 99864590 99837542
3783.5 99837542 99819803 99795407 99776721 99775177 99800628 99858510 99912137 99941939 99949473 99914926 99864691 99814963
3807.9 99814963 99775797 99782830 99844652 99925822 99979770 99994349 99940622 99859190 99822497 99820602 99836075 99872178
3832.4 99872178 99927580 99986708 100000000 99955159 99885452 99833697 99814683 99841964 99911445 99959636 99913245 99840117
3856.9 99840117 99803740 99814284 99846178 99852508 99847472 99866754 99883461 99868077 99835587 99815315 99827778 99844974
$$ packed form
3685.6I8611295K30682J84703J3375k9713K9576O7401P3785O1696L4613M6682R3317
3708I9417412J06520L7759l4696k4056J8048M4471M6891L2217R936R828O2246J33752
3732.5I9860328J22875J6797m0221l2032K682L2104L2097L1322J4961m6546n0538o885
3756.9I9936944L70l2693l0357M184J4735l797l9685m8786n490M6033L8808j5676k7048
3783.5I9837542j7739k4396j8686j544K5451N7882N3627K9802P534l4547n0235m9728
3807.9I9814963l9166P033O1822Q1170N3948J4579n3727q1432l6693j895J5473L6103
3832.4I9872178N5402N9128J3292m4841o9707n1755j9014K7281O9481M8191m6391p3128
3856.9I9840117l6377J0544L1894O330n036J9282J6707j5384l2490k0272J2463J7196
$$ plain form
3881.4 99844974 99840456 99816579 99768919 99734277 99724853 99704909 99690688 99721533 99782479 99819970 99814445 99785107
3905.8 99785107 99761170 99760270 99782622 99825776 99878561 99910444 99917024 99929225 99950624 99959123 99959773 99972534 99986446
3932.3 99986446 99978572 99960148 99956036 99970227 99988967 100000000 100011539 100031090 100043023 100041819 100040483 100045705 100055945
3958.9 100055945 100065100 100067019 100069618 100085664 100111139 100137234 100162315 100180709 100191891 100207281 100227726 100241399
3983.3 100241399 100246966 100250888 100252485 100255716 100268161 100283515 100294316
3997.6 100294316
$$ packed form
3881.4I9844974m518k3877m7660l4642r424j9944j4221L0845O0946L7491n525k9338
3905.8I9785107k3937r00K2352M3154N2785L1883O580J2201K1399Q499O50J2761J3912
3932.3I9986446p874j8424m112J4191J8740J1033J1539J9551J1933j204j336N222J0240
3958.9A00055945R155J919K599J6046K5475K6095K5081J8394J1182J5390K0445J3673
3983.3A00241399N567L922J597L231J2445J5354J0801
3997.6A00294316
##END=$$ End of the data block
