##TITLE=G2 - CuCl $$ Begin of the data block
##JCAMP-DX=5.00 $$ ACD/SpecManager v 10.08
##SPECTROMETER/DATA SYSTEM=Alpha
##DATE=15 Apr 2015 09:49:12
##DATA TYPE=INFRARED SPECTRUM
##DATA CLASS=XYDATA
##ORIGIN=
##OWNER=
##NPOINTS=1765
##FIRSTX=399.76428223
##LASTX=3997.64306641
##MAXX=3997.64306641
##MINX=399.76428223
##MAXY=1.00528705
##MINY=0.14911367
##XFACTOR=1.0000000000
##YFACTOR=0.000000010000000
##FIRSTY=1.00000000
##DELTAX=2.03961372
##XUNITS=1/CM
##YUNITS=ARBITRARY UNITS
##XYDATA=(X++(Y..Y))
399.8A00000000p81035p33835q87704j220506j366800j335758j434678j655543k470040
$$ 100000000 99218965 98485130 97597426 96376920 95010120 93674362 92239684 90584141 88114101
418.1H8114101l940690m832047m573041k13409O561232Q753812N506694K016718N75858
$$ 88114101 84173411 79341364 74768323 74554914 81116146 89869958 95376652 97393370 97969228
436.5I7969228L3319k81411l81142l37738l44086m42707m56381m36169n79256j031959
$$ 97969228 98002547 97721136 97339994 97002256 96658170 96215463 95759082 95322913 94743657 93711698
456.9I3711698j727217k595503m138547n616253m564846n8478M322851M690492K059054
$$ 93711698 91984481 89388978 85250431 79634178 75069332 75010854 79333705 84024197 86083251
475.2H6083251j00976j129067j283938m04566J027089J870418J742959J206720P16525
$$ 86083251 85982275 84853208 83569270 83164704 84191793 86062211 87805170 89011890 89728415
493.6H9728415K79713j40542m18991o40339j007819j228601p05850L17890P24304L61406
$$ 89728415 90008128 89867586 89448595 88808256 87800437 86571836 85865986 86183876 86908180 87269586
514H7269586N079q7536j81293l38906l87150l27552l57675n21267o45041p02840q92848
$$ 87269586 87274665 87187129 87005836 86666930 86279780 85952228 85594553 85073286 84428245 83725405 82832557
536.4H2832557j243037j529890j373315m30483R21112J613218J339412P47138K72888
$$ 82832557 81589520 80059630 78686315 78255832 79176944 80790162 82129574 82876712 83149600
554.8H3149600J80757O29902J106107J026285N89484K55459P9400q7422j93233j56867
$$ 83149600 83330357 83960259 85066366 86092651 86682135 86937594 87016994 86929572 86736339 86579472
575.2H6579472q9657q9545p9023L9756J81538K36767K56831L39973M20713L88706K97177
$$ 86579472 86489815 86400270 86321247 86361003 86542541 86779308 87036139 87376112 87796825 88185531 88482708
597.6H8482708K34329J30189j19001l04258o3824M66037O70635M27479K03275J85985
$$ 88482708 88717037 88847226 88728225 88423967 88360143 88826180 89496815 89924294 90127569 90313554
618I0313554J71834R2560P7021J24175R3746l3218j00934j08010k09916l78811m64404
$$ 90313554 90485388 90577948 90654969 90779144 90872890 90839672 90738738 90630728 90420812 90042001 89577597
640.4H9577597n11026p29662j237846k144193l667611m589176j893312L379220N766725
$$ 89577597 89066571 88336909 87099063 84954870 81287259 76698083 74804771 78183991 83950716
658.8H3950716M160404J883930O75315L01474J55229n0825j52516j51623j60098k32160
$$ 83950716 88111120 89995050 90670365 90971839 91127068 91076243 90923727 90772104 90612006 90379846
679.2I0379846k44200j61439j13380j54287j77300j30015j10466j86163k54214k36761
$$ 90379846 90135646 89974207 89860827 89706540 89529240 89399225 89288759 89102596 88848382 88611621
699.6H8611621k22105k96104l88897m22287m75287o46913r07832j205701j547223j653403
$$ 88611621 88389516 88093412 87704515 87282228 86806941 86160028 85252196 84046495 82499272 80845869
720H0845869j086814k93380k70515j211775k803832m962778o398040m346424J7976
$$ 80845869 79759055 79465675 79195160 77983385 75179553 70216775 63818735 59472311 59490287
738.3E9490287Q98719l556013r746632j3221779j1797622o965859j89734O065077P964141
$$ 59490287 60389006 56832993 47086361 33864582 22066960 15101101 14911367 20976444 28940585
756.7B8940585P638324Q377823P927930N157358K626544K307236L564459M338819L750461
$$ 28940585 36578909 44956732 52884662 58042020 60668564 62975800 66540259 70879078 74629539
775.1G4629539K919913L074938L632778L408497K769768K299178J405066o8873j229310
$$ 74629539 77549452 80624390 84257168 87665665 90435433 92734611 94139677 94070804 92841494
793.4I2841494j451820q65072J08433J008630J478552J446820J111531O49565j4519
$$ 92841494 91389674 90524602 90633035 91641665 93120217 94567037 95678568 96328133 96313614
811.8I6313614j106990k493614k887684q79043K066934K985823J880854O32406q7404
$$ 96313614 95206624 92713010 89825326 88946283 91013217 93999040 95879894 96512300 96424896
830.1I6424896m54253o22195p55144r49698j154310j342749j588470j839948j981151
$$ 96424896 95970643 95348448 94593304 93643606 92489296 91146547 89558077 87718129 85736978
848.5H5736978j823866p55281Q70502J349813K31046j497537l008545l426063k145564
$$ 85736978 83913112 83157831 84028333 85378146 85609192 84111655 81103110 77677047 75531483
866.8G5531483K7400J582569J792133J034873J38438l72410m49234l50165l22223m34470
$$ 75531483 75558883 77141452 78933585 79968458 80106896 79734486 79285252 78935087 78612864 78178394
887.2G8178394o74224r47887r97972n32460K91723P34370K43772j035071k739221m478126
$$ 78178394 77504170 76556283 75558311 75025851 75317574 76051944 76295716 75260645 72521424 68043298
907.6F8043298n054403k861988J724064O074989Q038801P373416N177295K922696J394296
$$ 68043298 62988895 60126907 61850971 67925960 75964761 83338177 88515472 91438168 92832464
926I2832464M57001k50089p30259q05390p39133r20165j101398j041162r76217n31322
$$ 92832464 93289465 93039376 92309117 91503727 90764594 89844429 88743031 87701869 86725652 86194330
946.4H6194330R15385K498138K785879J981503J211428Q59213P39569N01811j2612
$$ 86194330 87109715 89607853 92393732 94375235 95586663 96445876 97185445 97687256 97674644
964.7I7674644l71110k78771m8441J30594L08341L94308L32099J69343j8543j27739
$$ 97674644 97303534 97024763 96976322 97106916 97415257 97809565 98141664 98311007 98292464 98164725
985.1I8164725j40422j36191j54185k36607m42451p06685p80320n62566l99590n66310
$$ 98164725 98024303 97888112 97733927 97497320 97054869 96348184 95567864 95005298 94605708 94039398
1005.5I4039398q84926j211393j573026j820105j988107k609420m257596p178896r496135
$$ 94039398 93154472 91943079 90370053 88549948 86561841 83952421 79694825 72515929 63019794
1023.9F3019794o404894J436656N472124L481287P41636q35841j395625j112455j970876
$$ 63019794 56614900 58051556 63523680 67004967 67746603 66910762 65515137 64402682 62431806
1042.2F2431806m015565l474545J589715P749778J0246885Q318466M980600K476221
$$ 62431806 58416241 54941696 56531411 64281189 74528074 82846540 87827140 90303361
1058.6I0303361Q01003l61400o48368M60261J985616K013707P50673k45393o40410
$$ 90303361 91104364 90742964 90094596 90554857 92540473 94554180 95304853 95059460 94419050
1076.9I4419050q40562j074845j394349j828873k492899l541100n016178o329686n736070
$$ 94419050 93578488 92503643 91109294 89280421 86787522 83246422 78230244 71900558 66164488
1095.3F6164488j650298M269499P346922N345690J695627M18430J054562J843863K342207
$$ 66164488 64514190 68783689 76130611 81476301 83171928 83590358 84644920 86488783 88830990
1113.6H8830990J960700Q23850j18524o59078j123983j804906k822739l900707m080868
$$ 88830990 90791690 91615540 91497016 90837938 89713955 87909049 85086310 81185603 77104735
1132G7104735k574837k40767J529974K913779M227799M337049K577090k0236j738739
$$ 77104735 74529898 74289131 75819105 78732884 82960683 87297732 89874822 89854586 88115847
1150.3H8115847j819819j146364m57734N46986J766371K349312J905596R50920R8193
$$ 88115847 86296028 85149664 84691930 85238916 87005287 89354599 91260195 92211115 92309308
1168.7I2309308n29313j102030j727987k405733l172773m044556m784465m779720l302771
$$ 92309308 91779995 90677965 88949978 86544245 83371472 79326916 74542451 69762731 66459960
1187.1F6459960m14449K742499M972106N522043M400664K719969J597011J207906J136559
$$ 66459960 66045511 68788010 73760116 79282159 83682823 86402792 87999803 89207709 90344268
1205.4I0344268R17268M06229k00808p46601j268328j757264k025431j997096k025520
$$ 90344268 91261536 91667765 91466957 90720356 89452028 87694764 85669333 83672237 81646717
1223.8H1646717k576000l338504l175032j510566O32864J559222P59071q86059k480143
$$ 81646717 79070717 75732213 72557181 71046615 71679479 73238701 73997772 73111713 70631570
1242.1G0631570l561777l660274k705490j430613p35331j018208j979572k838260k842918
$$ 70631570 67069793 63409519 60704029 59273416 58538085 57519877 55540305 52702045 49859127
1260.5D9859127j677396Q43843M544661P809669Q950334P987523N971861L902453K299113
$$ 49859127 48181731 49025574 53570235 61379904 70330238 78317761 84289622 88192075 90491188
1278.8I0491188J231861N57625J01608k49404n75077r43464j393497j901979k328056
$$ 90491188 91723049 92280674 92382282 92132878 91557801 90614337 89220840 87318861 84990805
1297.2H4990805k450138k130252j534504j071518m05610J271564K745282J967013m66215
$$ 84990805 82540667 80410415 78875911 77804393 77398783 78670347 81415629 83382642 82916427
1315.6H2916427k857566m675901n023474k757877J789856N864650O346226L754049
$$ 82916427 80058861 75382960 70359486 67601609 69391465 75256115 81602341 85356390
1331.9H5356390J084131l07065q74078j175141j351023j491243j681763j893264k076179
$$ 85356390 86440521 86133456 85259378 84084237 82733214 81241971 79560208 77666944 75590765
1350.2G5590765k127641j984066j706457j538736j760262k264046k213818j573873
$$ 75590765 73463124 71479058 69772601 68233865 66473603 64209557 61995739 60421866
1366.6F0421866p97963P80004L004551M189110L606397K718997J876128R28849L52317
$$ 60421866 59623903 60403907 63408458 67597568 71203965 73922962 75799090 76727939 77080256
1384.9G7080256J65844P7623O0320R2458R1285O6477O9284Q5968R3812M7517j18715
$$ 77080256 77246100 77323723 77384043 77476501 77567786 77634263 77703547 77789515 77883327 77930844 77812129
1407.3G7812129l91173q07345j246774j626516k337956l433311l638661l711808m148751
$$ 77812129 77420956 76613611 75366837 73740321 71402365 67969054 64330393 60618585 56469834
1425.7E6469834m316265m517364m047710k931767k294696j387212M21903J850775J858053
$$ 56469834 52153569 47636205 43588495 40656728 38362032 36974820 37396723 39247498 41105551
1444.1D1105551N48002k52319R04206K250400K051529J190245M04138n23821j195571
$$ 41105551 41653553 41401234 42305440 44555840 46607369 47797614 48201752 47677931 46482360
1462.4D6482360n67096L359887P902273J0133279J0050827O272113K345717N05007
$$ 46482360 45915264 49275151 57177424 67310703 77361530 83633643 85979360 86484367
1478.7H6484367o00702j742375l145277m538411n668497p017839o505722k222198L616225
$$ 86484367 85883665 84141290 80996013 76457602 70789105 63771266 57265544 55043346 58659571
1497.1E8659571M570657K247912J817179L205526N866724N610591M374045L828442
$$ 58659571 63230228 65478140 67295319 70500845 76367569 81978160 86352205 90180647
1513.4I0180647K970142J997339J176334Q37022O89357N56952M04859K19351K03108
$$ 90180647 93150789 95148128 96324462 97161484 97850841 98407793 98812652 99032003 99235111
1531.8I9235111K12682J55502K12068J84637j84888m00287l81916k80112k35111k57635
$$ 99235111 99447793 99603295 99815363 100000000 99815112 99414825 99032909 98752797 98517686 98260051
1552.2I8260051k49523j44803l19303r61726q81052q05003j056582j873546l441746
$$ 98260051 98010528 97865725 97546422 96584696 95703644 94898641 93842059 91968513 88526767
1570.5H8526767l957331k597934Q22872K685648J021457r80753k359998l310847m469526
$$ 88526767 84569436 81971502 82794374 85480022 86501479 85520726 83160728 79849881 75380355
1588.9G5380355n864268o293554m546093j286310J233643J767695L28159k601540o394327
$$ 75380355 69516087 63222533 58676440 57390130 58623773 60391468 60719627 58118087 51723760
1607.2E1723760r441506q376414k242693P268709J5433326J2566382P132202M621685
$$ 51723760 42282254 33905840 31663147 38931856 54365182 66931564 74063766 78685451
1623.5G8685451K613395J446950R99856P53302P97450J064539R38857P37053P55274
$$ 78685451 81298846 82745796 83745652 84498954 85296404 86360943 87299800 88036853 88792127
1641.9H8792127P92748Q38977O89155M51142N93233O89554L44586L63720N41639O61892
$$ 88792127 89584875 90423852 91113007 91564149 92157382 92846936 93191522 93555242 94096881 94758773
1662.3I4758773O07443N34165N95486N31703K86394J42151N0909P2419K36994M19772
$$ 94758773 95366216 95900381 96495867 97027570 97313964 97456115 97507024 97579443 97816437 98236209
1682.7I8236209M25732J63108O1113N0801Q0144J35917J01346J5056q6069p6252k9177
$$ 98236209 98661941 98825049 98886162 98936963 99017107 99153024 99254370 99269426 99183357 99107105 99077928
1705.1I9077928o2591p3862j1462N2959P5012l4171j81341j38980o0457j5700L8469
$$ 99077928 99015337 98941475 98930013 98982972 99057984 99023813 98842472 98703492 98643035 98627335 98665804
1727.6I8665804R5760J15288N0896n7685J1706J29664J63055J59835J56546J29420
$$ 98665804 98761564 98876852 98927748 98870063 98881769 99011433 99174488 99334323 99490869 99620289
1748I9620289L5929o2620m7344K604J5188L8868M0662J9801N8448J11902J25497M0776
$$ 99620289 99656218 99593598 99546254 99548858 99564046 99602914 99643576 99663377 99721825 99833727 99959224 100000000
1772.4A00000000q3828j10161q7470j07390j50358j63371j15269m41Q6069N5885Q321
$$ 100000000 99916172 99806011 99718541 99611151 99460793 99297422 99182153 99181712 99267781 99323666 99331987
1794.9I9331987M5425P3361L3218j8257j3554J4442K1779N395n973k300j5349k4354
$$ 99331987 99377412 99450773 99483991 99465734 99452180 99466622 99488401 99493796 99487823 99485523 99470174 99445820
1819.4I9445820N406L5816K6733K9969K7258n0134j03509q9717m2343K2143O0183J7136
$$ 99445820 99451226 99487042 99513775 99543744 99571002 99520868 99417359 99327642 99285299 99307442 99367625 99384761
1843.8I9384761p5907j17266j29258j25856j14941j36578j85258j96760j20265J4496
$$ 99384761 99308854 99191588 99062330 98936474 98821533 98684955 98499697 98302937 98182672 98197168
1864.2I8197168J38611J99598J68919J03683L8647m5383j10018j34557j38432j08350
$$ 98197168 98335779 98535377 98704296 98807979 98846626 98801243 98691225 98556668 98418236 98309886
1884.6I8309886k0873O9570Q8191P7427Q7041Q1467M8232J312m6838q9383j40935k06959
$$ 98309886 98289013 98358583 98446774 98524201 98611242 98692709 98740941 98742253 98695415 98606032 98465097 98258138
1909.1I8258138k41417j99336j07121k6322K8640P9465R1976M4292j4883o7729j08504
$$ 98258138 98016721 97817385 97710264 97683942 97712582 97792047 97884023 97928315 97913432 97845703 97737199
1931.5I7737199j21504j16891j06257p9989m1521O330Q4841J69164J99575J53559O1482
$$ 97737199 97615695 97498804 97392547 97312558 97271037 97277367 97362208 97531372 97730947 97884506 97945988
1954I7945988k9313r3389j35422j73211k08783k45261k44326j29002O1900K13801K76941
$$ 97945988 97916675 97823286 97687864 97514653 97305870 97060609 96816283 96687281 96749181 96962982 97239923
1976.4I7239923K76703K43944J80250Q7440l349o7842j20718j74784j80805j17314
$$ 97239923 97516626 97760570 97940820 98028260 98024911 97957069 97836351 97661567 97480762 97363448
1996.8I7363448l5548J4281J1671k1082m7654o1429p3516p7814p5191r4498j33764
$$ 97363448 97327900 97342181 97353852 97332770 97285116 97223687 97150171 97072357 96997166 96902668 96768904
2019.2I6768904j52195j43796j07181m1223r513l5709o7573q6320q9472o3134j8251
$$ 96768904 96616709 96472913 96365732 96324509 96314996 96279287 96211714 96125394 96035922 95972788 95954537
2041.7I5954537J8698M0722N5951O4069N9557M8894M2385K9933q637o1899j06061j39945
$$ 95954537 95973235 96013957 96069908 96133977 96193534 96242428 96284813 96314746 96306109 96244210 96138149 95998204
2066.2I5998204j63961j74403j70725j59014j45894j26588q9425l8767J329J9568K6667
$$ 95998204 95834243 95659840 95489115 95330101 95184207 95057619 94968194 94929427 94930756 94950324 94976991
2088.6I4976991K9171J7101j7077n9372r1142j18285j51336j79101j86955j81586j79583
$$ 94976991 95006162 95023263 95006186 94946814 94855672 94737387 94586051 94406950 94219995 94038409 93858826
2111I3858826j78355j63281j32376j01006q5288q0550p4100p1192p5102p5418p3856
$$ 93858826 93680471 93517190 93384814 93283808 93198520 93117970 93043870 92972678 92897576 92822158 92748302
2133.5I2748302q1867r4485r6673r3049r7769j08683j18482j26016j34284j45823j52516
$$ 92748302 92666435 92571950 92475277 92382228 92284459 92175776 92057294 91931278 91796994 91651171 91498655
2155.9I1498655j42562j15544q0645m7219k1422j484K1088M0078M0716K4510J639k0552
$$ 91498655 91356093 91240549 91159904 91112685 91091263 91089779 91110867 91150945 91191661 91216171 91217810 91197258
2180.4I1197258l2574k7048r311J3006M5067Q8400J31118J58847J60110J39045J13660
$$ 91197258 91164684 91137636 91128325 91141331 91186398 91274798 91405916 91564763 91724873 91863918 91977578
2202.8I1977578R2757O9320M0108J2553j2034l7754o5350r4348j22512j43802j45239
$$ 91977578 92070335 92139655 92179763 92192316 92180282 92142528 92077178 91982830 91860318 91716516 91571277
2225.2I1571277j16080o6155j1229N0068J22809J83535J93572J47628P9906K4736j1688
$$ 91571277 91455197 91389042 91377813 91427881 91550690 91734225 91927797 92075425 92155331 92180067 92168379
2247.7I2168379l5656m7183n1504o4117r1827j28931j69605k02977k08414j67829r5182
$$ 92168379 92132723 92085540 92034036 91969919 91878092 91749161 91579556 91376579 91168165 91000336 90905154
2270.1I0905154l7712j3155J2916N9999J02216J13737J03545Q8060O3169K8384n388
$$ 90905154 90867442 90854287 90867203 90927202 91029418 91143155 91246700 91334760 91397929 91426313 91420925
2292.5I1420925k9993m3518n1975n9098o4558q0609j21552j70266j92994j83338j61940
$$ 91420925 91390932 91347414 91295439 91236341 91171783 91091174 90969622 90799356 90606362 90423024 90261084
2315I0261084j48076j43313j35303j18148r4146o9499n6219o4152r2340j20562j35011
$$ 90261084 90113008 89969695 89834392 89716244 89622098 89552599 89496380 89432228 89339888 89219326 89084315
2337.4H9084315j45089j51384j41615j13326q3816r1070j45328k08241k31010k26134
$$ 89084315 88939226 88787842 88646227 88532901 88449085 88358015 88212687 88004446 87773436 87547302
2357.8H7547302j99467j42270r5266q1623p0911m9442l2831l4666m8154n7936o4629
$$ 87547302 87347835 87205565 87110299 87028676 86957765 86908323 86875492 86840826 86792672 86734736 86670107
2380.2H6670107p7296r7912j20753j43570j70648j94252j98292j82420j58161j29938
$$ 86670107 86592811 86494899 86374146 86230576 86059928 85865676 85667384 85484964 85326803 85196865
2400.6H5196865r5690o9910p5656j07849j44505j80590k22403k68823l05736l20632
$$ 85196865 85101175 85031265 84955609 84847760 84703255 84522665 84300262 84031439 83725703 83405071
2421H3405071l23760l27289l18694k85429k43145k13456k02060k09314k34586k59071
$$ 83405071 83081311 82754022 82435328 82149899 81906754 81693298 81491238 81281924 81047338 80788267
2441.4H0788267k52432k08944j55741j23018j16855j27727j46913j69778j88834j91986
$$ 80788267 80535835 80326891 80171150 80048132 79931277 79803550 79656637 79486859 79298025 79106039
2461.8G9106039j85919j89143j99229k06310k12407k26760k55215k86513l10236l26753
$$ 79106039 78920120 78730977 78531748 78325438 78113031 77886271 77631056 77344543 77034307 76707554
2482.2G6707554l22986k88218k38603j97691j76329j71083j81484k12872k52384k71696
$$ 76707554 76384568 76096350 75857747 75660056 75483727 75312644 75131160 74918288 74665904 74394208
2502.6G4394208k56228k22570j99956j97798k02655k05893k07680j95825j66440j39684
$$ 74394208 74137980 73915410 73715454 73517656 73315001 73109108 72901428 72705603 72539163 72399479
2523G2399479j37871j67483k19119k67988k91455k91217k77608k58452k40678k22838
$$ 72399479 72261608 72094125 71875006 71607018 71315563 71024346 70746738 70488286 70247608 70024770
2543.4G0024770k00861j80626j70523j74576j96731k28083k51770k73687l08734l48497
$$ 70024770 69823909 69643283 69472760 69298184 69101453 68873370 68621600 68347913 68039179 67690682
2563.8F7690682l78233l98928m18484m36884m45229m41688m28975m00621l55440k99632
$$ 67690682 67312449 66913521 66495037 66058153 65612924 65171236 64742261 64341640 63986200 63686568
2584.2F3686568k36136j63287q1641P04P7545J44798J98495K35516K55668K53803K22731
$$ 63686568 63450432 63287145 63205504 63206208 63283753 63428551 63627046 63862562 64118230 64372033 64594764
2606.6F4594764J73497J17868N9765Q244l0416n6416p2885q0454p6038o4331n1349
$$ 64594764 64768261 64886129 64945894 64954138 64923722 64867306 64794421 64713967 64637929 64573598 64522249
2629.1F4522249k8247J4824O7561J04851J15031J09506R8359P9847N0741J1456l6138
$$ 64522249 64494002 64508826 64576387 64681238 64796269 64905775 65004134 65083981 65134722 65146178 65110040
2651.5F5110040r4176j66493k49183l31176m10443m86791n49084n94569o19238o19793
$$ 65110040 65015864 64849371 64600188 64269012 63858569 63371778 62822694 62228125 61608887 60989094
2671.9F0989094o09356n89556n53930n00780m19432l06791j88690r4146k5344L4088
$$ 60989094 60379738 59790182 59236252 58735472 58316040 58009249 57820559 57726413 57701069 57735157
2692.3E7735157Q6933J21779J36560J34063J19125R8002P4727N1379L0243K2835L8201
$$ 57735157 57822090 57943869 58080429 58214492 58333617 58431619 58506346 58557725 58587968 58610803 58649004
2714.7E8649004P1823J08820J25277J12629Q9318O6238M0704J1969j7977l2293j4234
$$ 58649004 58720827 58829647 58954924 59067553 59156871 59223109 59263813 59275782 59257805 59225512 59211278
2737.2E9211278L3748J06955J96594K77298L24422L40248L36718L08156K62851K21210
$$ 59211278 59245026 59351981 59548575 59825873 60150295 60490543 60827261 61135417 61398268 61619478
2757.6F1619478J84137J42825Q7470J7345n9236j32894j93030k38645k71910k87122
$$ 61619478 61803615 61946440 62033910 62051255 61992019 61859125 61666095 61427450 61155540 60868418
2778F0868418k91723l07113l42381l86119m23419m44228m32360l89385l56573l78710
$$ 60868418 60576695 60269582 59927201 59541082 59117663 58673435 58241075 57851690 57495117 57116407
2798.4E7116407m42123m90761n06806m98939m73225m50057m36819m22304m13478m09889
$$ 57116407 56674284 56183523 55676717 55177778 54704553 54254496 53817677 53395373 52981895 52572006
2818.8E2572006l90506l52829l09647k70986k44010k27928k18916k14022k07842k09477
$$ 52572006 52181500 51828671 51519024 51248038 51004028 50776100 50557184 50343162 50135320 49925843
2839.1D9925843k20943k21985k10479k02888k17668k66277l45344m44060n50685o45825
$$ 49925843 49704900 49482915 49272436 49069548 48851880 48585603 48240259 47796199 47245514 46599689
2859.5D6599689o96346o72862n67481l90461j88136l0297P8288J76853K40510K17319
$$ 46599689 45903343 45230481 44663000 44272539 44084403 44054106 44132394 44309247 44549757 44767076
2879.9D4767076J35860P9080Q9124J42732J95363K22916K15840J73548J15719O4567
$$ 44767076 44902936 44982016 45071140 45213872 45409235 45632151 45847991 46021539 46137258 46201825
2900.3D6201825K1187j9950n6502q3298j02976j31538j81571k69234m54226q19010
$$ 46201825 46223012 46203062 46146560 46063262 45960286 45828748 45647177 45377943 44923717 44104707
2920.7D4104707j224071j140272l04735O51202J016113Q55312N62951L31288J90780
$$ 44104707 42880636 41740364 41435629 42086831 43102944 43958256 44521207 44852495 45043275
2939.1D5043275J27434Q9989Q821j33482k68909k92262j56269J18003M44114O71658
$$ 45043275 45170709 45260698 45269519 45136037 44867128 44574866 44418597 44536600 44980714 45652372
2959.5D5652372P08416N90452M13248K50116J33711P2936N7789P7117J23715J60432
$$ 45652372 46360788 46951240 47364488 47614604 47748315 47821251 47879040 47956157 48079872 48240304
2979.9D8240304J53190J19120Q1989M3011J87n0485j02317j38396j68485k04661k34565
$$ 48240304 48393494 48512614 48594603 48637614 48637801 48587316 48484999 48346603 48178118 47973457 47738892
3002.3D7738892k67148l28842m14708m96185n42700n35271n08511n42152o62509p26646
$$ 47738892 47471744 47142902 46728194 46232009 45689309 45154038 44645527 44103375 43440866 42714220
3022.7D2714220n02714l0494K89881K38464M6518p1171j30767j53714j46136j19558
$$ 42714220 42211506 42181012 42470893 42709357 42755875 42684704 42553937 42400223 42254087 42134529
3043.1D2134529p0381k8637l9640j21662k20683k44904j83612j13100j17403k01067
$$ 42134529 42064148 42035511 41995871 41874209 41653526 41408622 41225010 41111910 40994507 40793440
3063.5D0793440k73174k72358k11361r2852O6799J76558J29953n3072k18007k91050
$$ 40793440 40520266 40247908 40036547 39943695 40010494 40187052 40317005 40263933 40045926 39754876
3083.9C9754876l20762l11834k70783k83030l79926n06452o23843p49504q83282r64862
$$ 39754876 39434114 39122280 38851497 38568467 38188541 37682089 37058246 36308742 35425460 34460598
3104.3C4460598r77775r77853r86892r39971q33512p45830o63727n21335k97490k8399
$$ 34460598 33482823 32504970 31518078 30578107 29744595 28998765 28335038 27813703 27516213 27487814
3124.7B7487814K08307L64250M42275M80646N18391N46586N21904M38741L54537K95508
$$ 27487814 27696121 28060371 28502646 28983292 29501683 30048269 30570173 31008914 31363451 31658959
3145.1C1658959K40454J89564J28976L3921n7945q7118o0436j3575M0045R1457J22810
$$ 31658959 31899413 32088977 32217953 32251874 32193929 32106811 32046375 32032800 32072845 32164302 32287112
3167.5C2287112J21114J02114R1043R3344R8473R6601Q6323P5668O9564N9662L3509
$$ 32287112 32408226 32510340 32601383 32694727 32793200 32889801 32976124 33051792 33121356 33181018 33214527
3189.9C3214527n695m1032o6837q4243q9499p9077m8584P307Q1885J64977K44370L05039
$$ 33214527 33208832 33167800 33100963 33016720 32927221 32848144 32799560 32806867 32888752 33053729 33298099 33603138
3214.4C3603138L42497L64914L76988L65850L23698K54959J67987P4354j8055j10092
$$ 33603138 33945635 34310549 34687537 35053387 35377085 35632044 35800031 35874385 35856330 35746238
3234.8C5746238j92038k48995k85360l08809l25248l49795l78600l77795l45114l17007
$$ 35746238 35554200 35305205 35019845 34711036 34385788 34035993 33657393 33279598 32934484 32617477
3255.2C2617477l10833l04395k77710k39795j99053j45370r2622p9996p9363m6307
$$ 32617477 32306644 32002249 31724539 31484744 31285691 31140321 31047699 30967703 30888340 30842033
3275.6C0842033L603N5733J04475J44214J76448K10705K56747K82678K68942K45726
$$ 30842033 30845636 30901369 31005844 31150058 31326506 31537211 31793958 32076636 32345578 32591304
3296C2591304K26644K30723K74715L09944K75839J91325J20717R2211Q8037Q0031O5809
$$ 32591304 32817948 33048671 33323386 33633330 33909169 34100494 34221211 34313422 34401459 34481490 34547299
3318.4C4547299N5316N4881N1901J9917r790N811L6139O7672J01545R3266O0359N4750
$$ 34547299 34602615 34657496 34709397 34729314 34719524 34725335 34761474 34829146 34930691 35023957 35084316 35139066
3342.9C5139066N8669P6452J11803R3162L4458K7009O6546R0659Q2028Q6090J41045
$$ 35139066 35197735 35274187 35385990 35479152 35513610 35540619 35607165 35697824 35779852 35865942 36006987
3365.4C6006987J89549J70007J31792J63409K50623L11222L39848L61285L87871M27088
$$ 36006987 36196536 36366543 36498335 36661744 36912367 37223589 37563437 37924722 38312593 38739681
3385.7C8739681M75508N18745N08622M50539M36744M91625N16335M55948M03199M43318
$$ 38739681 39215189 39733934 40242556 40693095 41129839 41621464 42137799 42593747 42996946 43440264
3406.1D3440264N04351N13598M95637M72146M61775M79433M88067M67831M57611M69247
$$ 43440264 43944615 44458213 44953850 45425996 45887771 46367204 46855271 47323102 47780713 48249960
3426.5D8249960M73899M46209M21205M18758L80171L09944K87563L09425L14343K87813
$$ 48249960 48723859 49170068 49591273 50010031 50390202 50700146 50987709 51297134 51611477 51899290
3446.9E1899290K40958K00081J65528J26803Q9371L8135m1068q9979n8216m154K8449
$$ 51899290 52140248 52340329 52505857 52632660 52722031 52760166 52719098 52629119 52570903 52566749 52595198
3469.4E2595198R2596K43115M32796O02996P19506P69782Q10402Q62956Q72380Q37040
$$ 52595198 52687794 52930909 53363705 53966701 54686207 55455989 56266391 57129347 58001727 58838767
3489.8E8838767Q08191P85482P48861O88827O39200O14834N53936M71735M45676M54592
$$ 58838767 59646958 60432440 61181301 61870128 62509328 63124162 63678098 64149833 64595509 65050101
3510.2F5050101M46171M02194L38727L03668L05039K95210K17217J14059N4235J7559
$$ 65050101 65496272 65898466 66237193 66540861 66845900 67141110 67358327 67472386 67526621 67544180
3530.6F7544180j4359m4882j06394j75405j85597j82599k42340l30401l20750k24400
$$ 67544180 67529821 67484939 67378545 67203140 67017543 66834944 66592604 66262203 65941453 65717053
3551F5717053j14882L7855K44624M61453O39671P67595R16499J075923J039970R25422
$$ 65717053 65602171 65640026 65884650 66346103 66985774 67753369 68669868 69745791 70785761 71711183
3571.3G1711183R24247R57954R57960R45032R24158Q97908R01639Q91435P98548P41929
$$ 71711183 72635430 73593384 74551344 75496376 76420534 77318442 78220081 79111516 79910064 80651993
3591.7H0651993P82489Q05635P76791P47234P11089O77920O79516O98203O67805O19203
$$ 80651993 81434482 82240117 83016908 83764142 84475231 85153151 85832667 86530870 87198675 87817878
3612.1H7817878N80817N42843N44912N11920M17185L98493M54444M89646L97831L10278
$$ 87817878 88398695 88941538 89486450 89998370 90415555 90814048 91268492 91758138 92155969 92466247
3632.5I2466247L30675L57747L68464L81827L95924M33582N04452N06437L21996K08968
$$ 92466247 92796922 93154669 93523133 93904960 94300884 94734466 95238918 95745355 96067351 96276319
3652.9I6276319K72685L30848K87849K41285K26933K40296K68698K47627J71918J41984
$$ 96276319 96549004 96879852 97167701 97408986 97635919 97876215 98144913 98392540 98564458 98706442
3673.3I8706442R3275m756N382O3819J20145J95336K49666J52070j6761k5654M0060
$$ 98706442 98799717 98794961 98800343 98864162 98984307 99179643 99429309 99581379 99564618 99538964 99579024
3695.8I9579024P7331P7951M1372P731L8957R5171Q2463l9876j09201n7340P8K2834
$$ 99579024 99656355 99734306 99775678 99783409 99822366 99917537 100000000 99960124 99850923 99793583 99793661 99816495
3720.2I9816495J5664q386k8354m309N9878J02157M6855k6304m5233J1736M1574J5312
$$ 99816495 99832159 99823773 99795419 99791110 99850988 99953145 100000000 99973696 99928463 99940199 99981773 99997085
3744.7I9997085K5183M8793k5940r3007l7009J2791j4478n9485m2004n018N340j1444
$$ 99997085 100022268 100071061 100045121 99952114 99915105 99927896 99913418 99853933 99811929 99806911 99812251 99800807
3769.2I9800807m1330l2991J5938N4789K7382k4378k1869j5908j9938n376J3786L6860
$$ 99800807 99759477 99726486 99742424 99797213 99824595 99800217 99778348 99762440 99742502 99737126 99750912 99787772
3793.7I9787772N3942O1399N5498r615n0270l5829n4252m0030K8163P4953N7596M5764
$$ 99787772 99841714 99903113 99958611 99948996 99898726 99862897 99808645 99768615 99796778 99871731 99929327 99975091
3818.1I9975091K5493o8998p3815j2374J2821K1476L2818N6541M0937m3839q6296p3677
$$ 99975091 100000584 99931586 99857771 99845397 99858218 99879694 99912512 99969053 100009990 99966151 99879855 99806178
3842.6I9806178o2555j5927O8355J13195P135j39082p3635J5270N7859N6546K5011
$$ 99806178 99743623 99727696 99796051 99909246 99916381 99777299 99703664 99718934 99776793 99833339 99858350
3865I9858350L5870L6960k1827o2930n6845m024K6757p87j2952l1084l5643M542l326
$$ 99858350 99894220 99931180 99909353 99846423 99789578 99785554 99812311 99811524 99798572 99767488 99731845 99736387 99733061
3891.6I9733061k4403J1009L6306K0581j1104n2613p5507l8326J8996O1053Q9890R1266
$$ 99733061 99708658 99719667 99755973 99776554 99765450 99712837 99637330 99599004 99618000 99679053 99768943 99860209
3916I9860209N7376L2448L7235K9505Q118N233J204k3019l4428j6296J1057K5690J0854
$$ 99860209 99917585 99950033 99987268 100016773 100024891 100030124 100031328 100008309 99973881 99957585 99968642 99994332 100005186
3942.5A00005186n186k420p665j5825j1212J037J8162L0762K6953J2243L552M268J0908
$$ 100005186 100000000 99997580 99989915 99974090 99962878 99963915 99982077 100012839 100039792 100052035 100055587 100059855 100070763
3969.1A00070763K1672K7132K6405K6834L0601M1318M9758M4083L8040L6716L2068
$$ 100070763 100092435 100119567 100145972 100172806 100203407 100244725 100294483 100338566 100376606 100413322 100445390
3991.5A00445390K8133K6095K9087
$$ 100445390 100473523 100499618 100528705
3997.6A00528705
$$ 100528705
##END=$$ End of the data block
