##TITLE=G18-52-SE $$ Begin of the data block
##JCAMP-DX=5.00 $$ ACD/SpecManager v 10.08
##SPECTROMETER/DATA SYSTEM=Alpha
##DATE=21 Oct 2013 11:04:12
##DATA TYPE=INFRARED SPECTRUM
##DATA CLASS=XYDATA
##ORIGIN=
##OWNER=
##NPOINTS=1765
##FIRSTX=399.75695801
##LASTX=3997.56933594
##MAXX=3997.56933594
##MINX=399.75695801
##MAXY=0.79703832
##MINY=0.20305713
##XFACTOR=1.0000000000
##YFACTOR=1.000000000000000e-9
##FIRSTY=0.48309869
##DELTAX=2.03957629
##XUNITS=1/CM
##YUNITS=ARBITRARY UNITS
##XYDATA=(X++(Y..Y))
$$ plain form
399.8 483098686 479606479 477051258 474524379 473158658 473503679 474410802 474932879 474860221 474266618
418.1 474266618 473210752 471658379 469612986 467858523 466827124 465483189 463524133 462020129
434.4 462020129 461493134 461561084 461862266 462697536 464178324 465308279 465412647 465017825 464764118 464414060
454.8 464414060 463019371 460636467 458466291 456389219 453811705 451213360 449356258 447711438
471.1 447711438 445220709 442571133 440893143 439900130 438867092 437777936 436940372 436176926 435016483
489.5 435016483 433269054 431279868 429501593 427656382 425293058 422735780 420474529 418098927
505.8 418098927 414964557 411638021 408941299 406522989 403806359 401089251 398997366 397515953
522.1 397515953 396341324 395493537 395141691 395354778 396114647 397401512 399370819 401905268 404313564
$$ packed form
399.8D83098686l492207k555221k526879j365721L45021R07123N22077p2658n93603
418.1D74266618j055866j552373k045393j754463j031399j343935j959056j504004
434.4D62020129n26995O7950L01182Q35270J480788J129955J04368l94822k53707l50058
454.8D64414060j394689k382904k170176k077072k577514k598345j857102j644820
471.1D47711438k490729k649576j677990r93013j033038j089156q37564p63446j160443
489.5D35016483j747429j989186j778275j845211k363324k557278k261251k375602
505.8D18098927l134370l326536k696722k418310k716630k717108k091885j481413
522.1C97515953j174629q47787l51846K13087P59869J286865J969307K534449K408296
$$ plain form
540.5 404313564 406082481 407138199 407552868 407389283 406674385 405612737 404456735 403137714 401445448
558.8 401445448 399474621 397444427 395275354 392815441 390457690 388808489 387978166 387977928 388922185
577.2 388922185 390713245 393183500 396096826 399068654 401686162 403638631 404921025 405596823 405818760
595.6 405818760 405900836 405982554 406076282 406150252 406200945 406304300 406426013 406609863 407060772 407760024 408718795
618 408718795 410109699 412030071 414507776 417320967 420085251 422596842 424905092 427051038 429037124
636.3 429037124 430825174 432380736 433807254 435137808 436254174 437124342 437787831 438312680 438755274
654.7 438755274 439064741 439294487 439578056 439957678 440463632 441222578 442296505 443400562 444608271
673.1 444608271 446032286 447640449 449335366 450937092 452313542 453450203 454407215 455111742 455314934
$$ packed form
540.5D04313564J768917J055718M14669j63585p14898j061648j156002j319021j692266
558.8D01445448j970827k030194k169073k459913k357751j649201q30323k38R44257
577.2C88922185J791060K470255K913326K971828K617508J952469J282394O75798K21937
595.6D05818760Q2076Q1718R3728P3970N0693J03355J21713J83850M50909O99252R58771
618D08718795J390904J920372K477705K813191K764284K511591K308250K145946J986086
636.3D29037124J788050J555562J426518J330554J116366Q70168O63489N24849M42594
654.7D38755274L09467K29746K83569L79622N05954P58946J073927J104057J207709
673.1D44608271J424015J608163J694917J601726J376450J136661R57012P04527K03192
$$ plain form
691.4 455314934 454890907 454050839 453161150 452634692 452804416 453745782 455329716 457369208 459727943
709.8 459727943 462481618 465734392 469344109 473129481 477188587 481737465 486650318 491485864
726.1 491485864 495865822 499879152 503638029 506765246 509014666 510690331 512148142 513271868
742.4 513271868 513767004 513759553 513743043 513751447 513379097 512458324 511232793 510140479 509358644 508871496
762.8 508871496 509061396 510471165 513125002 516815603 521371305 526648581 532327473 537708580 542378426
781.2 542378426 546550214 550332129 553400338 555745542 557866693 560117424 562389195 564689815
797.5 564689815 567487359 571027875 574723303 577808678 580378890 582962871 585412621 586971760
813.8 586971760 587576687 587956131 588301599 587986827 586617112 584644914 582687736 580641329 578094006
$$ packed form
691.4D55314934m24027q40068q89689n26458J69724R41366J583934K039492K358735
709.8D59727943K753675L252774L609717L785372M059106M548878M912853M835546
726.1D91485864M379958M013330L758877L127217K249420J675665J457811J123726
742.4E13271868M95136p451j6510Q404l72350r20773j225531j092314p81835m87148
762.8E08871496J89900J409769K653837L690601M555702N277276N678892N381107M669846
781.2E42378426M171788L781915L068209K345204K121151K250731K271771K300620
797.5E64689815K797544L540516L695428L085375K570212K583981K449750J559139
813.8E86971760O04927L79444L45468l14772j369715j972198j957178k046407k547323
$$ plain form
832.1 578094006 575342476 572931349 570675731 568106294 565434277 563321292 561865807 560504794
848.5 560504794 559072554 558097363 557740688 557429790 557069957 557917476 561199009 566410303 572238207
866.8 572238207 578321517 584694088 590444505 594261169 595892251 596046209 594817758 591663480 586920798
885.2 586920798 581783772 576874614 571842194 566506445 561473787 557057559 552582800 547334611
901.5 547334611 541432619 535270512 528671801 521298707 513489664 506059587 499411911 493477374
917.8 493477374 488560617 485290825 483553976 482401788 481205910 480258375 479925394 479804903 479368240
936.2 479368240 478787839 478367090 477548033 475088269 470234871 463180214 454430610 444412768 433686793
954.5 433686793 422858596 412114024 401287377 390324503 379471302 368968129 358865708
$$ packed form
832.1E78094006k751530k411127k255618k569437k672017k112985j455485j361013
848.5E60504794j432240r75191l56675l10898l59833Q47519L281533N211294N827904
866.8E72238207O083310O372571N750417L816664J631082J53958j228451l154278m742682
885.2E86920798n137026m909158n032420n335749n032658m416228m474759n248189
901.5E47334611n901992o162107o598711p373094p809043p430077o647676n934537
917.8D93477374m916757l269792j736849j152188j195878r47535l32981j20491m36663
936.2D79368240n80401m20749q19057k459764m853398p054657q749604j0017842j0725975
954.5D33686793j0828197j0744572j0826647j0962874j0853201j0503173j0102421
$$ plain form
968.8 358865708 349315077 340652913 333192408 327018708 321997792 318032593 315096557 312957585
985.1 312957585 311233342 309680670 308246642 306976318 305901140 305062592 304574996 304493755 304612219
1003.5 304612219 304493099 303806007 302544892 300868332 298911661 296817720 294783980 292868584 290930510
1021.8 290930510 288877219 286729813 284538895 282355517 280175447 277958721 275713742 273455143
1038.1 273455143 271176696 268900722 266779393 265006810 263619691 262631983 262192816 262457490 263338983
1056.5 263338983 264584690 266131610 268123597 270480007 272637546 273762375 273384780 271994621
1072.8 271994621 270705074 270407081 271443307 273804098 277281821 281482726 285977006 290551394
1089.1 290551394 295107156 299425960 303262979 306470722 309016168 310930073 312372118 313740343
$$ packed form
968.8C58865708r550631q662164p460505o173700n020916l965199k936036k138972
985.1C12957585j724243j552672j434028j270324j075178q38548m87596q1241J18464
1003.5C04612219j19120o87092j261115j676560j956671k093941k033740j915396j938074
1021.8B90930510k053291k147406k190918k183378k180070k216726k244979k258599
1038.1B73455143k278447k275974k121329j772583j387119r87708m39167K64674Q81493
1056.5B63338983J245707J546920J991987K356410K157539J124829l77595j390159
1072.8B71994621j289547k97993J036226K360791L477723M200905M494280M574388
1089.1B90551394M555762M318804L837019L207743K545446J913905J442045J368225
$$ plain form
1105.4 313740343 315492541 317779243 320402622 323183477 326080859 328977525 331606865 333775103
1121.8 333775103 335643828 337597966 339855433 342482388 345436662 348399013 350883812 352512807
1138.1 352512807 353196472 353151649 352667093 351919562 351094782 350436896 350128174 350277930 351031095 352604568
1158.5 352604568 355156273 358626038 362765521 367388844 372514129 378211975 384478986 391292870
1174.8 391292870 398588717 406179607 413757801 421034992 427893400 434231788 439744413 444081575
1191.1 444081575 447138518 449037433 449894905 449822962 449107379 448126405 447177529 446392745 445809335
1209.5 445809335 445453793 445249796 444979668 444468111 443712413 442738295 441436499 439693123 437620789
1227.8 437620789 435442805 433317274 431341112 429654300 428451329 427831650 427785158 428313881 429471254
$$ packed form
1105.4C13740343J752198K286702K623379K780855K897382K896666K629340K168238
1121.8C33775103J868725J954138K257467K626955K954274K962351K484799J628995
1138.1C52512807O83665m4823m84556p47531q24780o57886l08722J49756P53165J573473
1158.5C52604568K551705L469765M139483M623323N125285N697846O267011O813884
1174.8C91292870P295847P590890P578194P277191O858408O338388N512625M337162
1191.1D44081575L056943J898915Q57472p1943p15583r80974r48876p84784n83410
1209.5D45809335l55542k03997k70128n11557p55698r74118j301796j743376k072334
1227.8D37620789k177984k125531j976162j686812j202971o19679m6492N28723J157373
$$ plain form
1246.2 429471254 431211740 433351010 435703188 438170820 440688431 443193406 445648700 448056459
1262.5 448056459 450487435 452992946 455506563 457871616 459955066 461696863 463093370 464186639
1278.8 464186639 465152949 466206938 467381924 468579739 469674826 470535576 470975101 470801920 469947189
1297.2 469947189 468551815 466808438 464822680 462673515 460472941 458422095 456717342 455461502
1313.5 455461502 454696596 454464942 454694420 455098718 455267817 454853207 453698307 451846659 449521691
1331.8 449521691 447080851 444889635 443096310 441686571 440673113 439998150 439437389 438761890 437788755
1350.2 437788755 436448723 434818000 432989478 431035072 428796500 425858110 422151178 418133587
1366.5 418133587 414217561 410882771 408006728 404836148 401194602 397267014 393037081 388798624
$$ packed form
1246.2D29471254J740486K139270K352178K467632K517611K504975K455294K407759
1262.5D48056459K430976K505511K513617K365053K083450J741797J396507J093269
1278.8D64186639R66310J053989J174986J197815J095087Q60750M39525j73181q54731
1297.2D69947189j395374j743377j985758k149165k200574k050846j704753j255840
1313.5D55461502p64906k31654K29478M04298J69099m14610j154900j851648k324968
1331.8D49521691k440840k191216j793325j409739j013458o74963n60761o75499r73135
1350.2D37788755j340032j630723j828522j954406k238572k938390l706932m017591
1366.5D18133587l916026l334790k876043l170580l641546l927588m229933m238457
$$ plain form
1382.8 388798624 385217309 382638693 381100476 380424947 380139023 379828453 379571140 379578561 380027890
1401.2 380027890 381064206 382582217 384352624 386297017 388358295 390479296 392814696 395523280
1417.5 395523280 398468971 401196271 403776318 406238884 408315212 409737289 410331875 410381824 409886092
1435.9 409886092 408891588 408298522 408375412 408827543 409458756 410038650 410437465 410854250 411823362 413978100
1456.2 413978100 417031020 420009494 423174441 426806986 430751979 435489178 442253202 451606899
1472.6 451606899 461094409 468687117 474641472 479086816 481951058 483170360 482771277 480288148
1488.9 480288148 475665122 470460504 464838862 457777917 450127304 443168640 436936826 429300040
1505.2 429300040 417507529 405996054 396572441 387784779 380249947 374660969 371048838 367955327
$$ packed form
1382.8C88798624l581315k578616j538217o75529k85924l10570k57313P421M49329
1401.2C80027890J036316J518011J770407J944393K061278K121001K335400K708584
1417.5C95523280K945691K727300K580047K462566K076328J422077N94586M9949m95732
1435.9D09886092r94504n93066P6890M52131O31213N79894L98815M16785R69112K154738
1456.2D13978100L052920K978474L164947L632545L944993M737199O764024R353697
1472.6D51606899R487510P592708N954355M445344K864242J219302l99083k483129
1488.9D80288148m623026n204618n621642p060945p650613o958664o231814p636786
1505.2D29300040j1792511j1511475r423613q787662p534832n588978l612131l093511
$$ plain form
1521.5 367955327 364566892 361119539 357495278 354329795 351625234 348797858 346582264 345363200
1537.8 345363200 344195276 343035370 342758894 343472719 345221937 347995013 351620615 355959862 360812098
1556.2 360812098 366600901 372304380 376138031 379680187 383490533 387214869 390592933 393250108
1572.5 393250108 395595431 397609174 398771763 399431795 399780393 399826229 399493963 398669302 397216856
1590.9 397216856 395130754 392319292 388785869 384574592 379561692 373701632 367096394 359736353
1607.2 359736353 351387382 342434585 333534926 323658496 311683357 300747812 290606052 278786361
1623.5 278786361 266891390 255932450 245520502 236607894 228700340 220484570 214346871 211332783
1639.8 211332783 210056886 209900558 210648626 212125197 213937163 216438606 219925165 223299012 226920813
$$ packed form
1521.5C67955327l388435l447353l624261l165483k704561k827376k215594j219064
1537.8C45363200j167924j159906k76476P13825J749218K773076L625602M339247M852236
1556.2C60812098N788803N703479L833651L542156L810346L724336L378064K657175
1572.5C93250108K345323K013743J162589O60032L48598M5836l32266q24661j452446
1590.9C97216856k086102k811462l533423m211277n012900n860060o605238p360041
1607.2C59736353q348971q952797q899659r876430j1975139j0935545j0141760j1819691
1623.5B78786361j1894971j0958940j0411948q912608p907554q215770o137699l014088
1639.8B11332783j275897j56328P48068J476571J811966K501443L486559L373847L621801
$$ plain form
1658.2 226920813 231666878 237768784 244692728 251587689 259409845 268427521 276935548 285800546
1674.5 285800546 295502841 304778427 313994795 324721515 338141710 350739986 362291843 375457615
1690.8 375457615 389687121 406900465 426758051 446358919 466982543 483802974 497600377
1705.1 497600377 510971427 522260129 531818032 540385842 548279047 555565357 561287463 565615356
1721.4 565615356 569575965 573387027 576822579 580042958 583078444 585944653 588389814 590705812
1737.7 590705812 593544364 596998930 601129413 606131673 612061083 618911624 626203001 633139968
1754 633139968 640116572 647203505 653922081 660449147 666363537 671819448 677300274 682552159 687321603
1772.4 687321603 691320300 694728911 698064804 701284170 704174101 706856668 709466040 712070167
$$ packed form
1658.2B26920813M746065O101906O923944O894961P822156R017676Q508027Q864998
1674.5B85800546R702295R275586R216368J0726720J3420195J2598276J1551857J3165772
1690.8C75457615J4229506J7213344J9857586J9600868K0623624J6820431J3797403
1705.1D97600377J3371050J1288702R557903Q567810P893205P286310N722106M327893
1721.4E65615356L960609L811062L435552L220379L035486K866209K445161K315998
1737.7E90705812K838552L454566M130483N002260N929410O850541P291377O936967
1754F33139968O976604P086933O718576O527066N914390N455911N480826N251885M769444
1772.4F87321603L998697L408611L335893L219366K889931K682567K609372K604127
$$ plain form
1788.7 712070167 714619160 716890633 718798161 720687866 722640991 724490583 726181924 727810502
1805 727810502 729473889 731149077 732749820 734207571 735628963 737054527 738495827 739970446 741457582
1823.4 741457582 742868364 744192660 745437205 746458650 747377515 748333573 749329269 750415742 751616955
1841.7 751616955 752684832 753428280 754080534 754777253 755481899 756210685 756985307 757728577 758410037
1860.1 758410037 759073913 759838521 760716200 761440575 761828721 762154996 762648404 763213456 763788998 764401257
1880.5 764401257 765037477 765669584 766352594 767051518 767615318 768092930 768584192 769065142 769525051 769978881
1900.9 769978881 770407677 770856798 771319032 771673143 771950603 772307217 772766829 773175418 773457825 773727715
1921.3 773727715 773998797 774200678 774386644 774628937 774925649 775184691 775343180 775533140 775855839 776166797
$$ packed form
1788.7G12070167K548993K271473J907528J889705J953125J849592J691341J628578
1805G27810502J663387J675188J600743J457751J421392J425564J441300J474619J487136
1823.4G41457582J410782J324296J244545J021445R18865R56058R95696J086473J201213
1841.7G51616955J067877P43448O52254O96719P04646P28786P74622P43270O81460
1860.1G58410037O63876P64608Q77679P24375L88146L26275M93408N65052N75542O12259
1880.5G64401257O36220O32107O83010O98924N63800M77612M91262M80950M59909M53830
1900.9G69978881M28796M49121M62234L54111K77460L56614M59612M08589K82407K69890
1921.3G73727715K71082K01881J85966K42293K96712K59042J58489J89960L22699L10958
$$ plain form
1941.7 776166797 776284993 776340008 776519001 776753962 776920438 777070940 777310789 777576208 777772486 777931273
1962.1 777931273 778182805 778497338 778679550 778746188 778891742 779141665 779335976 779407799 779484928 779679000
1982.5 779679000 779870331 779954076 780040562 780213714 780320168 780247808 780170560 780249059 780384839 780376375 780248821
2004.9 780248821 780182838 780210316 780137300 779900610 779689789 779566824 779376030 779045582 778720081 778513193
2025.3 778513193 778346419 778062522 777716637 777481198 777311146 777052045 776720643 776489615 776403844 776303530
2045.7 776303530 776093781 775928140 775921226 775953948 775895178 775838912 775923073 776065588 776099205 776051998 776125252
2068.1 776125252 776310086 776409388 776389301 776406050 776533842 776667356 776707172 776729226 776863277 777025163
2088.5 777025163 777071297 777091265 777249098 777488112 777653396 777744412 777902484 778141499 778309882 778369606
$$ packed form
1941.7G76166797J18196N5015J78993K34961J66476J50502K39849K65419J96278J58787
1962.1G77931273K51532L14533J82212O6638J45554K49923J94311P1823P7129J94072
1982.5G79679000J91331Q3745Q6486J73152J06454p2360p7248P8499J35780q464j27554
2004.9G80248821o5983K7478p3016k36690k10821j22965j90794l30448l25501k06888
2025.3G78513193j66774k83897l45885k35439j70052k59101l31402k31028q5771j00314
2045.7G76303530k09749j65641o914L2722n8770n6266Q4161J42515L3617m7207P3254
2068.1G76125252J84834R9302k0087J6749J27792J33514L9816K2054J34051J61886
2088.5G77025163M6134J9968J57833K39014J65284R1016J58072K39015J68383N9724
$$ plain form
2108.9 778369606 778434873 778590500 778755546 778825819 778869689 779022276 779230297 779326618 779332340 779406726 779572964
2131.3 779572964 779716015 779803455 779909194 780070126 780210793 780274689 780344725 780516386 780720115 780832887
2151.7 780832887 780927658 781140089 781421602 781663537 781886637 782179475 782566905 782960415 783302844 783677518
2172.1 783677518 784129500 784582198 784961104 785296500 785716355 786228836 786655426 786970198 787339985 787784696
2192.5 787784696 788172901 788495779 788863480 789286494 789669096 789964557 790241957 790595591 791021645 791408122
2212.9 791408122 791704834 792023301 792403698 792709708 792904317 793136597 793448925 793709993 793870032 794022501
2233.3 794022501 794253528 794514239 794689119 794800818 794959605 795138955 795256674 795317411 795411408 795587540
2253.7 795587540 795715809 795756817 795851409 796013653 796143472 796228886 796337128 796506345 796658039 796684980
$$ packed form
2108.9G78369606O5267J55627J65046P0273M3870J52587K08021R6321N722P4386J66238
2131.3G79572964J43051Q7440J05739J60932J40667O3896P0036J71661K03729J12772
2151.7G80832887R4771K12431K81513K41935K23100K92838L87430L93510L42429L74674
2172.1G83677518M51982M52698L78906L35396M19855N12481M26590L14772L69787M44711
2192.5G87784696L88205L22878L67701M23014L82602K95461K77400L53634M26054L86477
2212.9G91408122K96712L18467L80397L06010J94609K32280L12328K61068J60039J52469
2233.3G94022501K31027K60711J74880J11699J58787J79350J17719O0737R3997J76132
2253.7G95587540J28269M1008R4592J62244J29819Q5414J08242J69217J51694K6941
$$ plain form
2274.1 796684980 796651721 796686828 796782315 796862006 796921849 796991765 797038317 797008574 796931326 796874344 796831191
2296.5 796831191 796748459 796621859 796536446 796491385 796406567 796306252 796239913 796206772 796163023 796067297 795930624
2319 795930624 795783281 795627356 795456469 795273244 795110643 794983327 794807196 794530928 794219375 793957114
2339.4 793957114 793700635 793306351 792845547 792599440 792553306 792539775 792456865 792258084 791960955 791618764
2359.8 791618764 791293919 790961504 790526092 789980292 789477408 789097965 788767040 788447201 788169384 787944019
2380.2 787944019 787731826 787474871 787167192 786855698 786532462 786179423 785795867 785370231 784919739 784440219
2400.6 784440219 783925056 783419490 782937884 782426238 781866312 781297028 780732691 780125856 779451907 778747499
2421 778747499 778055966 777404785 776761174 776080310 775374770 774671137 773951769 773184419 772394180 771650374
$$ packed form
2274.1G96684980l3259L5107R5487P9691N9843O9916M6552k9743p7248n6982m3153
2296.5G96831191q2732j26600q5413m5061q4818j00315o6339l3141m3749r5726j36673
2319G95930624j47343j55925j70887j83225j62601j27316j76131k76268l11553k62261
2339.4G93957114k56479l94284m60804k46107m6134j3531q2910j98781k97129l42191
2359.8G91618764l24845l32415m35412n45800n02884l79443l30925l19839k77817k25365
2380.2G87944019k12193k56955l07679l11494l23236l53039l83556m25636m50492m79520
2400.6G84440219n15163n05566m81606n11646n59926n69284n64337o06835o73949p04408
2421G78747499o91533o51181o43611o80864p05540p03633p19368p67350p90239p43806
$$ plain form
2441.3 771650374 770947814 770211995 769440949 768682599 767942131 767189860 766425788 765686035 764979124 764270365
2461.7 764270365 763521016 762758911 762056231 761379123 760634959 759858012 759131014 758444250 757738113 756993175
2482.1 756993175 756263375 755595505 754912138 754145861 753390312 752729595 752112269 751435101 750706196 750041842
2502.5 750041842 749461055 748880565 748261452 747642577 747031212 746374607 745660961 744959712 744316101 743669748
2522.9 743669748 742971838 742266536 741579711 740861118 740106046 739355028 738595188 737808704 736999810 736184895
2543.3 736184895 735399187 734668672 733950853 733177841 732404947 731711030 731026053 730274737 729509652 728796065
2563.7 728796065 728105962 727395296 726685286 726007462 725322187 724563897 723753691 722979426 722272873 721578598
2584.1 721578598 720847189 720089078 719355643 718646944 717914820 717176855 716461480 715732992 714948654 714108825
$$ packed form
2441.3G71650374p02560p35819p71046p58350p40468p52271p64072p39753p06911p08759
2461.7G64270365p49349p62105p02680o77108p44164p76947p26998o86764p06137p44938
2482.1G56993175p29800o67870o83367p66277p55549o60717o17326o77168p28905o64354
2502.5G50041842n80787n80490o19113o18875o11365o56605p13646p01249o43611o46353
2522.9G43669748o97910p05302o86825p18593p55072p51018p59840p86484q08894q14915
2543.3G36184895p85708p30515p17819p73012p72894o93917o84977p51316p65085p13587
2563.7G28796065o90103p10666p10010o77824o85275p58290q10206p74265p06553o94275
2584.1G21578598p31409p58111p33435p08699p32124p37965p15375p28488p84338q39829
$$ plain form
2604.5 714108825 713249624 712375581 711445630 710451305 709410608 708339870 707264841 706169665 705032408
2622.9 705032408 703867316 702680588 701449215 700168550 698883235 697623968 696371794 695091069
2639.2 695091069 693786263 692482889 691181600 689907491 688664556 687392950 686077297 684754550
2655.5 684754550 683457017 682186067 680942059 679714143 678463280 677220464 676027238 674861729
2671.8 674861729 673689604 672517002 671386361 670283973 669166684 668046653 666944206 665840924
2688.1 665840924 664739192 663638175 662518799 661371946 660174608 658925712 657681823 656458795
2704.5 656458795 655193031 653862715 652503490 651142001 649781704 648416996 647044361 645682633
2720.8 645682633 644347548 643040180 641782999 640554667 639345348 638200402 637081325 635921717
$$ packed form
2604.5G14108825q59201q74043r29951r94325j040697j070738j075029j095176j137257
2622.9G05032408j165092j186728j231373j280665j285315j259267j252174j280725
2639.2F95091069j304806j303374j301289j274109j242935j271606j315653j322747
2655.5F84754550j297533j270950j244008j227916j250863j242816j193226j165509
2671.8F74861729j172125j172602j130641j102388j117289j120031j102447j103282
2688.1F65840924j101732j101017j119376j146853j197338j248896j243889j223028
2704.5F56458795j265764j330316j359225j361489j360297j364708j372635j361728
2720.8F45682633j335085j307368j257181j228332j209319j144946j119077j159608
$$ plain form
2737.1 635921717 634749115 633600950 632469773 631332874 630201936 629113436 628035486 626937985
2753.4 626937985 625859141 624805748 623742580 622667670 621588171 620479167 619333148 618192136
2769.7 618192136 617046058 615830719 614577949 613310337 611972630 610568583 609124780 607634902
2786 607634902 606094480 604522109 602922738 601261973 599540055 597773731 595960438 594124675 592251837
2804.4 592251837 590279281 588214576 586112142 583965242 581743538 579477668 577192843 574825764
2820.7 574825764 572326720 569749534 567116976 564365923 561435580 558318794 555032372 551504254
2837 551504254 547545731 542935252 537531137 531320155 524464011 517424285 510895848 505539358 501651049
2855.4 501651049 498966873 496839315 494541466 491562188 487783104 483399749 478825420 474580228
$$ packed form
2737.1F35921717j172602j148165j131177j136899j130938j088500j077950j097501
2753.4F26937985j078844j053393j063168j074910j079499j109004j146019j141012
2769.7F18192136j146078j215339j252770j267612j337707j404047j443803j489878
2786F07634902j540422j572371j599371j660765j721918j766324j813293j835763j872838
2804.4E92251837j972556k064705k102434k146900k221704k265870k284825k367079
2820.7E74825764k499044k577186k632558k751053k930343l116786l286422l528118
2837E51504254l958523m610479n404115o210982o856144p039726o528437n356490l888309
2855.4E01651049k684176k127558k297849k979278l779084m383355m574329m245192
$$ plain form
2871.7 474580228 471047163 468325943 466317773 464823425 463609010 462456226 461205602 459825963
2888 459825963 458329409 456627965 454635322 452388436 449942380 447311699 444454968 441266567 437677383
2906.4 437677383 433626711 429032236 423894912 418300927 412372619 406361371 400731593 395969808
2922.7 395969808 392367572 390051335 389059186 389376074 390945196 393661439 397383362 401857436 406670809
2941 406670809 411388963 415634692 419094443 421630204 423339456 424427301 425192326 426130861 427704811
2959.4 427704811 430086434 433281094 437276602 442008674 447338492 453096122 459099978 465169013
2975.7 465169013 471146613 476903468 482304007 487240136 491655082 495502859 498764038 501424432
2992 501424432 503447473 504813433 505534649 505635917 505179882 504289627 503076553 501659513 500203669
$$ packed form
2871.7D74580228l533065k721220k008170j494348j214415j152784j250624j379639
2888D59825963j496554j701444j992643k246886k446056k630681k856731l188401l589184
2906.4D37677383m050672m594475n137324n593985n928308o011248n629778m761785
2922.7C95969808l602236k316237r92149L16888J569122K716243L721923M474074M813373
2941D06670809M718154M245729L459751K535761J709252J087845P65025R38535J573950
2959.4D27704811K381623L194660L995508M732072N329818N757630O003856O069035
2975.7D65169013N977600N756855N400539M936129M414946L847777L261179K660394
2992E01424432K023041J365960P21216J01268m56035q90255j213074j417040j455844
$$ plain form
3010.4 500203669 498804927 497486800 496192187 494783551 493192315 491356581 489229649 486937493
3026.7 486937493 484643370 482390195 480120271 477754921 475290298 472766608 470194161 467571914
3043 467571914 464888275 462129682 459343672 456590772 453845739 451095432 448395044 445739746 443167001
3061.4 443167001 440786958 438567042 436454922 434487462 432632178 430818200 429076284 427460909
3077.7 427460909 425880700 424267530 422725797 421316028 419999331 418758392 417557806 416343689
3094 416343689 415121436 413898081 412601531 411194384 409752220 408316344 406864107 405349970 403755307
3112.4 403755307 402126223 400463432 398734778 396923155 395019919 393047065 391042501 389034420
3128.7 389034420 386998475 384875268 382678986 380486459 378313124 376090527 373797685 371470153
$$ packed form
3010.4E00203669j398742j318127j294613j408636j591236j835734k126932k292156
3026.7D86937493k294123k253175k269924k365350k464623k523690k572447k622247
3043D67571914k683639k758593k786010k752900k745033k750307k700388k655298k572745
3061.4D43167001k380043k219916k112120j967460j855284j813978j741916j615375
3077.7D27460909j580209j613170j541733j409769j316697j240939j200586j214117
3094D16343689j222253j223355j296550j407147j442164j435876j452237j514137j594663
3112.4D03755307j629084j662791j728654j811623j903236j972854k004564k008081
3128.7C89034420k035945k123207k196282k192527k173335k222597k292842k327532
$$ plain form
3145 371470153 369123995 366811454 364534765 362187833 359762996 357349366 354941994 352504700 350070119
3163.4 350070119 347653598 345231503 342806190 340392888 337977111 335540056 333103895 330705762
3179.7 330705762 328323543 325938612 323572248 321227789 318918616 316650718 314401507 312160760
3196 312160760 309936464 307765961 305664569 303599447 301585615 299617469 297656655 295721054 293820977
3214.3 293820977 291939557 290044516 288119853 286216438 284377038 282566875 280720383 278791636
3230.7 278791636 276822060 274845600 272807628 270712972 268590927 266432256 264239281 262014508
3247 262014508 259748131 257428676 255059719 252671838 250308841 247976676 245658085 243368924 241132066
3265.3 241132066 238977388 236934215 234992757 233169585 231509820 229981050 228524998 227194235
$$ packed form
3145C71470153k346158k312541k276689k346932k424837k413630k407372k437294k434581
3163.4C50070119k416521k422095k425313k413302k415777k437055k436161k398133
3179.7C30705762k382219k384931k366364k344459k309173k267898k249211k240747
3196C12160760k224296k170503k101392k065122k013832j968146j960814j935601j900077
3214.3B93820977j881420j895041j924663j903415j839400j810163j846492j928747
3230.7B78791636j969576j976460k037972k094656k122045k158671k192975k224773
3247B62014508k266377k319455k368957k387881k362997k332165k318591k289161k236858
3265.3B41132066k154678k043173j941458j823172j659765j528770j456052j330763
$$ plain form
3281.6 227194235 226043969 225048393 224163115 223351389 222630411 222030327 221537784 221111685 220724568
3300 220724568 220393464 220132291 219886065 219615430 219367936 219167471 218989059 218819022 218666822 218553126
3320.4 218553126 218447432 218294933 218081787 217837512 217634082 217464209 217269033 217032388 216713920 216294989
3340.8 216294989 215825215 215346262 214884296 214439988 213961780 213427827 212854192 212284535 211760834 211251885
3361.2 211251885 210728183 210210502 209697515 209132001 208473787 207816809 207259983 206758931 206286401 205835566
3381.6 205835566 205399543 205036968 204803199 204669967 204471737 204121277 203798756 203656375 203640193 203572035
3402 203572035 203335345 203106716 203057125 203119412 203190625 203261808 203378648 203571424 203832492 204152048 204570428
3424.4 204570428 205116734 205761045 206418544 207182467 208125800 208976686 209593207 210225940 211096868 212120697
$$ packed form
3281.6B27194235j150266r95576q85278q11726p20978o00084m92543m26099l87117
3300B20724568l31104k61173k46226k70635k47494k00465j78412j70037j52200j13696
3320.4B18553126j05694j52499k13146k44275k03430j69873j95176k36645l18468m18931
3340.8B16294989m69774m78953m61966m44308m78208n33953n73635n69657n23701n08949
3361.2B11251885n23702n17681n12987n65514o58214o56978n56826n01052m72530m50835
3381.6B05835566m36023l62575k33769j33232j98230l50460l22521j42381j6182o8158
3402B03572035k36690k28629m9591O2287P1213P1183J16840J92776K61068L19556M18380
3424.4B04570428N46306O44311O57499P63923R43333Q50886O16521O32733Q70928J023829
$$ plain form
3444.8 212120697 213158831 214227110 215404019 216665938 217965811 219345659 220799208 222208336
3461.1 222208336 223615050 225230023 227037504 228736520 230162397 231571183 233205229 235081613
3477.4 235081613 237046257 238885134 240679502 242625356 244637638 246595606 248568967 250623584
3493.8 250623584 252767891 254918605 257050425 259210020 261311293 263342738 265459657 267694563
3510.1 267694563 270039171 272431642 274728745 277020782 279481798 282143116 284780204 287233829
3526.4 287233829 289670080 292256862 295005947 297908545 300848633 303672850 306591660 309769452
3542.7 309769452 312998086 316027761 318962157 322035044 325272948 328603268 332005948 335563034
3559 335563034 339261234 342964947 346685618 350626230 354676336 358605921 362536877 366667926 370997995
$$ packed form
3444.8B12120697J038134J068279J176909J261919J299873J379848J453549J409128
3461.1B22208336J406714J614973J807481J699016J425877J408786J634046J876384
3477.4B35081613J964644J838877J794368J945854K012282J957968J973361K054617
3493.8B50623584K144307K150714K131820K159595K101273K031445K116919K234906
3510.1B67694563K344608K392471K297103K292037K461016K661318K637088K453625
3526.4B87233829K436251K586782K749085K902598K940088K824217K918810L177792
3542.7C09769452L228634L029675K934396L072887L237904L330320L402680L557086
3559C35563034L698200L703713L720671L940612M050106L929585L930956M131049M330069
$$ plain form
3577.4 370997995 375469834 380109519 384870648 389600337 394235551 398912609 403679311 408560246
3593.7 408560246 413515002 418504149 423568010 428682268 433784455 438846886 444035172 449351400
3610 449351400 454617023 459863454 465125501 470468014 475863934 481043309 486132085 491316140 496663928
3628.4 496663928 502017438 507032514 511941552 516861439 521744668 526678145 531715095 536809504
3644.7 536809504 541886389 546861708 551511109 555747390 559836626 564106584 568406105 572472215
3661 572472215 576394379 580396891 584414721 588245213 591985524 595538914 598673701 601509392 604280770
3679.4 604280770 607119083 610186279 613470197 616685629 619330108 621378303 623404801 625626862
3695.7 625626862 627857924 629926682 631807148 633662045 635684490 637744188 639504015 640843630
$$ packed form
3577.4C70997995M471839M639685M761129M729689M635214M677058M766702M880935
3593.7D08560246M954756M989147N063861N114258N102187N062431N188286N316228
3610D49351400N265623N246431N262047N342513N395920N179375N088776N184055N347788
3628.4D96663928N353510N015076M909038M919887M883229M933477N036950N094409
3644.7E36809504N076885M975319M649401M236281M089236M269958M299521M066110
3661E72472215L922164M002512M017830L830492L740311L553390L134787K835691K771378
3679.4F04280770K838313L067196L283918L215432K644479K048195K026498K222061
3695.7F25626862K231062K068758J880466J854897K022445K059698J759827J339615
$$ plain form
3712 640843630 642182052 643725753 645359695 646961808 648402274 649599493 650690258 652085304 653802633
3730.3 653802633 655486882 656746805 657550097 658507049 659899652 661185324 662037015 663094223 664289713
3748.7 664289713 664958656 665364981 666208208 667302728 668202162 668987334 669912994 670917571 671833694
3767.1 671833694 672514200 673068821 673790336 674744964 675811827 676687658 677286208 677859783 678474844
3785.4 678474844 679104924 679847002 680779397 681754589 682578206 683390141 684146225 684653699 685270250 685826361
3805.8 685826361 686048985 686501801 687450588 688447952 689155042 689845622 690352619 690504074 690846562 691379905
3826.2 691379905 691937506 692606330 693383932 694197357 694786668 694999456 695166290 695411265 695701480 696250319
3846.6 696250319 697215974 698265731 698467672 697875679 697909653 698503613 699190259 699794352 700286567 700684786
$$ packed form
3712F40843630J338422J543701J633942J602113J440466J197219J090765J395046J717329
3730.3F53802633J684249J259923Q03292R56952J392603J285672Q51691J057208J195490
3748.7F64289713O68943M06325Q43227J094520Q99434P85172R25660J004577R16123
3767.1F71833694O80506N54621P21515R54628J066863Q75831N98550N73575O15061
3785.4F78474844O30080P42078R32395R75192Q23617Q11935P56084N07474O16551N56111
3805.8F85826361K22624M52816R48787R97364P07090O90580N06997J51455L42488N33343
3826.2F91379905N57601O68824P77602Q13425N89311K12788J66834K44975K90215N48839
3846.6F96250319R65655J049757K01941n91993L3974N93960O86646O04093M92215L98219
$$ plain form
3867 700684786 700864196 700978935 701191664 701475680 701945961 702409565 702764869 703131855 703357995 703575075
3887.4 703575075 703877449 703983486 704103827 704588473 705200434 705612481 705739677 705596566 705413163 705423534
3907.8 705423534 705572844 705887973 706379652 706749201 706827879 706851602 706992030 707159817 707342923 707605839
3928.2 707605839 707820892 707898259 707971454 708119035 708328009 708568990 708753288 708910704 709099948 709232509
3948.6 709232509 709316373 709422112 709547222 709708691 709946215 710226536 710394681 710397482 710432649 710606217
3969 710606217 710759342 710839689 710969329 711184204 711413443 711619198 711801946 711924911 712028861 712193787
3989.4 712193787 712378681 712543547 712699771 712819576
3997.5 712819576
$$ packed form
3867G00684786J79410J14739K12729K84016M70281M63604L55304L66986K26140K17080
3887.4G03575075L02374J06037J20341M84646O11961M12047J27196j43111j83403J0371
3907.8G05423534J49310L15129M91679L69549P8678K3723J40428J67787J83106K62916
3928.2G07605839K15053P7367P3195J47581K08974K40981J84298J57416J89244J32561
3948.6G09232509Q3864J05739J25110J61469K37524K80321J68145K801L5167J73568
3969G10606217J53125Q0347J29640K14875K29239K05755J82748J22965J03950J64926
3989.4G12193787J84894J64866J56224J19805
3997.5G12819576
##END=$$ End of the data block
