##TITLE=G18-52-SE $$ Begin of the data block
##JCAMP-DX=5.00 $$ ACD/SpecManager v 10.08
##SPECTROMETER/DATA SYSTEM=Alpha
##DATE=21 Oct 2013 11:04:12
##DATA TYPE=INFRARED SPECTRUM
##DATA CLASS=XYDATA
##ORIGIN=
##OWNER=
##NPOINTS=1765
##FIRSTX=399.75695801
##LASTX=3997.56933594
##MAXX=3997.56933594
##MINX=399.75695801
##MAXY=0.79817736
##MINY=0.20245823
##XFACTOR=1.0000000000
##YFACTOR=1.000000000000000e-9
##FIRSTY=0.48133290
##DELTAX=2.03957629
##XUNITS=1/CM
##YUNITS=ARBITRARY UNITS
##XYDATA=(X++(Y..Y))
399.8D81332898k983689k022386j842856r67086K64109P07328K63482k53796n55724
$$ 481332898 478349209 476326823 474483967 473516881 473780990 474488318 474751800 474498004 473942280
418.1D73942280j157612j745432j837582j402378j111507j752824k273589j545251
$$ 473942280 472784668 471039236 469201654 467799276 466687769 464934945 462661356 461116105
434.4D61116105n17517k1815N56558J406372J854360J135528j95950n43565j85162
$$ 461116105 460598588 460576773 461133331 462539703 464394063 465529591 465333641 464790076 464604914
452.8D64604914m72605j606017k337546j866251j854002k707452k987355k195328j658559
$$ 464604914 464132309 462526292 460188746 458322495 456468493 453761041 450773686 448578358 446919799
471.1D46919799k219677k391964j462490q60423j197308j412183r49234n93394r90510
$$ 446919799 444700122 442308158 440845668 439985245 438787937 437375754 436426520 435833126 434842616
489.5D34842616j690447j898706j804888k089143k478868k561450k477079k609224
$$ 434842616 433152169 431253463 429448575 427359432 424880564 422319114 419842035 417232811
505.8D17232811l094017l147006k583832k313345k588779k755731k261639j515120
$$ 417232811 414138794 410991788 408407956 406094611 403505832 400750101 398488462 396973342
522.1C96973342j149297q83222k06679M64827P05510J014203J860142K644688K590805
$$ 396973342 395824045 394940823 394734144 395198971 395904481 396918684 398778826 401423514 404014319
540.5D04014319J828373R24736L24458j16587o69896j041323j106978j198858j591951
$$ 404014319 405842692 406767428 407091886 406975299 406305403 405264080 404157102 402958244 401366293
558.8D01366293j979261k046913k107352k424896k587169j930982p50065K28494J055569
$$ 401366293 399387032 397340119 395232767 392807871 390220702 388289720 387539655 387768149 388823718
577.2C88823718J880050K499520K816558K825499K483338J895636J296222O72520K13503
$$ 388823718 390703768 393203288 396019846 398845345 401328683 403224319 404520541 405193061 405406564
595.6D05406564J60039J99467J02639M3810Q8423J91778L28571L39418L39419N27203
$$ 405406564 405566603 405766070 405868709 405912519 406000942 406192720 406521291 406860709 407200128 407727331
616D07727331R19938J499653K083391K546280K770663K709090K513528K310783K164513
$$ 407727331 408647269 410146922 412230313 414776593 417547256 420256346 422769874 425080657 427245170
634.3D27245170K022147J732945J459122J353890J331657J228839R17435O20842N84692
$$ 427245170 429267317 431000262 432459384 433813274 435144931 436373770 437291205 437912047 438496739
652.7D38496739M99785K41011K25008M13328N10633N49078O66559R71824J207977J329273
$$ 438496739 438996524 439237535 439462543 439875871 440386504 440935582 441602141 442573965 443781942 445111215
673.1D45111215J460254J623124J729042J632839J354188J047045Q95887P49708K77876
$$ 445111215 446571469 448194593 449923635 451556474 452910662 453957707 454853594 455603302 455881178
691.4D55881178m08232q58903r36031o10530Q7589R20951J647055K121389K345830
$$ 455881178 455472946 454614043 453678012 453067482 453155071 454076022 455723077 457844466 460190296
709.8D60190296K653361L219783L687620L884614M098355M541040M924595M851192
$$ 460190296 462843657 466063440 469751060 473635674 477734029 482275069 487199664 492050856
726.1D92050856M391432M019529L711343L101527K335549J770615J470566J037061
$$ 492050856 496442288 500461817 504173160 507274687 509610236 511380851 512851417 513888478
742.4E13888478L86417j2398n841m3928m29214r50992j191914j020074p60555n47707
$$ 513888478 514274895 514262497 514256656 514212728 513783514 512832522 511640608 510620534 509859979 509312272
762.8E09312272Q2433J357615K698183L733874M580915N345761N755902N408585M639745
$$ 509312272 509394705 510752320 513450503 517184377 521765292 527111053 532866955 538275540 542915285
781.2E42915285M089534L708184L071785K349138K060592K236068K333999K290249
$$ 542915285 547004819 550713003 553784788 556133926 558194518 560430586 562764585 565054834
797.5E65054834K707600L561914L870428L245533K626419K549052K327561J433969
$$ 565054834 567762434 571324348 575194776 578440309 581066728 583615780 585943341 587377310
813.8E87377310N60045M04656M11272k95639j437247k033591j986504k100348k600014
$$ 587377310 587937355 588342011 588753283 588457644 587020397 584986806 583000302 580899954 578299940
832.1E78299940k790690k453446k250314k590060k774596k194465j463949j289606
$$ 578299940 575509250 573055804 570805490 568215430 565440834 563246369 561782420 560492814
848.5E60492814j343131r31859l15905k58207l64900P89106L264725N261123N896688
$$ 560492814 559149683 558217824 557901919 557643712 557278812 558067918 561332643 566593766 572490454
866.8E72490454O066262O237388N624831L783464J608432P8797j251459l094793m730582
$$ 572490454 578556716 584794104 590418935 594202399 595810831 595889628 594638169 591543376 586812794
885.2E86812794n210995n007625n118549n384386n013465m361570m460156n286575
$$ 586812794 581601799 576594174 571475625 566091239 561077774 556716204 552256048 546969473
901.5E46969473n959928o199360o605863p361293p750511p343471o594211n923569
$$ 546969473 541009545 534810185 528204322 520843029 513092518 505749047 499154836 493231267
917.8D93231267m930109l306568j808077j224369j181990q49336k84463j51396m80413
$$ 493231267 488301158 484994590 483186513 481962144 480780154 479930818 479646355 479494959 479014546
936.2D79014546o19561m40091q26150k474576m878640p072538q742661j0008633j0720551
$$ 479014546 478394985 477954894 477128744 474654168 469775528 462702990 453960329 443951696 433231145
954.5D33231145j0795712j0697246j0805637j0961234j0856718j0476440j0048509
$$ 433231145 422435433 411738187 400932550 389971316 379114598 368638158 358589649
968.8C58589649r547531q681000p416635o108255m993111l945708k928644k147019
$$ 358589649 349042118 340361118 332944483 326836228 321843117 317897409 314968765 312821746
985.1C12821746j740515j603067j475722j262098j036913q00579m66884p9661J07497
$$ 312821746 311081231 309478164 308002442 306740344 305703431 304902852 304435968 304356307 304463804
1003.5C04463804j34409o94781j249165j682639j977414k078533k026826j935035j918852
$$ 304463804 304329395 303634614 302385449 300702810 298725396 296646863 294620037 292685002 290766150
1021.8B90766150k015323k147704k194583k153159k155453k225637k270699k299308
$$ 290766150 288750827 286603123 284408540 282255381 280099928 277874291 275603592 273304284
1038.1B73304284k296150k214193k067239j807123j425296r74923l94911K81155Q57532
$$ 273304284 271008134 268793941 266726702 264919579 263494283 262519360 262124449 262405604 263263136
1056.5B63263136J271457J592278J955778K286255K136856J134306l51250j343518
$$ 263263136 264534593 266126871 268082649 270368904 272505760 273640066 273288816 271945298
1072.8B71945298j269818l22342R99719K346874L463298M140407M459202M642337M641891
$$ 271945298 270675480 270353138 271352857 273699731 277163029 281303436 285762638 290404975 295046866
1091.2B95046866M349351L822774L164947K541720J966537J478135J369864J753002
$$ 295046866 299396217 303218991 306383938 308925658 310892195 312370330 313740194 315493196
1107.5C15493196K288133K630949K804250K911478K890080K602130K153963J894087
$$ 315493196 317781329 320412278 323216528 326128006 329018086 331620216 333774179 335668266
1123.8C35668266J950979K230406K674997L027588K960354K447367J598745O61612
$$ 335668266 337619245 339849651 342524648 345552236 348512590 350959957 352558702 353220314
1140.1C53220314l5227m57555p31617q27640o88017l36438J49101P70420J607150K578199
$$ 353220314 353185087 352727532 351995915 351168275 350480258 350143820 350292921 351063341 352670491 355248690
1160.5C55248690L466785M124075M609227N116135N696028O250680O763100P244468
$$ 355248690 358715475 362839550 367448777 372564912 378260940 384511620 391274720 398519188
1176.8C98519188P562071P547051P253915O866753O359935N519926M330844L044129
$$ 398519188 406081259 413628310 420882225 427748978 434108913 439628839 443959683 447003812
1193.1D47003812J878768Q40306r6649p32303r57101r40651q26120o26475l71039j79231
$$ 447003812 448882580 449722886 449626237 448893934 447936833 446996182 446170062 445543587 445172548 444993317
1213.5D44993317k18511m71204p46846j005948j332879j735240k049327k146423k081692
$$ 444993317 444774806 444303602 443556756 442550808 441217929 439482689 437433362 435286939 433205247
1231.9D33205247j931876j653075j184196o16729n0992N41419J173616J744687K146840
$$ 433205247 431273371 429620296 428436100 427819371 427768379 428309798 429483414 431228101 433374941
1250.3D33374941K341301K432495K513200K531320K452552K381504K447158K563774
$$ 433374941 435716242 438148737 440661937 443193257 445645809 448027313 450474471 453038245
1266.6D53038245K539814K341896K049148J713515J382708J099378R80198J072199
$$ 453038245 455578059 457919955 459969103 461682618 463065326 464164704 465144902 466217101
1282.9D66217101J205444J220822J109034Q75592M38452j84953q56638j395702j761347
$$ 466217101 467422545 468643367 469752401 470627993 471066445 470881492 470024854 468629152 466867805
1301.2D66867805j992018k118319k172291k043337j708358j286894q00848k31088K53261
$$ 466867805 464875787 462757468 460585177 458541840 456833482 455546588 454745740 454514652 454767913
1319.6D54767913M46528K20477m13060j222551j926601k340734k403408k165645j809210
$$ 454767913 455214441 455434918 455021858 453799307 451872706 449531972 447128564 444962919 443153709
1338D43153709j432836j030564o93947n69165o70314r56744j312434j611412j839638
$$ 443153709 441720873 440690309 439996362 439427197 438756883 437800139 436487705 434876293 433036655
1356.3D33036655j988262k282500k969742l694326m009157l944844l360122k899170
$$ 433036655 431048393 428765893 425796151 422101825 418092668 414147824 410787702 407888532
1372.6D07888532l180445l599733l881275m228443m263997l626019k628416j518845
$$ 407888532 404708087 401108354 397227079 392998636 388734639 385108620 382480204 380961359
1388.9C80961359o05166k58983l25441k66224K4855M73499J028300J534342J854808
$$ 380961359 380356193 380097210 379771769 379505545 379530400 380003899 381032199 382566541 384421349
1407.3C84421349K015411K076924K109528K287060K627313K927333K779842K632200
$$ 384421349 386436760 388513684 390623212 392910272 395537585 398464918 401244760 403876960
1423.6D03876960K501816K062529J376182N83649N781n92529r81987m90576J42187
$$ 403876960 406378776 408441305 409817487 410401136 410406917 409814388 408832401 408341825 408484012
1442D08484012M71741O10143N54025M09156M15385R03278K065987L079712L060520
$$ 408484012 408955753 409565896 410119921 410529077 410944462 411847740 413913727 416993439 420053959
1460.3D20053959L174066L616810L964603M719734O637901R207637R463310P631600
$$ 420053959 423228025 426844835 430809438 435529172 442167073 451374710 460838020 468469620
1476.6D68469620N979538M437148K835810J168043m93199k558708m622310n194635
$$ 468469620 474449158 478886306 481722116 482890159 482396960 479838252 475215942 470021307
1493D70021307n688995p164746p658273o911606o255597p762760j1857062j1374205
$$ 470021307 464332312 457167566 449509293 442597687 436342090 428579330 416722268 405348063
1509.3D05348063r256125q686423p516384n606890l622204l076166l316790l365695
$$ 405348063 396091938 387405515 379889131 374282241 370660037 367583871 364267081 360901386
1525.6C60901386l550530l118128k676695k743393k140552j276463j290620j134872
$$ 360901386 357350856 354232728 351556033 348812640 346672088 345395625 344105005 342970133
1541.9C42970133j36048Q35449J815825K815277L645688M284054M679591N570769N780756
$$ 342970133 342834085 343669534 345485359 348300636 351946324 356230378 360909969 366480738 372261494
1560.3C72261494M076034L652513L798962L666580L371566K668768K269924J982182
$$ 372261494 376337528 379990041 383789003 387455583 390827149 393495917 395765841 397748023
1576.6C97748023J257152P05629L14713n812l61085q40813j488238k140999k871037
$$ 397748023 399005175 399710804 400025517 400019705 399658620 398817807 397329569 395188570 392317533
1594.9C92317533l559231m191339m998535n878329o625385p373273q355617q930982
$$ 392317533 388758302 384566963 379568428 373690099 367064714 359691441 351335824 342404842
1611.3C42404842q905202r948075j1985033j0879398j0156572j1863947j1892437j0934383
$$ 342404842 333499640 323551565 311566532 300687134 290530562 278666615 266774178 255839795
1627.6B55839795j0392919q924216p950694q228585o079659k954423j252413j63466
$$ 255839795 245446876 236522660 228571966 220343381 214263722 211309299 210056886 209893420
1643.9B09893420P34881J495808J818657K462104L534317L499702L686279M746139
$$ 209893420 210628301 212124109 213942766 216404870 219939187 223438889 227125168 231871307
1660.2B31871307O095409O962419O905734P768125R005516Q543253Q856476R684354
$$ 231871307 237966716 244929135 251834869 259602994 268608510 277151763 286008239 295692593
1676.5B95692593R276569R176343J0649801J3454556J2740731J1639774J3193906J4179796
$$ 295692593 304969162 314145505 324795306 338249862 350990593 362630367 375824273 390004069
1692.8C90004069J7078042J9714653J9501776K0656466J6957462J3906062J3470769
$$ 390004069 407082111 426796764 446298540 466955006 483912468 497818530 511289299
1707.1E11289299J1366784R573341Q504211P775009P274985N903602M513919M036844
$$ 511289299 522656083 532229424 540733635 548508644 555783629 561687231 566201150 570237994
1723.4E70237994L801763L395200L154159K924382K782166K505899K395332K888918
$$ 570237994 574039757 577434957 580589116 583513498 586295664 588801563 591196895 594085813
1739.7E94085813L526449M159808M989326N924106O856799P329821O973446O977379
$$ 594085813 597612262 601772070 606761396 612685502 619542301 626872122 633845568 640822947
1756.1F40822947P090211O716311O540954N968392N464375N425870N153120M698515
$$ 640822947 647913158 654629469 661170423 667138815 672603190 678029060 683182180 687880695
1772.4F87880695M068136L505528L350318L211438K904356K689302K622485K590060
$$ 687880695 691948831 695454359 698804677 702016115 704920471 707609773 710232258 712822318
1788.7G12822318K458870K231300J994670J956105J931846J829684J732409J675546
$$ 712822318 715281188 717512488 719507158 721463263 723395109 725224793 726957202 728632748
1805G28632748J653254J618862J596868J522661J458406J422703J438141J459539J445830
$$ 728632748 730286002 731904864 733501732 735024393 736482799 737905502 739343643 740803182 742249012
1823.4G42249012J382172J300275J211107J062274R97484R84490R99510J062513J110434
$$ 742249012 743631184 744931459 746142566 747204840 748202324 749186814 750186324 751248837 752359271
1841.7G52359271R88185P76470P30872P57873P37131P24316P58052P32362O83844O73592
$$ 752359271 753347456 754123926 754854798 755612671 756349802 757074118 757832170 758564532 759248376 759921968
1862.1G59921968P30336P75695O51359M47095M45663N63980N78165N74946O12676O17624
$$ 759921968 760652304 761427999 762079358 762526453 762972116 763536096 764114261 764689207 765301883 765919507
1882.5G65919507O02483O50525O76930N91934N15759M90248M70877M53711M35829M13835
$$ 765919507 766521990 767172515 767849445 768441379 768957138 769447386 769918263 770371974 770807803 771221638
1902.9G71221638M40061M49896L68833L06428L47495M09901L55661K81393L14534L16858
$$ 771221638 771661699 772111595 772480428 772786856 773134351 773544252 773899913 774181306 774495840 774812698
1923.3G74812698K31207J95205K51949L12686K60353J57356K03073L08991K67028J15395
$$ 774812698 775043905 775239110 775491059 775803745 776064098 776221454 776424527 776733518 777000546 777115941
1943.7G77115941P8499J63854K11179J89125J94073K58327K55525J80185J67191K63333
$$ 777115941 777194440 777358294 777569473 777758598 777952671 778210998 778466523 778646708 778813899 779077232
1964.1G79077232K96056J73390Q2076J58548K56717J94788P4804Q4043K04682J99675
$$ 779077232 779373288 779546678 779628754 779787302 780044019 780238807 780313611 780397654 780602336 780802011
1984.5G80802011N0664J9968J35660J33932j1981m8578P7308J32441k6166j42336n1916
$$ 780802011 780852675 780872643 781008303 781142235 781130254 781081676 781158984 781291425 781265259 781122923 781071007
2006.9G81071007L4809p6949k30670k24352j41144j69337k96771k98977j90735j75834
$$ 781071007 781105816 781028867 780798197 780573845 780432701 780263364 779966593 779667616 779476881 779301047
2027.3G79301047k96056l47078k36451j60337k38717l07679k30372j25765j32025k05457
$$ 779301047 779004991 778657913 778421462 778261125 778022408 777714729 777484357 777358592 777226567 777021110
2047.7G77021110j53005r000J7941p1109n7816R3281J58906N8651k0564P4447J58906
$$ 777021110 776868105 776859105 776877046 776805937 776748121 776841402 777000308 777058959 777038395 777112842 777271748
2070.2G77271748Q0406k0385L4810J60694J56581M7982K9623J35780J61409O3181K9385
$$ 777271748 777352154 777331769 777366579 777527273 777683854 777731836 777761459 777897239 778058648 778121829 778151214
2092.6G78151214J38402K18272J57833Q6964J44600K24770J69813Q1480J02401J75058
$$ 778151214 778289616 778507888 778665721 778752685 778897285 779122055 779291868 779373348 779475749 779650807
2113G79650807J58370P8440N3525J34110J86622R2864K5988J12295J95563J38104N9128
$$ 779650807 779809177 779887617 779941142 780075252 780261874 780354738 780380726 780493021 780688584 780826688 780885816
2135.4G80885816J05857K08557J76787L9161K8133J56582K05636J28448J19328K24412
$$ 780885816 780991673 781200230 781377017 781416178 781444311 781600893 781806529 781934977 782054305 782278717
2155.8G82278717K82824K46882K23696K76327L65735L91840L45827L65972M71175M82440
$$ 782278717 782561541 782808423 783032119 783308446 783674181 784066021 784411848 784777820 785248995 785731435
2176.2G85731435L66926L33726M44353N12004M29988L36110L63410M20392M01139L53694
$$ 785731435 786098361 786432087 786876440 787388444 787818432 788154542 788517952 788938344 789339483 789693177
2196.6G89693177L60191M12702M00543L07680K89201L70562M09603L31820K57909L30746
$$ 789693177 790053368 790466070 790866613 791174293 791463494 791834056 792243659 792575479 792833388 793164134
2217G93164134M12643L31521K19047K59459L30865K45333J33813J73151K58267K27571
$$ 793164134 793576777 793908298 794127345 794386804 794717669 794963002 795096815 795269966 795528233 795755804
2237.4G95755804J27077J01268J69694J97292J35898P9871J13308J80781J30594M5836
$$ 795755804 795882881 795984149 796153843 796351135 796487033 796566904 796680212 796860993 796991587 797037423
2257.8G97037423R7334J70171J17064N3227R1731J70350J67489N8592r120K6822O8367
$$ 797037423 797134757 797304928 797421992 797475219 797566950 797737300 797904789 797963381 797954261 797981083 798049450
2280.2G98049450N1498L6240L8147K026k8371j8478j1265l0577m4823m4465l1054l3319
$$ 798049450 798100948 798137188 798175335 798177361 798148990 798130512 798119247 798088670 798043847 797999382 797968328 797935009
2304.7G97935009p0930r9718q1480m6491m8638n8651q1598j20223j38342j66297j65224
$$ 797935009 797864079 797764361 797682881 797636390 797587752 797529101 797447503 797327280 797188938 797022641 796857417
2327.1G96857417q4520o2585j73866k51592k30670k34603l48568m64261m33683k43605
$$ 796857417 796772897 796710312 796536446 796284854 796054184 795819581 795471013 795006752 794573069 794329464
2347.5G94329464r0539l4630k5690p3671j59800k62142l56376m05132m57824n46634
$$ 794329464 794238925 794204295 794178605 794104934 793945134 793682992 793326616 792921484 792463660 791917026
2367.9G91917026n62549m92453m29630m14670l84092k97547k42889k71737l29077l40283
$$ 791917026 791354477 790862024 790432394 790017724 789633632 789336085 789093196 788821459 788492382 788152099
2388.3G88152099l32237l60071m05908m23372m18961m56512n09262n17964n10216n19812
$$ 788152099 787819862 787459791 787053883 786630511 786211550 785755038 785245776 784727812 784217596 783697784
2408.7G83697784n38409n60999n71727n94438o56843p05421o94513o53446o61492p13170
$$ 783697784 783159375 782598376 782026649 781432211 780775368 780069947 779375434 778721988 778060496 777347326
2429.1G77347326p21156o94692p21574p77066p82967p18414o68288p30812p96140p66396
$$ 777347326 776626170 775931478 775209904 774432838 773649871 772931457 772263169 771532357 770736217 769969821
2449.5G69969821p23481p40528p66278p27117o94573p28249p74384p63833p01189o84798
$$ 769969821 769246340 768505812 767739534 767012417 766317844 765589595 764815211 764051378 763350189 762665391
2469.9G62665391p37846p59840p10845o74784p13945p61687p35820o72221o74426p34508
$$ 762665391 761927545 761167705 760456860 759782076 759068131 758306444 757570624 756898403 756223977 755489469
2490.3G55489469p29800o47902o08444o52016o76930o26027o00100o39856o66081o49393
$$ 755489469 754759669 754111767 753503323 752851307 752174377 751548350 750948250 750308394 749642313 748992920
2510.7G48992920o25789o40691o86109o99222o80625o89626p03335o65962o46532p14958
$$ 748992920 748367131 747726440 747040331 746341109 745660484 744970858 744267523 743601561 742955029 742240071
2531.1G42240071p78794p66993p44462p60734p94649q13305p81179p11023p22766q00193
$$ 742240071 741461277 740694284 739949822 739189088 738394439 737581134 736799955 736088932 735366166 734565973
2551.5G34565973p82072p02322o91592p45118p74563p27772o76513o95705p05123o53148
$$ 734565973 733783901 733081579 732389987 731644869 730870306 730142534 729466021 728770316 728065193 727412045
2571.9G27412045o55472p51198q12292p75635p21395p39276p90179p59125o83844o70195
$$ 727412045 726756573 726005375 725193083 724417448 723696053 722956777 722166598 721407473 720723629 720053434
2592.3G20053434p00235p24971p35164p44700p73549q21651q70227r08852r48608r78172
$$ 720053434 719353199 718628228 717893064 717148364 716374815 715553164 714682937 713774085 712825477 711847305
2612.7G11847305r93013j018345j053870j117468j188934j203835j191974j219749
$$ 711847305 710854292 709835947 708782077 707664609 706475675 705271840 704079866 702860117
2629G02860117j280129j307726j273632j238644j260758j296937j300931j299798j293660
$$ 702860117 701579988 700272262 698998630 697759986 696499228 695202291 693901360 692601562 691307902
2647.3F91307902j278042j281143j295566j275540j248359j266063j262307j219630
$$ 691307902 690029860 688748717 687453151 686177611 684929252 683663189 682400882 681181252
2663.7F81181252j219571j251042j239299j178205j139939j128495j111269j110434
$$ 681181252 679961681 678710639 677471340 676293135 675153196 674024701 672913432 671802998
2680F71802998j122892j124263j098871j083613j108169j134336j142741j148700j178742
$$ 671802998 670680106 669555843 668456972 667373359 666265190 665130854 663988113 662839413 661660671
2698.3F61660671j224577j246035j255989j265169j293480j361549j373052j335860
$$ 661660671 660436094 659190059 657934070 656668901 655375421 654013872 652640820 651304960
2714.6F51304960j357615j394152j383901j340330j279711j243890j256704j231551
$$ 651304960 649947345 648553193 647169292 645828962 644549251 643305361 642048657 640817106
2731F40817106j160681j145006j154899j130939j120746j130640j125157j111985j096129
$$ 640817106 639656425 638511419 637356520 636225581 635104835 633974195 632849038 631737053 630640924
2749.3F30640924j101255j120925j102686j077116j072347j049101j045108j105666
$$ 630640924 629539669 628418744 627316058 626238942 625166595 624117494 623072386 621966720
2765.6F21966720j141072j121401j141847j211285j260281j302898j361012j402557
$$ 621966720 620825648 619704247 618562400 617351115 616090834 614787936 613426924 612024367
2782F12024367j444459j482904j510084j550793j601041j672327j736224j755536j785218
$$ 612024367 610579908 609097004 607586920 606036127 604435086 602762759 601026535 599270999 597485781
2800.3E97485781j848758j905083j973033k055049k106845k154053k208113k253414
$$ 597485781 595637023 593731940 591758907 589703858 587597013 585442960 583234847 580981433
2816.6E80981433k307653k382100k473056k564847k664745k784908k928257l106713
$$ 580981433 578673780 576291680 573818624 571253777 568589032 565804124 562875867 559769154
2832.9E59769154l312529l573477l991425m625141n405188o199479o838143p047236
$$ 559769154 556456625 552883148 548891723 544266582 538861394 532661915 525823772 518776536
2849.3E18776536o573856n403459l902912k675772k121031k305150l003985l815234
$$ 518776536 512202680 506799221 502896309 500220537 498099506 495794356 492790371 488975137
2865.6D88975137m408389m590273m288345l601760k751857j983315j480520j228958
$$ 488975137 484566748 479976475 475688130 472086370 469334513 467351198 465870678 464641720
2881.9D64641720j143128j208871j372487j569539j768738j957983k169609k436667
$$ 464641720 463498592 462289721 460917234 459347695 457578957 455620974 453451365 451014698
2898.2D51014698k702266k919764l180504l567129m039526m562050n135804n671025
$$ 451014698 448312432 445392668 442212164 438645035 434605509 430043459 424907655 419236630
2914.5D19236630o001413o010502n592942m728288l590256k328604j009047K86161
$$ 419236630 413235217 407224715 401631773 396903485 393313229 390984625 389975578 390261739
2930.8C90261739J521767K693951L728598M464239M802853M751801M295141L493369
$$ 390261739 391783506 394477457 398206055 402670294 407473147 412224948 416520089 420013458
2947.2D20013458K565205J718372J074224P85232R91225J600594K389520L211021M015327
$$ 420013458 422578663 424297035 425371259 426156491 427147716 428748310 431137830 434348851 438364178
2965.5D38364178M770637N386412N801230O033391O090939N990088N788058N453855
$$ 438364178 443134815 448521227 454322457 460355848 466446787 472436875 478224933 483678788
2981.8D83678788M971623M429073L850400L265977K696574K076089J407444P41840
$$ 483678788 488650411 493079484 496929884 500195861 502892435 504968524 506375968 507117808
2998.1E07117808J16646m33445r05573j255870j412511j403212j341701j287162j275957
$$ 507117808 507234454 506801009 505895436 504639566 503227055 501823843 500482142 499194980 497919023
3016.5D97919023j368731j564473j848549k167702k336919k295106k242536k278417
$$ 497919023 496550292 494985819 493137270 490969568 488632649 486337543 484095007 481816590
3032.8D81816590k345383k437175k538263k599597k618492k653509k711088k752364
$$ 481816590 479471207 477034032 474495769 471896172 469277680 466624171 463913083 461160719
3049.1D61160719k787023k816022k797246k711803k601176k491266k385228k290637
$$ 461160719 458373696 455557674 452760428 450048625 447447449 444956183 442570955 440280318
3065.5D40280318k157837j982510j856118j808197j759112j638889j547366j554668
$$ 440280318 438122481 436139971 434283853 432475656 430716544 429077655 427530289 425975621
3081.8D25975621j540154j453728j359343j299173j257867j224249j223684j234144
$$ 425975621 424435467 422981739 421622396 420323223 419065356 417841107 416617423 415383279
3098.1D15383279j272946j377434j465827j466334j441985j510859j600921j619279
$$ 415383279 414110333 412732899 411267072 409800738 408358753 406847894 405246973 403627694
3114.4D03627694j677841j805365j903415j930356j933426j983970k059996k101332
$$ 403627694 401949853 400144488 398241073 396310717 394377291 392393321 390333325 388231993
3130.7C88231993k131552k167552k178044k180785k244681k334952k364248k338082
$$ 388231993 386100441 383932889 381754845 379574060 377329379 374994427 372630179 370292097
3147C70292097k276301k249986k319217k419173k464325k462685k463043k438634k403468
$$ 370292097 368015796 365765810 363446593 361027420 358563095 356100410 353637367 351198733 348795265
3165.4C48795265k424389k459377k456695k444834k430081k418220k408564k397865
$$ 348795265 346370876 343911499 341454804 339009970 336579889 334161669 331753105 329355240
3181.7C29355240k400786k391726k355754k318531k300412k290189k259880k219975
$$ 329355240 326954454 324562728 322206974 319888443 317588031 315297842 313037962 310817987
3198C10817987k163768k094537k066434k050876k021313j980454j922905j875639j853496
$$ 310817987 308654219 306559682 304493248 302442372 300421059 298440605 296517700 294642061 292788565
3216.4B92788565j891225j945973j925319j876921j881063j923889j959741j959026
$$ 292788565 290897340 288951367 287026048 285149127 283268064 281344175 279384434 277425408
3232.7B77425408j995057k101182k173156k170295k148091k189160k242088k238005
$$ 277425408 275430351 273329169 271156013 268985718 266837627 264648467 262406379 260168374
3249B60168374k256483k322763k363772k376377k406195k408147k331689k225876k136901
$$ 260168374 257911891 255589128 253225356 250848979 248442784 246034637 243702948 241477072 239340171
3267.4B39340171k043828j937881j818374j705393j593948j433387j278386j157149
$$ 239340171 237296343 235358462 233540088 231834695 230240747 228807360 227528974 226371825
3283.7B26371825j014382q86500q19281p64563o47038n05195m32163m00856l49835
$$ 226371825 225357443 224470943 223651662 222887099 222240061 221734866 221302703 220901847 220552012
3302B20552012k83032k47613k44915k23399j94713j82271j69411j80141j85474j42843
$$ 220552012 220268980 220021367 219776452 219553053 219358340 219176069 219006658 218826517 218641043 218498200
3322.4B18498200j46553k35021k95430k64406k21983k40490k86132l12075l71009m50894
$$ 218498200 218351647 218116626 217821196 217556790 217334807 217094317 216808185 216496110 216125101 215674207
3342.8B15674207m72099m77925m79683m69908n04867n68106n94139n75424n53995n67883
$$ 215674207 215202108 214724183 214244500 213774592 213269725 212701619 212107480 211532056 210978061 210410178
3363.2B10410178n64784n31927n62012o59779o93351n93841m82216m66526m91053m30077
$$ 210410178 209845394 209313467 208751455 208091676 207398325 206804484 206322268 205855742 205364689 204934612
3383.6B04934612l25188k34336j77219k39194l48955l24562j56045m4316j16259k51517
$$ 204934612 204609424 204375088 204197869 203958675 203609720 203285158 203129113 203084797 202968538 202717021
3404B02717021k09570m9218K0325L9324P3835R0882J39371K48447L45767M65035O08057
$$ 202717021 202507451 202458233 202478558 202517882 202591717 202682599 202821970 203070417 203416184 203881219 204489276
3426.5B04489276O91712O87614P61807Q91819P84055N96970O64562Q87260J058578
$$ 204489276 205180988 205868602 206630409 207522228 208306283 208903253 209567815 210455075 211513653
3444.8B11513653J123816J101837J117512J158908J232103J398578J503468J450240
$$ 211513653 212637469 213739306 214856818 216015726 217247829 218646407 220149875 221600115
3461.1B21600115J448080J642838J819089J689300J394749J403719J665190J888231
$$ 221600115 223048195 224691033 226510122 228199422 229594171 230997890 232663080 234551311
3477.4B34551311J944556J827076J792029J928985J973271J925350K013594K120658
$$ 234551311 236495867 238322943 240114972 242043957 244017228 245942578 247956172 250076830
3493.8B50076830K131880K101570K140433K210617K135604K033025K109439K265662
$$ 250076830 252208710 254310280 256450713 258661330 260796934 262829959 264939398 267205060
3510.1B67205060K380460K401829K324939K337366K495408K676696K621233K423227
$$ 267205060 269585520 271987349 274312288 276649654 279145062 281821758 284442991 286866218
3526.4B86866218K488226K699226K791702K883763K938330K866506K947152L154904
$$ 286866218 289354444 292053670 294845372 297729135 300667465 303533971 306481123 309636027
3542.7C09636027L213077L076911L024578L147156L263086L338396L450215L619790
$$ 309636027 312849104 315926015 318950593 322097749 325360835 328699231 332149446 335769236
3559C35769236L738076L706127L681481L933966M110575M009247M040360M241198M372031
$$ 335769236 339507312 343213439 346894920 350828886 354939461 358948708 362989068 367230266 371602297
3577.4C71602297M495203M677683M776210M740089M667193M715979M784405M903049
$$ 371602297 376097500 380775183 385551393 390291482 394958675 399674654 404459059 409362108
3593.7D09362108N071371N179614N190581N164236N144924N098879N179763N291253
$$ 409362108 414433479 419613093 424803674 429967910 435112834 440211713 445391476 450682729
3610D50682729N347372N418360N346119N302817N416542N320341N191385N154550N251944
$$ 450682729 456030101 461448461 466794580 472097397 477513939 482834280 488025665 493180215 498432159
3628.4D98432159N391479N200684N087435M999221M894614M947662N038321N049527
$$ 498432159 503823638 509024322 514111757 519110978 524005592 528953254 533991575 539041102
3644.7E39041102M973471M886270M711389M364372M160702M303217M342258M129588
$$ 539041102 544014573 548900843 553612232 557976604 562137306 566440523 570782781 574912369
3661E74912369L982306M002571L913581L685415L720820L588200L093540K867103K916872
$$ 574912369 578894675 582897246 586810827 590496242 594217062 597805262 600898802 603765905 606682777
3679.4F06682777K945900L053189L207147L161549K627433K113044K140582K281487
$$ 606682777 609628677 612681866 615889013 619050562 621677995 623791039 625931621 628213108
3695.7F28213108K245903K066135J856387J860320K054274K053440J669288J240134
$$ 628213108 630459011 632525146 634381533 636241853 638296127 640349567 642018855 643258989
3712F43258989J372158J605928J593292J543105J439631J191318J081168J407683J691044
$$ 643258989 644631147 646237075 647830367 649373472 650813103 652004421 653085589 654493272 656184316
3730.3F56184316J603782J192033Q45194J070261J420617J175225P31051J088202J233637
$$ 656184316 657788098 658980131 659825325 660895586 662316203 663491428 664222479 665310681 666544318
3748.7F66544318O39200M57347R34303J145124R69350Q67010R04202R03428R12070
$$ 666544318 667183518 667640865 668575168 669720292 670689642 671556652 672460854 673364282 674276352
3767.1F74276352P91848O31153P19965R24706J044393Q99911O66797N81920N66959
$$ 674276352 675068200 675699353 676419318 677344024 678388417 679288328 679955125 680537045 681104004
3785.4F81104004O46592P89761R14693Q85665P26343P42197O78301M61101O24597N76079
$$ 681104004 681750596 682540357 683455050 684340715 685067058 685809255 686487556 686948657 687573254 688149333
3805.8F88149333L20315O09041J006364R27747O24180O41763M56214J67012M11630
$$ 688149333 688469648 689078689 690085053 691012800 691636980 692278743 692734957 692901969 693313599
3824.2F93313599N80072N93007O45935P01666P75337N26905Q2910J15574L37481M73142
$$ 693313599 693893671 694486678 695132613 695834279 696609616 697136521 697219431 697335005 697672486 698145628
3844.6F98145628P01666R41098P82489j30236n14388L57270P32482O24299M58121M18484
$$ 698145628 698847294 699788392 700570881 700440645 699926257 700283527 701016009 701640308 702098429 702516913
3865G02516913M56632K55346J51217K69353L27587M33863L92317L35813L75748K06351
$$ 702516913 702973545 703228891 703380108 703649461 703977048 704410911 704803228 705139041 705514789 705721140
3885.4G05721140K28584L38137J22487J49310M99547N56409L04162P4149n1618k6286
$$ 705721140 705949724 706287861 706410348 706559658 707059205 707615614 707919776 707993925 707942307 707916021
3905.7G07916021J22667K24471L00467L58522K65419R1553R1791J62065J29223J76966
$$ 707916021 708038688 708263159 708563626 708922148 709187567 709279120 709370911 709532976 709662199 709839165
3926.1G09839165K83778J96278N9724J04785J91390K12133K03014J59681J57535J76727
$$ 709839165 710122943 710319221 710378945 710483730 710675120 710887253 711090267 711249948 711407483 711584210
3946.5G11584210J50443J61409J86920J85490J64628J63555K01464J67369Q0288R6619
$$ 711584210 711734653 711896062 712082982 712268472 712433100 712596655 712798119 712965488 713045776 713142395
3966.9G13142395J98066K03312J38163J28687J25944J19388J53363J84059J81854J69337
$$ 713142395 713340461 713543773 713681936 713810623 713936567 714055955 714209318 714393377 714575231 714744568
3987.3G14744568J50978J47760J91152K06113J18912
$$ 714744568 714895546 715043306 715234458 715440571 715559483
3997.5G15559483
$$ 715559483
##END=$$ End of the data block
