##TITLE=G18-52-SE $$ Begin of the data block
##JCAMP-DX=5.00 $$ ACD/SpecManager v 10.08
##SPECTROMETER/DATA SYSTEM=Alpha
##DATE=21 Oct 2013 11:04:12
##DATA TYPE=INFRARED SPECTRUM
##DATA CLASS=XYDATA
##ORIGIN=
##OWNER=
##NPOINTS=1765
##FIRSTX=399.75695801
##LASTX=3997.56933594
##MAXX=3997.56933594
##MINX=399.75695801
##MAXY=0.79939336
##MINY=0.20241624
##XFACTOR=1.0000000000
##YFACTOR=1.000000000000000e-9
##FIRSTY=0.48336548
##DELTAX=2.03957629
##XUNITS=1/CM
##YUNITS=ARBITRARY UNITS
##XYDATA=(X++(Y..Y))
399.8 483365476 479965806 477890939 476225287 475236356 475153387 475636393 476093441 476124883 475573838 474088162
420.2 474088162 472044021 470122635 468603075 467426687 465891242 463722050 462020874 461580724 461905509
438.5 461905509 462417215 463247389 464502037 465353191 465212643 464887977 464991242 464805484 463374853
456.9 463374853 460825652 458445787 456373781 453868389 451210290 449108690 447293133 444999218
473.2 444999218 442571282 441018522 440192014 439061284 437647462 436728597 435990691 434668034 432799160
491.5 432799160 430969656 429415703 427653998 425380737 422909170 420477480 417783499 414565653
507.9 414565653 411333323 408696115 406360567 403780460 401206493 399172336 397628129 396391928
524.2 396391928 395610452 395394206 395659119 396283895 397358835 399215847 401792139 404384285 406202048
542.5 406202048 407098085 407427847 407282829 406601280 405584097 404437333 403104603 401456147 399589747
560.9 399589747 397630930 395463049 393000245 390533179 388725758 388018638 388183236 389034271 390795290
579.2 390795290 393359661 396268636 399124205 401598901 403483152 404775351 405578822 406003505 406202346
597.6 406202346 406341493 406449497 406464517 406420708 406536132 406913668 407286674 407598346 408145159 409129679
618 409129679 410605252 412635177 415211231 418071777 420905322 423470438 425720245 427809298 429771304
636.3 429771304 431497753 432972521 434321672 435698420 436981082 437969118 438727111 439321071 439714521
654.7 439714521 439973265 440239221 440564066 440974146 441578954 442578256 443803340 444799244 445991844
673.1 445991844 447519392 449165225 450829685 452417284 453765303 454823852 455710411 456394911 456619114
691.4 456619114 456266046 455527306 454666466 454023004 454018503 454877913 456496507 458602846 460995913 463731647
711.8 463731647 466930211 470546901 474461406 478626370 483142346 487969220 492777020 497267127
728.1 497267127 501399457 505120277 508199275 510480583 512170196 513613939 514688730 515101314 515040278
746.5 515040278 514995694 514947236 514457762 513444245 512237489 511158407 510306001 509730101 509843349 511288881
766.9 511288881 514096797 517831087 522350729 527680337 533393443 538766801 543483078 547723114
783.2 547723114 551581025 554714561 557027638 559025168 561213136 563559413 565929174 568730772
799.5 568730772 572322011 576129496 579288661 581842482 584334373 586669564 588174582 588753581 589078546
817.9 589078546 589373767 589002907 587571263 585570514 583578706 581414759 578761280 576018512 573611021
836.2 573611021 571276248 568628371 565941572 563815951 562304914 560923696 559542358 558666587 558422029
854.6 558422029 558153868 557758331 558580875 561890960 567164302 573034227 579072475 585310578 590901911
872.9 590901911 594641984 596273363 596348882 594965219 591708064 586937904 581795096 576853693 571745574
891.3 571745574 566317737 561264992 556895196 552375853 546980262 541003287 534860790 528256297
907.6 528256297 520866811 513107717 505774736 499202847 493293613 488370240 485080719 483323127
923.9 483323127 482164443 480996221 480066210 479682386 479512125 479074061 478480786 478026450 477192700
942.3 477192700 474743843 469887257 462789953 453995854 443961799 433241814 422475338 411846250
958.6 411846250 401078820 390107453 379264712 368806303 358736247 349183112 340558916 333188027
974.9 333188027 327048749 322015643 318074405 315181643 313080877 311394960 309849441 308375359
991.2 308375359 307041883 305931598 305113822 304669499 304616153 304727882 304577559 303852528 302551657
1009.6 302551657 300866216 298951656 296909422 294885129 292953849 291036159 289020568 286860168
1025.9 286860168 284622669 282435536 280304015 278127909 275883883 273603737 271327674 269103706
1042.2 269103706 267033368 265274823 263903707 262952924 262540460 262774110 263587058 264819890 266395897
1060.6 266395897 268364668 270672470 272814900 273923039 273531735 272174835 270942330 270674020 271709323
1078.9 271709323 274072349 277533114 281682402 286171883 290804923 295406103 299742609 303566515
1095.2 303566515 306733191 309264064 311215043 312712818 314133674 315938562 318244159 320862472
1111.6 320862472 323647797 326541901 329417139 332009673 334165037 336063713 338033408 340272129
1127.9 340272129 342894971 345858127 348799318 351243585 352829427 353486568 353477985 353067189 352360159
1146.2 352360159 351522923 350833744 350529999 350710720 351482928 353083432 355678558 359165698 363289952
1164.6 363289952 367903203 373012841 378675848 384908020 391683161 398930669 406467468 413982660
1180.9 413982660 421195060 428013831 434350878 439864993 444178820 447212815 449090600 449906945
1197.2 449906945 449793100 449071378 448108643 447155923 446343929 445739001 445386320 445203543 444940090 444408983
1217.6 444408983 443638474 442675263 441385746 439639747 437579155 435458153 433411926 431488007 429829359
1236 429829359 428663373 428083539 428060830 428610325 429781616 431510389 433632672 435978979 438453853
1254.3 438453853 440994024 443513960 445945561 448310107 450745702 453303695 455835640 458148658
1270.6 458148658 460182399 461935967 463352263 464448363 465424925 466497779 467710406 468951434
1287 468951434 470066339 470931798 471388757 471231312 470362157 468942583 467189461 465215564 463090509
1305.3 463090509 460899174 458844364 457140714 455881089 455106646 454867870 455088913 455503821 455717832
1323.7 455717832 455346495 454178542 452282101 449944437 447501987 445296168 443492860 442075700
1340 442075700 441054374 440381557 439821482 439114898 438112170 436796069 435207039 433377892 431377500
1358.3 431377500 429083467 426111579 422404617 418393314 414463073 411095798 408169627 404982418
1374.7 404982418 401380807 397476166 393251956 389021277 385411173 382805109 381303817 380672544
1391 380672544 380391598 380106091 379915774 379975766 380430162 381435692 382962644 384798080 386795789
1409.3 386795789 388888687 391037196 393371910 396031916 398942858 401676148 404282242 406783998
1425.7 406783998 408859968 410253197 410826653 410800964 410190076 409206331 408703864 408825189 409277856
1444 409277856 409877419 410440624 410847008 411242485 412130147 414173543 417260736 420359701 423538655
1462.4 423538655 427135289 431101173 435825646 442439646 451605529 461040765 468666136 474636853
1478.7 474636853 479045123 481835574 482946962 482391626 479783803 475150973 469963521 464270383
1495 464270383 457105607 449445575 442522079 436266750 428518623 416673213 405306637 396079332
1511.3 396079332 387426704 379927754 374339551 370743185 367695600 364426076 361126244 357651830
1527.6 357651830 354601145 351937145 349153697 347021669 345834881 344650358 343554676 343444318
1543.9 343444318 344328612 346175790 348997563 352621585 356874853 361576349 367205083 372971237
1560.3 372971237 377002358 380651206 384479970 388180435 391539454 394160211 396411806 398371816
1576.6 398371816 399555892 400191128 400479853 400486082 400113195 399219573 397707611 395600736 392753839
1594.9 392753839 389151722 384882003 379835844 373966724 367371917 360014915 351657242 342705756
1611.3 342705756 333788335 323861361 311875373 300952315 290795088 278977811 267101139 256159931
1627.6 256159931 245779857 236866906 228908032 220661402 214557320 211586118 210331619 210176304
1643.9 210176304 210958779 212522790 214380488 216910243 220508322 223976269 227634534 232408941
1660.2 232408941 238559842 245542273 252433002 260191262 269192904 277729839 286586851 296275795
1676.5 296275795 305557013 314740807 325398028 338858336 351587981 363205910 376381606 390543550
1692.8 390543550 407593906 427265376 446746886 467442393 484453082 498399645 511910796
1707.1 511910796 523309827 532897532 541412354 549212277 556519568 562447131 566964149 570998251
1723.4 570998251 574816942 578223109 581366301 584280491 587069690 589611590 592064917 594996810
1739.7 594996810 598518312 602674782 607662737 613554835 620404899 627774894 634775043 641738713
1756.1 641738713 648800910 655508041 662060499 668035686 673469841 678827882 683946431 688701153
1772.4 688701153 692844093 696377456 699729919 702936471 705839574 708545089 711175025 713728189
1788.7 713728189 716146410 718393922 720421195 722365558 724277139 726127267 727893710 729581475
1805 729581475 731240153 732872486 734463096 735963821 737421930 738850534 740270913 741694629 743111432
1823.4 743111432 744499207 745840669 747090816 748160422 749152541 750146210 751151621 752198696 753293991
1841.7 753293991 754276931 755059004 755798876 756546795 757270098 757999897 758763552 759499311 760197699 760870755
1862.1 760870755 761578918 762346089 763009310 763464272 763907731 764469683 765055954 765643418 766246855 766852736
1882.5 766852736 767471075 768138230 768793762 769344449 769853294 770359516 770827711 771276653 771728158 772153974
1902.9 772153974 772597611 773061156 773443043 773758531 774122596 774542272 774891555 775144637 775419474 775725424
1923.3 775725424 775967479 776168644 776408911 776690841 776934385 777094007 777303934 777630806 777914226 778026342
1943.7 778026342 778109193 778292477 778499901 778675199 778879941 779151618 779406428 779582620 779738307 779981971
1964.1 779981971 780255198 780404806 780484796 780666709 780942380 781131685 781185865 781278372 781517267 781714261
1984.5 781714261 781743824 781778276 781930029 782054126 782040238 782003462 782087684 782231092 782223880 782078564 782001138
2006.9 782001138 782016993 781914413 781664371 781464159 781360507 781208396 780922592 780632257 780439556 780250371
2027.3 780250371 779941797 779597104 779365420 779205561 778962851 778644919 778422654 778303087 778143764 777915776
2047.7 777915776 777769625 777780890 777819395 777753770 777686477 777782440 777952015 778007984 777988493 778083980 778261244
2070.2 778261244 778340459 778332233 778405190 778569400 778667092 778659761 778706670 778907478 779103994 779151022 779148221
2092.6 779148221 779273570 779500067 779667735 779763877 779922307 780159473 780348480 780450642 780540764 780689001
2113 780689001 780855954 780965507 781042874 781176925 781341016 781425238 781449318 781541824 781726241 781885386 781974316
2135.4 781974316 782084882 782270133 782418489 782476783 782579601 782769263 782929242 783022463 783154011 783401370
2155.8 783401370 783702016 783955753 784173012 784451008 784832597 785220265 785561442 785948217 786418200 786894143
2176.2 786894143 787286937 787634850 788058996 788540602 788949311 789287508 789667368 790091872 790483296 790828884
2196.6 790828884 791188061 791598916 791988552 792282879 792580545 792983651 793413401 793749928 794015825 794346571
2217 794346571 794737458 795031548 795217276 795469761 795825541 796103954 796238899 796378553 796623468 796876967
2237.4 796876967 797028184 797136545 797301531 797478199 797589302 797681093 797843635 798037827 798136234 798174739
2257.8 798174739 798279703 798435330 798556328 798635125 798734486 798902392 799058259 799081981 799042583 799084961
2278.2 799084961 799208760 799306333 799351871 799387097 799393356 799351215 799296975 799280226 799300015 799288034 799209833
2300.6 799209833 799162686 799162388 799114823 799036682 798986137 798945010 798867702 798779070 798716366 798663974 798607290 798547924
2325.1 798547924 798474252 798382044 798300862 798180938 797972918 797744811 797484636 797110260 796620488 796093106
2345.5 796093106 795765996 795687973 795733571 795830309 795891047 795794845 795486510 795047045 794606388 794121206
2365.9 794121206 793528378 792962074 792447448 791903675 791380644 790952325 790610671 790306747 789993405 789650202
2386.3 789650202 789303780 788972378 788621783 788203716 787743211 787307680 786884308 786413312 785896122 785371661
2406.7 785371661 784833789 784272432 783705652 783135355 782523274 781856179 781176567 780515969 779863894 779185951
2427.1 779185951 778487742 777797759 777104855 776369035 775580704 774786234 774051547 773353815 772604585 771826804
2447.5 771826804 771101952 770413637 769677222 768887520 768137515 767443538 766725540 765961111 765216291 764537156
2467.9 764537156 763862431 763116539 762341797 761609018 760902047 760167837 759420693 758718908 758052349 757338822
2488.3 757338822 756571829 755856454 755234718 754621506 753944218 753257990 752637267 752042294 751414239 750773072
2508.7 750773072 750154436 749530911 748861909 748167694 747508049 746888757 746233225 745520175 744830132 744160414
2529 744160414 743422747 742631674 741872430 741144121 740386367 739575088 738742292 737960756 737253308 736535430
2549.4 736535430 735745668 734962583 734263599 733588934 732863724 732094765 731357276 730678499 729997277 729291022
2569.8 729291022 728587687 727886677 727152586 726380825 725630224 724927783 724220693 723471224 722707868 721981943
2590.2 721981943 721281767 720562875 719839871 719128788 718402028 717614710 716758311 715879560 715003192 714075744
2610.6 714075744 713083863 712074459 711044610 709985435 708877504 707704127 706524312 705362082
2626.9 705362082 704152107 702878952 701591671 700317740 699056268 697778404 696466088 695150435
2643.3 695150435 693859339 692591429 691330552 690048277 688755035 687489271 686247289 684989989
2659.6 684989989 683725715 682500958 681303144 680105746 678909659 677707016 676492453 675316274
2675.9 675316274 674214661 673124909 671993613 670851767 669762373 668702424 667617619 666504741
2692.2 666504741 665365875 664206028 663019001 661800444 660565495 659316838 658041894 656725883
2708.5 656725883 655382812 654041827 652679205 651283026 649892151 648534656 647214651 645920455
2724.8 645920455 644654989 643409967 642191231 641018391 639861882 638694704 637532890 636392415
2741.2 636392415 635276675 634175479 633092940 632039249 630957901 629831016 628729522 627663016
2757.5 627663016 626604676 625566304 624509692 623394191 622269452 621135831 619933188 618684649
2773.8 618684649 617455065 616209984 614885449 613502085 612069309 610572755 609028995 607449174
2790.1 607449174 605844080 604206324 602492630 600700200 598877907 597034574 595117986 593108475
2806.4 593108475 591073811 589025795 586884081 584657133 582399130 580090165 577696204 575218737
2822.7 575218737 572666705 569999635 567194164 564263761 561166883 557847500 554254293 550255775
2839.1 550255775 545645177 540263474 534066916 527199566 520110726 513505042 508094907 504187286
2855.4 504187286 501480937 499318123 496985823 493976474 490168840 485763013 481165916 476876497
2871.7 476876497 473284930 470518500 468494624 467021704 465843529 464714229 463454396 462009072
2888 462009072 460411459 458645999 456654549 454431385 451994985 449327916 446421742 443237782 439658582
2906.4 439658582 435580522 430982590 425869077 420250893 414278239 408270776 402658939 397904605
2922.7 397904605 394314647 391998917 390984565 391254216 392769992 395461947 399171025 403643638
2939 403643638 408510715 413311809 417596519 421051264 423586726 425305277 426405162 427206665 428206235
2957.4 428206235 429848194 432295889 435543418 439568192 444298923 449626952 455428898 461511791
2973.7 461511791 467645109 473660260 479480535 484983325 489993036 494433701 498313904 501644969
2990 501644969 504394472 506490171 507895172 508627236 508740127 508320153 507457972 506257892 504882395
3008.3 504882395 503504157 502182305 500898659 499621958 498251349 496670336 494823605 492704660
3024.7 492704660 490384668 488036156 485756934 483491987 481174052 478756100 476245880 473688632
3041 473688632 471069723 468382597 465633154 462823689 460027933 457285404 454553425 451829314 449159145
3059.3 449159145 446606219 444215238 441963911 439852864 437907159 436062872 434237689 432443082
3075.6 432443082 430748433 429137617 427548349 426009506 424578160 423245460 421973556 420744151
3092 420744151 419525087 418285906 417031646 415730476 414332598 412865490 411391616 409915209 408386499
3110.3 408386499 406798989 405173063 403474540 401691347 399854392 397950053 395956129 393906444
3126.6 393906444 391846776 389776915 387653291 385450065 383200467 380967528 378729880 376430303
3143 376430303 374094367 371758729 369445771 367145419 364789069 362357646 359911323 357462019 354996115
3161.3 354996115 352533668 350061804 347563297 345071733 342626721 340219229 337820143 335397154
3177.6 335397154 332960397 330530465 328104973 325704753 323333323 320989072 318678945 316406220
3193.9 316406220 314162284 311930567 309747785 307645202 305568248 303493410 301466018 299474895
3210.3 299474895 297489703 295547903 293665767 291776806 289841443 287894756 285976350 284087569
3226.6 284087569 282189459 280251116 278276265 276234835 274106503 271941721 269784003 267629683
3242.9 267629683 265437007 263172507 260846913 258503944 256168962 253831267 251478136 249114841
3259.2 249114841 246759668 244436398 242186591 240039647 238007292 236075148 234237909 232540637
3275.5 232540637 230980664 229531601 228208780 227022991 225992024 225096628 224273205 223516196 222879663
3293.9 222879663 222356662 221886307 221471608 221128896 220852435 220612422 220353335 220081061 219828442 219587818
3314.3 219587818 219382942 219235003 219100058 218944207 218739986 218466118 218175337 217932299 217706352 217461422
3334.7 217461422 217192873 216861784 216434717 215955243 215481564 214999557 214506611 213991880 213404253 212778360
3355.1 212778360 212192580 211615190 211014479 210432857 209877342 209339395 208768159 208088130 207378075 206776023
3375.5 206776023 206284970 205835015 205375820 204931021 204556033 204322711 204193980 203949377 203537732 203188136
3395.9 203188136 203065827 203053504 202927247 202658936 202444166 202416241 202494264 202555552 202604875 202673614 202794284
3418.3 202794284 203022599 203342006 203763723 204322845 204978257 205638617 206378579 207279086 208114922 208746836
3438.7 208746836 209386602 210235104 211280510 212400153 213491470 214619622 215841159 217136398 218530342
3457 218530342 220003456 221445516 222883984 224493369 226278752 227988720 229416654 230787292 232411921
3475.4 232411921 234320045 236317381 238171041 239940286 241856754 243867919 245837674 247836664
3491.7 247836664 249918267 252090424 254267186 256407052 258571804 260694802 262733966 264843971
3508 264843971 267129600 269553781 271989048 274307013 276644528 279178321 281876385 284516633 286982208
3526.4 286982208 289451987 292073786 294862747 297821820 300797909 303672910 306680322 309942305
3542.7 309942305 313242763 316329658 319331825 322511494 325845391 329227626 332669526 336247087
3559 336247087 339957863 343706787 347481579 351453245 355548590 359575599 363646597 367929727 372385144
3577.4 372385144 376949370 381650895 386464328 391292632 396066844 400860131 405679524 410584629
3593.7 410584629 415662646 420868427 426080316 431255251 436435014 441623449 446917593 452303678
3610 452303678 457711130 463140994 468492329 473896235 479436487 484753340 489899188 495053977 500380158
3628.4 500380158 505861342 511029780 516073167 521146774 526126862 531087577 536133945 541187584
3644.7 541187584 546143711 551074088 555838168 560163677 564288199 568633258 573063314 577256322
3661 577256322 581251085 585236073 589148641 592877090 596569717 600020885 603039265 605956674 608941138
3679.4 608941138 611928701 615003467 618167818 621254504 623945177 626188040 628339827 630549848
3695.7 630549848 632709563 634754777 636702180 638635516 640656173 642637730 644281805 645548463
3712 645548463 646936595 648589790 650292039 651905477 653324604 654493332 655586839 656960785 658582211
3730.3 658582211 660165846 661374509 662215233 663259864 664631963 665726066 666388810 667473316 668734133
3748.7 668734133 669425726 669975102 670979798 672115803 673036516 673871815 674758315 675664127 676552534
3767.1 676552534 677253127 677828968 678604364 679611623 680657446 681508243 682185292 682810426 683397889
3785.4 683397889 684056818 684843838 685723960 686559200 687252045 688001513 688728213 689269006 689966321 690561235
3805.8 690561235 690848529 691405475 692351520 693219841 693816721 694491684 695002973 695179939 695579171 696151853
3826.2 696151853 696717203 697352767 698083043 698848248 699340463 699459374 699653983 700012267 700414300 701016188
3846.6 701016188 701897979 702736557 702798188 702378511 702686608 703410447 704054475 704501092 704888284 705310166
3867 705310166 705574512 705741763 705942869 706241012 706762314 707258940 707637012 708004594 708203018 708383560
3887.4 708383560 708634615 708727837 708887458 709363520 709868133 710117042 710166931 710157514 710211456 710402429
3907.8 710402429 710668981 710974634 711292326 711494148 711569428 711694002 711884856 712037742 712224603 712504566
3928.2 712504566 712683737 712742329 712901056 713124752 713293552 713447213 713622928 713808298 713952184 714052975
3948.6 714052975 714211047 714429677 714625120 714782894 714936972 715099394 715246141 715358913 715484977 715667963
3969 715667963 715819478 715883136 715973139 716132045 716295660 716484308 716676056 716801703 716934085 717140436
3989.4 717140436 717314780 717411697 717571974 717822731
3997.5 717822731
##END=$$ End of the data block
