##TITLE=G18-52-CE $$ Begin of the data block
##JCAMP-DX=5.00 $$ ACD/SpecManager v 10.08
##SPECTROMETER/DATA SYSTEM=Alpha
##DATE=21 Oct 2013 11:04:12
##DATA TYPE=INFRARED SPECTRUM
##DATA CLASS=XYDATA
##ORIGIN=
##OWNER=
##NPOINTS=1765
##FIRSTX=399.75695801
##LASTX=3997.56933594
##MAXX=3997.56933594
##MINX=399.75695801
##MAXY=0.79154032
##MINY=0.24387443
##XFACTOR=1.0000000000
##YFACTOR=1.000000000000000e-9
##FIRSTY=0.48690006
##DELTAX=2.03957629
##XUNITS=1/CM
##YUNITS=ARBITRARY UNITS
##XYDATA=(X++(Y..Y))
399.8D86900061m253208k594978m43637J47581j97143L76046Q18908J58579l79712
418.1D80532497m28229j060903k170384k314568j362026r94324j648248j632243j22607
436.5D68798965Q32498N43416Q04603J564145J241535R9391k63393n5313n74947j698613
456.9D71292287k113938j469046j689315k758592k583564j443058j506686k438516
473.2D55289572j936674p95811r38982j350641p27177j10268o48648j471609j228332
491.5D46081430p40886j502752k361656j944959j477897k168953k896667k607673k157063
509.9D28222924k512127k891808k375663j748621j833320j765728p53939R0599j87069
528.3D14245248k87473O81370J757801K104789K167463K498806K296656R81033j14829
$$ plain form
399.8 486900061 482646853 480051875 479608238 479755819 479558676 479934722 480753630 480912209 480532497
418.1 480532497 480104268 479043365 476872981 474558413 473196387 472202063 470553815 468921572 468798965
436.5 468798965 469631463 470174879 470979482 472543627 473785162 473884553 473621160 473565847 472990900 471292287
456.9 471292287 469178349 467709303 466019988 463261396 460677832 459234774 457728088 455289572
473.2 455289572 453352898 452557087 451618105 450267464 449540287 449430019 448781371 447309762 446081430
491.5 446081430 445340544 443837792 441476136 439531177 438053280 435884327 432987660 430379987 428222924
509.9 428222924 425710797 422818989 420443326 418694705 416861385 415095657 414341718 414432317 414245248
528.3 414245248 413957775 414639145 416396946 418501735 420669198 423168004 425464660 426445693 426330864
546.6D26330864k10315l49074j004756j432180j319349j301229j766205k195358k064109
565D14688289j878232k097100j825869n01990P56502J204014J585871K403706K967596
583.3D17302787K661199K108246J871764J509428O16432n2393K37018N50270Q1241
601.7D26885992l34054j3828M32730L42547Q6397L68625Q98808J018614J111984J821280
622.1D32619095K581626K608389K349853K434194K553314K129168J498997J464069
638.4D50238705J734316J483142J059235J171678J349717Q33273J85132K85000O48230
656.7D58988428M78715M7326J39922Q62390J682639J268029M12017J110792J631111
675.1D66621369J382321J392514J703888J423567P12127N33819P09266K63273o69539
$$ plain form
546.6 426330864 426120549 425771475 424766719 423334539 422015190 420713961 418947756 416752398 414688289
565 414688289 412810057 410712957 408887088 408385098 409141600 410345614 411931485 414335191 417302787
583.3 417302787 419963986 422072232 423943996 425453424 426069856 426017463 426254481 426804751 426885992
601.7 426885992 426551938 426538110 426970840 427313387 427399784 427768409 428667217 429685831 430797815 432619095
622.1 432619095 435200721 437809110 440158963 442593157 445146471 447275639 448774636 450238705
638.4 450238705 451973021 453456163 454515398 455687076 457036793 457870066 458055198 458340198 458988428
656.7 458988428 459467143 459514469 459654391 460516781 462199420 463467449 463879466 464990258 466621369
675.1 466621369 468003690 469396204 471100092 472523659 473235786 473769605 474478871 474742144 474072605
693.5D74072605r94235o25104m48972l56406N11438J669973K016962J827001K173663
711.8D79846925L092229L550708L437042L740252M478782M592359M060626L833175
728.1E10632098M018128L611624K524793J978338K046525J581490N49138J50859M78089
746.5E27571082K98321n29289p77304m52101p56860j488984j289487j57117N95271
764.8E23013532R19759J997292L770650M730880M550755M610717N181432M919708L703415
783.2E57398140L042400L232420K890587J751423J451313K379358K927840K596140
799.5E77669621K692639L455341L364146K205372J593172J878322J641273O25193R0957
817.9E95216036K84672q2612j344622k066075j749278j712977k389074k565801k023995
$$ plain form
693.5 474072605 473078370 472453266 472004294 471647888 472159326 473829299 475846261 477673262 479846925
711.8 479846925 482939154 486489862 489926904 493667156 498145938 502738297 506798923 510632098
728.1 510632098 514650226 518261850 520786643 522764981 524811506 526392996 526942134 527092993 527571082
746.5 527571082 527869403 527340114 526562810 526110709 525353849 523864865 522575378 522418261 523013532
764.8 523013532 523933291 525930583 529701233 534432113 538982868 543593585 548775017 553694725 557398140
783.2 557398140 560440540 563672960 566563547 568314970 569766283 572145641 575073481 577669621
799.5 577669621 580362260 583817601 587181747 589387119 590980291 592858613 594499886 595125079 595216036
817.9 595216036 595500708 595418096 594073474 592007399 590258121 588545144 586156070 583590269 581566274
836.2E81566274j960397k560973k568841j737773j337350j668930j652360r79542o67334
854.6E66432774j092732r16839Q60513L106951M416347N159497N910635N826473M627049
872.9E94330668L450096K504647Q00729j633764l434360m071831m516364n258500n472362
891.3E76698959m799545m278660m558742m845798m679024m916310n920172o724835
907.6E35975873o748497o690621p004142o816447n526900l999830l016710k194881
923.9D93977845j219333o62773p98613q69960m59254k49236o54400j056045j221269
942.3D86786962k206505m576653p117301q605719r312570r923607j0327667j0191530
958.6D24525410r890586r930372r981007r521693q779466q153975p384658o106108
$$ plain form
836.2 581566274 579605877 577044904 574476063 572738290 571400940 569732010 568079650 567100108 566432774
854.6 566432774 565340042 564423203 565283716 568390667 572807014 577966511 583877146 589703619 594330668
872.9 594330668 597780764 600285411 601086140 599452376 596018016 591946185 587429821 582171321 576698959
891.3 576698959 571899414 567620754 563062012 558216214 553537190 548620880 542700708 535975873
907.6 535975873 529227376 522536755 515532613 508716166 503189266 499189436 496172726 493977845
923.9 493977845 492758512 492095739 491297126 490427166 489967912 489718676 489064276 488008231 486786962
942.3 486786962 484580457 480003804 472886503 464280784 454968214 445044607 434716940 424525410
958.6 424525410 414634824 404704452 394723445 385201752 376422286 368268311 360883653 354777545
974.9C54777545m653812l561705k739996j831919j047224q16702r55165r31144p17520
993.3C37522358o48082o16997k80142J65969K45273n4478m11481p35968j152754j530111
1013.7C32503587j562327j347304j323103j522124j593501j547843j644611j814634
1030C20148140j813531j688987j704782j862258j881063j745879j680464j654655j397073
1048.3C04719448q67069k94149K08915O65098J156747J619250J949906K212495K175689
1066.7C13546330J318514k37018j375913j246185k29179Q95947J900911K831280L516406
1085C20921093L774405L748238L657400L477693L065586K485007J961589J508951J112253
1103.4C45712215R96262J317024J838982K204537K371967K476484K502381K340287
$$ plain form
974.9 354777545 350123733 346562028 343822032 341990113 340942889 340126187 339171022 338239878 337522358
993.3 337522358 336874276 336257279 335977137 336143106 336388379 336333901 335922420 335186452 334033698 332503587
1013.7 332503587 330941260 329593956 328270853 326748729 325155228 323607385 321962774 320148140
1030 320148140 318334609 316645622 314940840 313078582 311197519 309451640 307771176 306116521 304719448
1048.3 304719448 303852379 303558230 303767145 304432243 305588990 307208240 309158146 311370641 313546330
1066.7 313546330 314864844 314627826 313251913 312005728 311776549 312672496 314573407 317404687 320921093
1085 320921093 324695498 328443736 332101136 335578829 338644415 341129422 343091011 344599962 345712215
1103.4 345712215 346708477 348025501 349864483 352069020 354440987 356917471 359419852 361760139
1119.7C61760139K030552J806050J850933K126396K537638K922922K991617K543330
1136C80569577J685381Q04573J85371k52485o14792p40260n85020l61174j11342L82424
1156.4C80962253J167148J954854K560287L112078L680974M150301M547626N062938
1172.7D07198459N714506O255030O512702O605387O648212O485969N959988N217403
1189.1D56597656M396617L334165K023697Q80241J78308k65748o71088q93385p24166
1207.4D64856297l57867j84148k14875j88350j62155l90768p65204j019746j243592
1225.8D60329592j587569j881004j847535j582265j378834j166165p00474n2899N03033
1244.1D50635880R57608J467020J958936K206654K196163K154409K217323K210557
$$ plain form
1119.7 361760139 363790691 365596741 367447674 369574070 372111708 375034630 378026247 380569577
1136 380569577 382254958 383059531 383244902 382992417 382377625 381637365 381052345 380691171 380579829 380962253
1156.4 380962253 382129401 384084255 386644542 389756620 393437594 397587895 402135521 407198459
1172.7 407198459 412912965 419167995 425680697 432286084 438934296 445420265 451380253 456597656
1189.1 456597656 460994273 464328438 466352135 467232376 467410684 467144936 466473848 465580463 464856297
1207.4 464856297 464498430 464314282 464099407 463911057 463748902 463358134 462592930 461573184 460329592
1225.8 460329592 458742023 456861019 455013484 453431219 452052385 450886220 450185746 450132847 450635880
1244.1 450635880 451593488 453060508 455019444 457226098 459422261 461576670 463793993 466004550
1260.4D66004550K045840K028645K230614K288312K071738J818746J604528J292139
1276.8D81385112R38713Q28088R80794J112789J095235J025081R29266N79506o3180
1295.1D88811404o86735j090020j421243j776398j967161j903683j732171j543164
1311.4D76690829j180560o14672q3507K21759L00318J50055l55542j161724j875400
1329.8D72091556k166242k118289j929969j617551j182854q00609n94378n38886n76466
1348.1D60566312p73638j155466j526296j698554j730025j971841k609670l253341
1364.5D45847481l459990l340750k860964k394855k534330k992570l353268l656179
1380.8D21254575l585964k713084j458913n31912m8787J31667n663j23828N096K61188
$$ plain form
1260.4 466004550 468050390 470079035 472309649 474597961 476669699 478488445 480092973 481385112
1276.8 481385112 482323825 483151913 484132707 485245496 486340731 487365812 488295078 488874584 488811404
1295.1 488811404 488124669 487034649 485613406 483837008 481869847 479966164 478233993 476690829
1311.4 476690829 475510269 474895597 474812090 475033849 475334167 475484222 475128680 473966956 472091556
1329.8 472091556 469925314 467807025 465877056 464259505 463076651 462276042 461681664 461142778 460566312
1348.1 460566312 459792674 458637208 457110912 455412358 453682333 451710492 449100822 445847481
1364.5 445847481 442387491 439046741 436185777 433790922 431256592 428264022 424910754 421254575
1380.8 421254575 417668611 414955527 413496614 412964702 412915915 413047582 413041919 412918091 412923187 413184375
1401.2D13184375O35564J027167J226097J297027J297981J313745J565129J940906
1417.5D23487991K012581J685679J669496J689523J369894Q70913K58446j34408m83454
1435.9D32426661q97914o23673K1756L85701N30392N60731L99351K75671P11143J909882
1456.2D35699701K611786K092779K205044K941400L399104L986239N833537Q445382
1472.6D67214972Q679598O837309N333006M181594L042877J666009K69055j340300
1488.9D95884120l066599l781199m184366n163669n646527n311132m803776n626858
1505.2D58299994q805692r266644p915289p224440n925924m161745k540112k143919
1521.5D10316229k556592k736718k927720k600283k067119k070784j790047r28611
$$ plain form
1401.2 413184375 413819939 414847106 416073203 417370230 418668211 419981956 421547085 423487991
1417.5 423487991 425500572 427186251 428855747 430545270 431915164 432786077 433044523 432910115 432426661
1435.9 432426661 431528747 430905074 430926830 431312531 431842923 432403654 432803005 433078676 433789819 435699701
1456.2 435699701 438311487 440404266 442609310 445550710 448949814 452936053 458769590 467214972
1472.6 467214972 475894570 482731879 488064885 492246479 495289356 496955365 497224420 495884120
1488.9 495884120 492817521 489036322 484851956 479688287 474041760 468730628 463926852 458299994
1505.2 458299994 449494302 440227658 432312369 425087929 419162005 415000260 412460148 410316229
1521.5 410316229 407759637 405022919 402095199 399494916 397427797 395357013 393566966 392638355
1537.8C92638355n31017p73132m97610L23028J381665K432794L206730L852337M440397
1556.2D06473547N570352N241514L029674K877891L331572L302335K913803K163023
1572.5D34903711J996338J814366Q27849K76506P7009k17348n88477r43452j432300
1590.9D36714202k039939k729833l313303l840059m582077n393088o018758o633014
1607.2D02164131p551878q197546q173317q909673j0723084r955913r211957j0544717
1623.5C28896046j0620356r805262r256035p826686o733984o869495n284369k673983
1639.8B69825876j047224O6102J015633J557678J633197K397388L277391K748251K969504
1658.2B84443796M153847N464197O151408O032407O834328P776827P137149P362277
$$ plain form
1537.8 392638355 392107338 391334206 390836596 391159624 392541289 394974083 398180813 402033150 406473547
1556.2 406473547 412043899 417285413 420315087 423192978 426524550 429826885 432740688 434903711
1572.5 434903711 436900049 438714415 439542264 439818770 439895779 439678431 439089954 438146502 436714202
1590.9 436714202 434674263 431944430 428631127 424791068 420208991 414815903 408797145 402164131
1607.2 402164131 394612253 386414707 378241390 369331717 358608633 348652720 339440763 328896046
1623.5 328896046 318275690 308470428 299214393 291387707 284653723 277784228 272499859 269825876
1639.8 269825876 268778652 268844754 269860387 271418065 273051262 275448650 278726041 281474292 284443796
1658.2 284443796 288597643 294061840 300213248 306245655 313079983 320856810 327993959 335356236
1674.5C35356236P971614P445335P379711Q731604J0888219R811103Q722723R982675
1690.8D06289220J0827809J3280601J5382886J5204578J6129911J3036877J0779560
1705.1E00931442J0719180R138465P833123P221818O993234O796122N195558L666103
1721.4E58495045L511667L496230L047406K791345K684355K679348J999736J469672
1737.7E80174804K018630K600909K989292L756106M836618N938530O356717N999624
1754F14671230O309927O672323O312131O191731N726278N384922N468964N298078N126119
1772.4F67161703M323602L324449L171146L314733L141284K771199K467632K489984
1788.7F92165732K785266K626479J873672J756370K119004K081693J683294J603961
$$ plain form
1674.5 335356236 343327850 350773185 358152896 366884500 377772719 387583822 396306545 406289220
1690.8 406289220 417117029 430397630 445780516 460985094 477115005 490151882 500931442
1705.1 500931442 511650622 520789087 528622210 535844028 542837262 549633384 554828942 558495045
1721.4 558495045 562006712 565502942 568550348 571341693 574026048 576705396 578705132 580174804
1737.7 580174804 582193434 584794343 587783635 591539741 596376359 602314889 608671606 614671230
1754 614671230 620981157 627653480 633965611 640157342 645883620 651268542 656737506 662035584 667161703
1772.4 667161703 671485305 674809754 677980900 681295633 684436917 687208116 689675748 692165732
1788.7 692165732 694950998 697577477 699451149 701207519 703326523 705408216 707091510 708695471
1805G08695471J834810J817405J556993J436651J553714J529097J366795J450955J727224
1823.4G22969115J677811J358986J291692J171947R48667R07838J032353J218915J319528
1841.7G33896852J181721Q48890P09533O93023O27995P30634R57191Q96394O28948
1860.1G41171181O29246R06408J022995P87377M91262N03659N97060M94361M94599
1878.4G47098148O98686P61151O34730O61909Q60870P84934M75526M11987N65529N86390
1898.8G53539860M36723L84152N51224O23405M17710K56538L75271N51164M84407K94089
1919.2G57914543L39925M32373K30729J01388K84910M12881K75791J54197L06547M58360
1939.6G60911644L25620Q5711J08183K60353K31862J69456K55823L48806K45631J30951
$$ plain form
1805 708695471 710530281 712347686 713904679 715341330 716895044 718424141 719790936 721241891 722969115
1823.4 722969115 724646926 726005912 727297604 728469551 729418218 730326056 731358409 732577324 733896852
1841.7 733896852 735078573 735927463 736636996 737330019 737958014 738688648 739645839 740542233 741171181
1860.1 741171181 741800427 742706835 743729830 744517207 745008469 745512128 746109188 746603549 747098148
1878.4 747098148 747796834 748557985 749192715 749854624 750715494 751500428 751975954 752387941 752953470 753539860
1898.8 753539860 753976583 754360735 754911959 755535364 755953074 756209612 756584883 757136047 757620454 757914543
1919.2 757914543 758254468 758686841 758917570 759018958 759303868 759716749 759992540 760146737 760453284 760911644
1939.6 760911644 761237264 761322975 761431158 761691511 761923373 762092829 762348652 762697458 762943089 763074040
1960G63074040K42353L97324L09587J05679J28806K88427K45690R6261J45257K36988
1980.4G65270412J46627L2843J11103K52902K05696J7404n364J51813J51157j0907
2000.8G66323686k8193Q1598J7524j56283j64867m1127o4790k39849k71976j52707
2021.2G65303016j49787k95281l02613j75297j67608k79427k85685j64569j36435k26259
2041.6G63120055k35200j10864p3493j47343j24454L2246Q5115k8908m6432R3162J63734
2064G62727618P3731K0504J15752J72019N1916j3053J00553J55270N6326N961J13010
2086.5G63579607K10702J59622P1108J35720K13325J35124P7724J70410K54094J68145
2106.9G65175581N4955J05560K07424J62840P9692J15156J54972Q1897R298Q1599J89185
$$ plain form
1960 763074040 763316393 763713717 764023304 764128983 764257789 764546216 764791906 764888167 765033424 765270412
1980.4 765270412 765417039 765449882 765560985 765813887 766019583 766036987 766031623 766183436 766334593 766323686
2000.8 766323686 766295493 766377091 766394615 766238332 766073465 766032338 765967548 765727699 765455723 765303016
2021.2 765303016 765153229 764857948 764555335 764380038 764212430 763933003 763647318 763482749 763346314 763120055
2041.6 763120055 762884855 762773991 762700498 762553155 762428701 762460947 762546062 762517154 762470722 762563884 762727618
2064 762727618 762801349 762821853 762937605 763109624 763161540 763148487 763249040 763404310 763460636 763466597 763579607
2086.5 763579607 763790309 763949931 764021039 764156759 764370084 764505208 764582932 764753342 765007436 765175581
2106.9 765175581 765230536 765336096 765543520 765706360 765786052 765901208 766056180 766138077 766147375 766228974 766418159
2129.3G66418159J38223M0531J25110K44380J41501n96J00136K43723J78397O9201
2149.7G67698765J24633K27988J95622J41800K07782L03268L07679K78950L45647M77553
2170.1G70309687N01394M00126L60608M27961M54426L79384L65317M50551M45604L52741
2190.5G74447799L51846M17411L79145K93553L35753M27723L90351K95579K99931L77536
2210.9G78016627L95536L25740L13341L77834L45230K18809J87397K77161K98143J84417
2231.3G80940235J48356K47597K71619J91152J41918J68741J93894J65045J47522J74820
2251.7G82790899J76072J30237J24156J78695K02954J48773R9778J26123J61648J22726
2272.1G84262061N3465L7194L1829m828M708R0898J26004R6500J00255J21534J18434
$$ plain form
2129.3 766418159 766556382 766596913 766722023 766966403 767107904 767107308 767207444 767451167 767629564 767698765
2149.7 767698765 767823398 768051386 768247008 768388808 768596590 768899858 769207537 769486487 769832134 770309687
2170.1 770309687 770811081 771211207 771571815 771999776 772454202 772833586 773198903 773649454 774095058 774447799
2190.5 774447799 774799645 775217056 775596201 775889754 776225507 776653230 777043581 777339160 777639091 778016627
2210.9 778016627 778412163 778737903 779051244 779429078 779774308 779993117 780180514 780457675 780755818 780940235
2231.3 780940235 781088591 781336188 781607807 781798959 781940877 782109618 782303512 782468557 782616079 782790899
2251.7 782790899 782966971 783097208 783221364 783400059 783603013 783751786 783851564 783977687 784139335 784262061
2272.1 784262061 784315526 784352720 784384549 784379721 784384429 784475327 784601331 784697831 784798086 784919620 785038054
2294.5G85038054J15633J56403J85132J78098K31207L31580L50356L04640K62737K54631
2314.9G87408471L88861N96702O50346M83155K84315K73048L57211K24531n6505m8936
2335.3G90561199J13964N3525j92940o36756j268685j316607m67897O97851J494229
2353.6G89037883J493931R12130R6381m50492p98583j221061j537263j641989j666844
2372G84224093j613677j484692j395583j312673j111984q37386o25849n07772m39107
2390.4G74895370l72827l55721m11272m29511l96490m05609m67599n16534n30600n31614
2410.8G70477593n43952n65410n78642n88953o31929o74903o36399n96046o56486p33852
2431.2G64271021p15911o39976o39379p25805p43389o70374o62625p30574p55370p28607
$$ plain form
2294.5 785038054 785153687 785310090 785495222 785673320 785904527 786236107 786586463 786891103 787153840 787408471
2314.9 787408471 787797332 788394034 789044380 789527535 789811850 790084898 790442109 790666640 790610135 790561199
2335.3 790561199 790675163 790728688 790535748 789898992 788630307 787313700 786845803 787543654 789037883
2353.6 789037883 790531814 791443944 791540325 791089833 790291250 789070189 787532926 785890937 784224093
2372 784224093 782610416 781125724 779730141 778417468 777305484 776468098 775842249 775334477 774895370
2390.4 774895370 774522543 774166822 773755550 773326039 772929549 772523940 772056341 771539807 771009207 770477593
2410.8 770477593 769933641 769368231 768789589 768200636 767568707 766893804 766257405 765661359 765004873 764271021
2431.2 764271021 763555110 762915134 762275755 761549950 760806561 760136187 759473562 758742988 757987618 757259011
2451.5G57259011p16269p14719p01189o82950o81281o96719p02739o95288o97315o95228
2471.9G50275314o65069o66022p05600p26819p25686o80328o34909o42955o29365o06656
2492.3G43591905o41823o62863o10471n59986n81622o25730o22987n85497n62429n69821
2512.7G37568676n68091n51999n83053o58631o70493o10530o19054p06494p26163o66857
2533.1G31207311o67751p19905p21335p03335p37905p84159p39157o68168o94752p30574
2553.5G24040270p04229o95467p24912p23421o58870o09696o55770p07507o67811o42896
2573.9G17249691p08997p55191p07626o27994o19948o87957p25746o88255o60479o76632
2594.3G10390866o50406o23942o91711p48814p39455p58886q20696q72374q73745q66770
$$ plain form
2451.5 757259011 756542742 755828023 755126834 754443884 753762603 753065884 752363145 751667857 750970542 750275314
2471.9 750275314 749610245 748944223 748238623 747511804 746786118 746105790 745470881 744827926 744198561 743591905
2492.3 743591905 742950082 742287219 741676748 741116762 740535140 739909410 739286423 738700926 738138497 737568676
2512.7 737568676 737000585 736448586 735865533 735206902 734536409 733925879 733306825 732600331 731874168 731207311
2533.1 731207311 730539560 729819655 729098320 728394985 727657080 726872921 726133764 725465596 724770844 724040270
2553.5 724040270 723336041 722640574 721915662 721192241 720533371 719923675 719267905 718560398 717892587 717249691
2573.9 717249691 716540694 715785503 715077877 714449883 713829935 713141978 712416232 711727977 711067498 710390866
2594.3 710390866 709740460 709116518 708424807 707675993 706936538 706177652 705356956 704484582 703610837 702744067
2614.7G02744067r35197j025796j053035j051188j081705j127005j153588j158953
2631F94157600j162886j158178j124263j127243j193225j225174j164138j116693j175046
2649.4F83710754j234233j216174j185298j191198j210571j158058j060307j067341
2665.7F74387574j125872j100421j052201j066923j101434j072109r98080r78589j020908
2684.1F64871037j040697j008272r76742j013755j053691j047373j078546j122236
2700.4F56529725j147628j169145j166702j184225j235008j248181j235485j235306
2716.7F46908045j196265j152397j190185j226604j150489j049995j031101j067043
2733F37843966j071035r97782r87113j062214j033843r57012r60231r71496r44972
$$ plain form
2614.7 702744067 701808870 700783074 699730039 698678851 697597146 696470141 695316553 694157600
2631 694157600 692994714 691836536 690712273 689585030 688391805 687166631 686002493 684885800 683710754
2649.4 683710754 682476521 681260347 680075049 678883851 677673280 676515222 675454915 674387574
2665.7 674387574 673261702 672161281 671109080 670042157 668940723 667868614 666870534 665891945 664871037
2684.1 664871037 663830340 662822068 661845326 660831571 659777880 658730507 657651961 656529725
2700.4 656529725 655382097 654212952 653046250 651862025 650627017 649378836 648143351 646908045
2716.7 646908045 645711780 644559383 643369198 642142594 640992105 639942110 638911009 637843966
2733 637843966 636772931 635775149 634788036 633725822 632691979 631734967 630774736 629803240 628858268
2751.4F28858268r21964r41992r92120r98139r48310r41455j004398j030803r92775
2769.7F20086312j000106j075745j129925j165926j220286j256764j253844j269221
2786F10714495j347959j411736j442611j501739j549065j575351j617730j667857j736939
2804.4E96863508j816749j850844j843452j870930j953960k038717k077937k109349
2820.7E81301570k211273k326965k388895k473354k620578k786279k960026l182828
2837E60351372l563106m147291m828215n519271o078661o202578n668402m545212l228664
2855.4E16569972k189040j716495j901447k554060l283083l799796l957808l688812
2871.7D93479431l094882k392143j773596j345396j109362j042306j102656j208157
$$ plain form
2751.4 628858268 627936304 626994312 626002192 625004053 624055743 623114288 622109890 621079087 620086312
2769.7 620086312 619086206 618010461 616880536 615714610 614494324 613237560 611983716 610714495
2786 610714495 609366536 607954800 606512189 605010450 603461385 601886034 600268304 598600447 596863508
2804.4 596863508 595046759 593195915 591352463 589481533 587527573 585488856 583410919 581301570
2820.7 581301570 579090297 576763332 574374437 571901083 569280505 566494226 563534200 560351372
2837 560351372 556788266 552640975 547812760 542293489 536214828 530012250 524343848 519798636 516569972
2855.4 516569972 514380932 512664437 510762990 508208930 504925847 501126051 497168243 493479431
2871.7 493479431 490384549 487992406 486218810 484873414 483764052 482721746 481619090 480410933
2888D80410933j337438j495511j654833j846135k082080k284556k445221k690792l077716
2906.4D61496651l516376l953576m426002m918844n219340n129874m684091l932327
2922.7D25716221k914935j774609o56754L81231J395315K400428L261149L893376M229724
2941D35931146M163891L736764L063024K301365J638204J137346Q84175J055389J626820
2959.4D55538124K339035L033251L719330M353523M828185N108714N217403N169809
2975.7D89307374N042642M857212M513592M103839L725410L255069K724528K227247
2992E19756913J696825J134694N71310L2664m00782p64131j059890j196087j223921
3010.4E18547595j215697j154065j098215j181186j404166j636565j810431j933038
$$ plain form
2888 480410933 479073495 477577984 475923151 474077016 471994936 469710380 467265159 464574367 461496651
2906.4 461496651 457980275 454026699 449600697 444681853 439462513 434332639 429648548 425716221
2922.7 425716221 422801286 421026677 420369923 420751154 422146469 424546897 427808046 431701422 435931146
2941 435931146 440095037 443831801 446894825 449196190 450834394 451971740 452855915 453911304 455538124
2959.4 455538124 457877159 460910410 464629740 468983263 473811448 478920162 484137565 489307374
2975.7 489307374 494350016 499207228 503720820 507824659 511550069 514805138 517529666 519756913
2992 519756913 521453738 522588432 523159742 523192406 522791624 522027493 520967603 519771516 518547595
3010.4 518547595 517331898 516177833 515079618 513898432 512494266 510857701 509047270 507114232
3026.7E07114232k004087k039016k037704k026736k083332k192199k264261k288848
3043D90178049k348334k428085k424806k389491k415895k424270k355397k308577k278894
3061.4D68804300k165497k001166j863450j766473j714438j679510j596570j495272
3077.7D54521924j467645j458019j382708j321376j296222j209915j119584j124888
3094D44141567j149446j130670j130700j200974j305879j357913j346945j358122j405478
3112.4D32755440j418888j434267j523614j625180j677066j703441j763344j820236
3128.7D19789404j793653j782626j857638j893878j866490j907945j993268k010346
3145D04683560j980662j959294j976967k033919k083689k080947k077252k103597k084792
$$ plain form
3026.7 507114232 505110145 503071129 501033425 499006689 496923357 494731158 492466897 490178049
3043 490178049 487829715 485401630 482976824 480587333 478171438 475747168 473391771 471083194 468804300
3061.4 468804300 466638803 464637637 462774187 461007714 459293276 457613766 456017196 454521924
3077.7 454521924 453054279 451596260 450213552 448892176 447595954 446386039 445266455 444141567
3094 444141567 442992121 441861451 440730751 439529777 438223898 436865985 435519040 434160918 432755440
3112.4 432755440 431336552 429902285 428378671 426753491 425076425 423372984 421609640 419789404
3128.7 419789404 417995751 416213125 414355487 412461609 410595119 408687174 406693906 404683560
3145 404683560 402702898 400743604 398766637 396732718 394649029 392568082 390490830 388387233 386302441
3163.4C86302441k024322k031893k108514k133161k104044k095193k085864k038062
3179.7C69681388k012044k042085k064794k035439j992613j979173j959949j935244
3196C53660047j923233j890838j841277j796782j761765j741796j719594j685262j667112
3214.3C37632388j688153j710713j678705j629144j651138j710027j711011j685888
3230.7C24167609j696020j782060j879602j885146j879573j935601j999438k021581
3247C09088588k047241k091825k108991k097935k106756k163291k182751k106369j988351
3265.3B90195078j885981j806080j743615j686334j581878j426697j283884j175463
3281.6B77605146j089781j004249q97825p84487p14689o85602n70298m20808m17144
$$ plain form
3163.4 386302441 384278119 382246226 380137712 378004551 375900507 373805314 371719450 369681388
3179.7 369681388 367669344 365627259 363562465 361527026 359534413 357555240 355595291 353660047
3196 353660047 351736814 349845976 348004699 346207917 344446152 342704356 340984762 339299500 337632388
3214.3 337632388 335944235 334233522 332554817 330925673 329274535 327564508 325853497 324167609
3230.7 324167609 322471589 320689529 318809927 316924781 315045208 313109607 311110169 309088588
3247 309088588 307041347 304949522 302840531 300742596 298635840 296472549 294289798 292183429 290195078
3265.3 290195078 288309097 286503017 284759402 283073068 281491190 280064493 278780609 277605146
3281.6 277605146 276515365 275511116 274613291 273828804 273114115 272428513 271858215 271437407 271020263
3300B71020263m42087l49850k94983l69787m08143l36915k74092k54989k50518k81662
3320.4B67757237l16024l33011l94940m37946l71783l26992l81648m49121n13256n79893
3340.8B63652623o10590o22213o42985o58810o73354p08073p64758p92742p75367p64727
3361.2B56639004p64668p50095p51495p77245q09848q08895p73638p50095o91578o26579
3381.6B49134868n67585m76852l76776l14012l93242n21704m82336l14534k18838l01689
3402B45167300m10974l36125j97068j03623l8817o3733j07169l5360N4717Q4266K06396
3424.4B44219810M18499N32165N01975N53564P04199O60464M91917N13598O80447Q44240
3444.8B50120878R69261R63032R52155J030236J130790J232475J281887J258165J295537
$$ plain form
3300 271020263 270578176 270228326 269933343 269563556 269155413 268818498 268544406 268289417 268038899 267757237
3320.4 267757237 267441213 267108202 266713262 266275316 265903533 265576541 265194893 264745772 264232516 263652623
3340.8 263652623 263042033 262419820 261776835 261118025 260444671 259736598 258971840 258179098 257403731 256639004
3361.2 256639004 255874336 255124241 254372746 253595501 252785653 251976758 251203120 250453025 249761447 249134868
3381.6 249134868 248567283 248090431 247713655 247399643 247006401 246484697 246002361 245687827 245468989 245167300
3402 245167300 244756326 244420201 244223133 244119510 244080693 244016960 243909791 243874431 243929148 244013414 244219810
3424.4 244219810 244638309 245170474 245672449 246226013 246930212 247590676 248082593 248596191 249276638 250120878
3444.8 250120878 251090139 252053171 253005326 254035562 255166352 256398827 257680714 258938879 260234416
3463.2B60234416J465141J589448J481026J239449J203537J387804J620800J776397
3479.5B71998018J733035J636356J676500J710772J675248J729787J835972J907110
3495.8B85902798J865328J820087J872063J818269J717180J802266J973450K092093
3512.1C00863534K078444J959503J967042K146006K352387K321064K107054K076298
3528.4C17871332K218038K356082K494335K520711K395957K456487K728194K860903
3544.7C37902039K681762K509237K609670K789944K830625K849519K989382L118157
3561.1C60280335L155798L279864L569872L540963L249824L262251L524691L699988
3577.4C87563586L820926L986091M063516M108668M158079M055620L961831M134208
$$ plain form
3463.2 260234416 261699557 263289005 264770031 266009480 267213017 268600821 270221621 271998018
3479.5 271998018 273731053 275367409 277043909 278754681 280429929 282159716 283995688 285902798
3495.8 285902798 287768126 289588213 291460276 293278545 294995725 296797991 298771441 300863534
3512.1 300863534 302941978 304901481 306868523 309014529 311366916 313687980 315795034 317871332
3528.4 317871332 320089370 322445452 324939787 327460498 329856455 332312942 335041136 337902039
3544.7 337902039 340583801 343093038 345702708 348492652 351323277 354172796 357162178 360280335
3561.1 360280335 363436133 366715997 370285869 373826832 377076656 380338907 383863598 387563586
3577.4 387563586 391384512 395370603 399434119 403542787 407700866 411756486 415718317 419852525
3593.7D19852525M315913M363030M397422M381835M302741M324674M555851M636050
3610D55130041M552573M578709M532308M657834M870296M549593M245311M376351M986078
3628.4D96479094N063176M194915M017473M254460M274964M298747M359782M372239
3644.7E31314850M526853M873097M528225L535926L334224L881514L873170L475606
3661E63343465L413320L541291L630817L746986L594577L010631K942681K914548K399743
3679.4E92538059K328336K634645K862274L046274K893210K216875J816929J850962
3695.7F12187564J937032J980186J957476J744687J618922J773357J820803J530469
3712F26550496J207828J138985J335800J535833J496553J275897J083553J111746J376867
$$ plain form
3593.7 419852525 424168438 428531468 432928890 437310725 441613466 445938140 450493991 455130041
3610 455130041 459682614 464261323 468793631 473451465 478321761 482871354 487116665 491493016 496479094
3628.4 496479094 501542270 505737185 509754658 514009118 518284082 522582829 526942611 531314850
3644.7 531314850 535841703 540714800 545243025 548778951 552113175 555994689 559867859 563343465
3661 563343465 566756785 570298076 573928893 577675879 581270456 584281087 587223768 590138316 592538059
3679.4 592538059 594866395 597501040 600363314 603409588 606302798 608519673 610336602 612187564
3695.7 612187564 614124596 616104782 618062258 619806945 621425867 623199224 625020027 626550496
3712 626550496 627758324 628897309 630233109 631768942 633265495 634541392 635624945 636736691 638113558
3730.3F38113558J678706J556873J021802O45757O24597Q35002J254081J321852R26674
3748.7F47978902P03275N76794N71609P21276Q08298P47144O76811P93696Q88168P81596
3769.1F55247569O38247N86331P27117R31859R26137P28011N57244M94241N10872O29246
3789.5F61976874P75695Q19921Q22485Q07285P47502P44820N45740K65121L05951M47333
3809.9F68258727N90503P69198R13679Q31247N60939L98994K36332K38121L98695M68850
3830.3F73665285O15060Q10087P42614M56870J92702O7711J14083L13997O32167P79212
3850.7F78389788N69284K38716L4392J02103L98517N68985M81844L23594L12209L24071
3871.1F81743503J05261N6744K28167M11212N27144L64422J75119O6519O4611K48075
$$ plain form
3730.3 638113558 639792264 641349137 642370939 643016696 643641293 644476295 645730376 647052228 647978902
3748.7 647978902 648682177 649258971 649830580 650551856 651360154 652107298 652784109 653577805 654465973 655247569
3769.1 655247569 655885816 656472147 657199264 658131123 659057260 659785271 660342515 660836756 661347628 661976874
3789.5 661976874 662752569 663572490 664394975 665202260 665949762 666694582 667240322 667505443 667811394 668258727
3809.9 668258727 668849230 669618428 670532107 671363354 671924293 672323287 672559619 672797740 673196435 673665285
3830.3 673665285 674280345 675090432 675833046 676289916 676482618 676550329 676664412 676978409 677610576 678389788
3850.7 678389788 678959072 679197788 679232180 679334283 679732800 680301785 680783629 681107223 681419432 681743503
3871.1 681743503 681848764 681905508 682133675 682544887 683072031 683436453 683611572 683678091 683742702 683990777
3891.5F83990777K92837K16484K91825M48882L97921J14858n6684r9480m8638R8527
3911.9F85647309K14398K89499K58983J37984R1613J36971J68383J70648J78576J51813
3932.3F87446177P7128K2591Q5413J80483K14040J89603J42276J45554J06573N2929
3952.7F88662767R9600J49965J36495J27732J29283J17659J61648J93894J21832O6698
3973.1F89967573R8705R9182R5129J77980K03728R9242K3603J04487K00093J64688
3993.4F91234410J06454J04189
3997.5F91445053
$$ plain form
3891.5 683990777 684283614 684500098 684791923 685240805 685638726 685753584 685696900 685597420 685548782 685647309
3911.9 685647309 685861707 686151206 686410189 686548173 686639786 686776757 686945140 687115788 687294364 687446177
3932.3 687446177 687523305 687545896 687631309 687811792 688025832 688215435 688357711 688503265 688609838 688662767
3952.7 688662767 688762367 688912332 689048827 689176559 689305842 689423501 689585149 689779043 689900875 689967573
3973.1 689967573 690066278 690165460 690260589 690438569 690642297 690741539 690765142 690869629 691069722 691234410
3993.4 691234410 691340864 691445053
3997.5 691445053
##END=$$ End of the data block
