##TITLE=G18-52-CE $$ Begin of the data block
##JCAMP-DX=5.00 $$ ACD/SpecManager v 10.08
##SPECTROMETER/DATA SYSTEM=Alpha
##DATE=21 Oct 2013 11:04:12
##DATA TYPE=INFRARED SPECTRUM
##DATA CLASS=XYDATA
##ORIGIN=
##OWNER=
##NPOINTS=1765
##FIRSTX=399.75695801
##LASTX=3997.56933594
##MAXX=3997.56933594
##MINX=399.75695801
##MAXY=0.79227364
##MINY=0.24319389
##XFACTOR=1.0000000000
##YFACTOR=1.000000000000000e-9
##FIRSTY=0.48505762
##DELTAX=2.03957629
##XUNITS=1/CM
##YUNITS=ARBITRARY UNITS
##XYDATA=(X++(Y..Y))
399.8D85057622l421664k394497j039684o92368n14358O27905J261294M69983m60297
$$ 485057622 481635958 479241461 478201777 477509409 476995051 477622956 478884250 479354233 478893936
418.1D78893936o34820r36746j964003k164334j198620j075446j986176j720756n7340
$$ 478893936 478259116 477322370 475358367 473194033 471995413 470919967 468933791 467213035 467155695
436.5D67155695O00129K92302J020073K016396J372605m4107l94344P6234k33621j638859
$$ 467155695 467755824 468048126 469068199 471084595 472457200 472413093 472018749 472094983 471861362 470222503
456.9D70222503k378374j665980j645595k554774k507895j602978j645028k395869
$$ 470222503 467844129 466178149 464532554 461977780 459469885 457866907 456221879 453826010
473.2D53826010j791328n62519p30425j317352p79122j82986p99179j513273j089692
$$ 453826010 452034682 451472163 450741738 449424386 448645264 448462278 447663099 446149826 445060134
491.5D45060134o67423j449049k349227k195269j794517k233207k757848k388596j902253
$$ 445060134 444392711 442943662 440594435 438399166 436604649 434371442 431613594 429224998 427322745
509.9D27322745k346784k846390k400815j901090k103299j947433p64280Q9526j59025
$$ 427322745 424975961 422129571 419728756 417827666 415724367 413776934 413012654 413102180 412943155
528.3D12943155j10537Q48293J871437K237201K162963K443492K413780J158446q0109
$$ 412943155 412832618 413680911 415552348 417789549 419952512 422396004 424809784 425968230 425888121
546.6D25888121l51429m88162j052737j483709j342565j205623j623153k152950k159923
$$ 425888121 425536692 425048530 423995793 422512084 421169519 419963896 418340743 416187793 414027870
565D14027870j975179k020687j722604n73516O31303J107484J592785K522439L093153
$$ 414027870 412052691 410032004 408309400 407735884 408367187 409474671 411067456 413589895 416683048
583.3D16683048K805740K123743J707256J386434O89387J40518K20209L27617J9282
$$ 416683048 419488788 421612531 423319787 424706221 425395608 425536126 425756335 426083952 426103234
601.7D26103234k48760N037M21792M09186K00421M29392R06199J023173J096010J801789
$$ 426103234 425854474 425859511 426281303 426690489 426890910 427320302 428226501 429249674 430345684 432147473
622.1D32147473K614737K633065K323448K461523K599061K092838J486599J583219
$$ 432147473 434762210 437395275 439718723 442180246 444779307 446872145 448358744 449941963
638.4D49941963J878560J522272J009763J097381J324683Q50350J88857K65300N83947
$$ 449941963 451820523 453342795 454352558 455449939 456774622 457624972 457813829 458079129 458663076
656.7D58663076M05282O974J18762Q56191J698047J324087M54277J111388J616895
$$ 458663076 459068358 459075332 459194094 460050285 461748332 463072419 463526696 464638084 466254979
675.1D66254979J346589J394033J804978J503259O95616M65303O39439K66373n80132
$$ 466254979 467601568 468995601 470800579 472303838 472999454 473464757 474104196 474370569 473790437
693.5D73790437q91447o29038n52684l94910N35160J652271K002507J878977K266109
$$ 473790437 472898990 472269952 471717268 471322358 471857518 473509789 475512296 477391273 479657382
711.8D79657382L141910L515571L384471L744513M541039M652023M068375L843844
$$ 479657382 482799292 486314863 489699334 493443847 497984886 502636909 506705284 510549128
728.1E10549128M050016L573418K441108J953602K085090J619995N61952J65403M96984
$$ 510549128 514599144 518172562 520613670 522567272 524652362 526272357 526834309 526999712 527496696
746.5E27496696L05473n38051p99238m90070q18372j513898j229286r0480O11246R31441
$$ 527496696 527802169 527264118 526464880 525974810 525156438 523642540 522413254 522322774 522934020 523865461
766.9E23865461K031446L759861M644453M492700M612864N195736M942835L733396
$$ 523865461 525896907 529656768 534301221 538793921 543406785 548602521 553545356 557278752
783.2E57278752L061354L206134K874732J804948J467228K326965K936662K682328
$$ 557278752 560340106 563546240 566420972 568225920 569693148 572020113 574956775 577639103
799.5E77639103K713621L359794L313780K303183J693666J864970J587808N79059K7418
$$ 577639103 580352724 583712518 587026298 589329481 591023147 592888117 594475925 595054984 595082402
817.9E95082402K11597j52707j379609k054930j753092j762509k436757k545715j971423
$$ 595082402 595293999 595141292 593761683 591706753 589953661 588191152 585754395 583208680 581237257
836.2E81237257j932860k512693k534509j781106j383901j685142j669526r86278o62685
$$ 581237257 579304397 576791704 574257195 572476089 571092188 569407046 567737520 566751242 566088557
854.6E66088557j074731q81076Q98123L134608M405439N086958N815208N799055M665435
$$ 566088557 565013826 564132750 565030873 568165481 572570920 577657878 583473086 589272141 593937576
872.9E93937576L460944K530336Q66592j646221l491163m062057m508674n325258n536615
$$ 593937576 597398520 599928856 600795448 599149227 595658064 591596007 587087333 581762075 576225460
891.3E76225460m803777m263759m542947m814863m645824m903615n948901o784976
$$ 576225460 571421683 567157924 562614977 557800114 553154290 548250675 542301774 535516798
907.6E35516798o786525o685912o965876o765962n525112m033923l011018k143413
$$ 535516798 528730273 522044361 515078485 508312523 502787411 498753488 495742470 493599057
923.9D93599057j165837o45041q08567q86321m77284k43813o35624j072168j262933
$$ 493599057 492433220 491788179 490979612 490093291 489616007 489372194 488736570 487664402 486401469
942.3D86401469k232910m558772p063180q568227r315997r953410j0327697j0163694
$$ 486401469 484168559 479609787 472546607 463978380 454662383 444708973 434381276 424217582
958.6D24217582r901017r956241r994864r531945q762032q113086p353038o099343
$$ 424217582 414316565 404360324 394365460 384833515 376071483 367958397 360605359 354506016
974.9C54506016m678697l586650k724528j806885j055181q33899r28640q86351p22498
$$ 354506016 349827319 346240669 343516141 341709256 340654075 339820176 338891536 338005185 337282687
993.3C37282687o84440o29842k60532J98215K64466p2479m49419p42436j131802j505077
$$ 337282687 336598247 335968405 335707873 335906088 336170554 336098075 335648656 334906220 333774418 332269341
1013.7C32269341j544506j366436j362175j551986j623928j576185j670421j863151
$$ 332269341 330724835 329358399 327996224 326444238 324820310 323244125 321573704 319710553
1030C19710553j837790j640022j666576j870245j871347j700103j625836j613647j376003
$$ 319710553 317872763 316232741 314566165 312695920 310824573 309124470 307498634 305884987 304508984
1048.3C04508984q59976l19600J48475O57201J192957J598507J872838K130389K143890
$$ 304508984 303649008 303329408 303477883 304135084 305328041 306926548 308799386 310929775 313073665
1066.7C13073665J345426j75059j303107j218080k47866Q89629J916766K835334L519624
$$ 313073665 314419091 314244032 312940925 311722845 311474979 312364608 314281374 317116708 320636332
1085C20636332L774554L730326L664732L490210L047168K486319J995116J542896J135677
$$ 320636332 324410886 328141212 331805944 335296154 338343322 340829641 342824757 344367653 345503330
1103.4C45503330J012475J319885J804799K147525K339691K497405K560675K368927
$$ 345503330 346515805 347835690 349640489 351788014 354127705 356625110 359185785 361554712
1119.7C61554712K002329J784503J888812K185732K555400K897948K956480K520174
$$ 361554712 363557041 365341544 367230356 369416088 371971488 374869436 377825916 380346090
1136C80346090J684993Q27134J85430l12805o65784p37131n74589l46541p9751L96132
$$ 380346090 382031083 382858217 383043647 382730842 382065058 381327927 380753338 380406797 380327046 380723178
1156.4C80723178J159400J952142K569317L133744L701509M150956M528761N049229
$$ 380723178 381882578 383834720 386404037 389537781 393239290 397390246 401919007 406968236
1172.7D06968236N723745O259888O514221O625981O657689O478638N970895N211115
$$ 406968236 412691981 418951869 425466090 432092071 438749760 445228398 451199293 456410408
1189.1D56410408M341602L320158K073854Q86977J35749k94566o84798q89807o97971
$$ 456410408 460752010 464072168 466146022 467032999 467168748 466874182 466189384 465299577 464601606
1207.4D64601606l31372j74701k10047j87099j76906m05997p68632j010388j213938
$$ 464601606 464270234 464095533 463885486 463698387 463521481 463115484 462346852 461336464 460122526
1225.8D60122526j556129j880317j874120j590430j353205j151293p05242n8174M78983
$$ 460122526 458566397 456686080 454811960 453221530 451868325 450717032 450011790 449953616 450432599
1244.1D50432599R24646J459986J970977K204299K182186K178907K249479K199143
$$ 450432599 451357245 452817231 454788208 456992507 459174693 461353600 463603079 465802222
1260.4D65802222K044142K038508K205581K265870K089233J852095J622677J272767
$$ 465802222 467846364 469884872 472090453 474356323 476445556 478297651 479920328 481193095
1276.8D81193095Q87096P94351R96799J149088J106113J008123R02564N58853o2883
$$ 481193095 482080191 482874542 483871341 485020429 486126542 487134665 488037229 488596082 488533199
1295.1D88533199o63608j058221j396031j747608j932800j885861j731515j541078
$$ 488533199 487869591 486811370 485415339 483667731 481734931 479849070 478117555 476576477
1311.4D76576477j194030o42627j02312J84000K62886J56164l28421j139760j859516
$$ 476576477 475382447 474739820 474637508 474821508 475084394 475240558 474912137 473772377 471912861
1329.8D71912861k159596k134531j957715j629949j168549p71850n72175n22017n52386
$$ 471912861 469753265 467618734 465661019 464031070 462862521 462090671 461518496 460996479 460444093
1348.1D60444093p59423j184106j570403j728803j772881k001852k588421l201902
$$ 460444093 459684670 458500564 456930161 455201358 453428477 451426625 448838204 445636302
1364.5D45636302l410339l324509k884686k441227k560884k959996l297061l625840
$$ 445636302 442225963 438901454 436016768 433575541 431014657 428054661 424757600 421131760
1380.8D21131760l599614k756268j497954n49078n4687J38402J8567j19686k7448K42561
$$ 421131760 417532146 414775878 413277924 412728846 412674159 412812561 412831128 412711442 412683994 412926555
1401.2D12926555O61850J081228J273483J311600J308978J336008J539290J868755
$$ 412926555 413588405 414669633 415943116 417254716 418563694 419899702 421438992 423307747
1417.5D23307747J996457J722247J678794J693338J377553Q63224K49863j63913n24461
$$ 423307747 425304204 427026451 428705245 430398583 431776136 432639360 432889223 432725310 432200849
1435.9D32200849q50618n22256N4479L45796N00948N77837M14848K38657N99742J792103
$$ 432200849 431350231 430827975 430882454 431228250 431729198 432307035 432721883 432960540 433560282 435352385
1456.2D35352385K669036K236575K251506K901972L377079L990502N774885Q362800
$$ 435352385 438021421 440257996 442509502 445411474 448788553 452779055 458553940 466916740
1472.6D66916740Q701533O904006N363196M175067L024072J659154K50936j363099
$$ 466916740 475618273 482522279 487885475 492060542 495084614 496743768 496994704 495631605
1488.9D95631605l043204l759951m227906n241543n678415n293459m819095n736619
$$ 495631605 492588401 488828450 484600544 479359001 473680586 468387127 463568032 457831413
1505.2D57831413q881450r180069p836551p202833n935610m193038k566725k137780
$$ 457831413 448949963 439769894 431933343 424730510 418794900 414601862 412035137 409897357
1521.5D09897357k494484k660990k872497k578914k097130k096623j773387r77606
$$ 409897357 407402873 404741883 401869386 399290472 397193342 395096719 393323332 392345726
1537.8C92345726o79373p95782l72201M29332J428545K465844L236204L809810M298836
$$ 392345726 391666353 390870571 390498370 390927702 392356247 394822091 398058295 401868105 406166941
1556.2D06166941N427241N327106L190994K924532L298759L243625K897144K188205
$$ 406166941 411594182 416921288 420112282 423036814 426335573 429579198 432476342 434664547
1572.5D34664547J995594J798302Q37028L08841J23054j79499n86659r77904j472324
$$ 434664547 436660141 438458443 439295471 439604312 439727366 439547867 438961208 437983304 436510980
1590.9D36510980k057910k719104l300935l858268m605622n378007n993605o651163
$$ 436510980 434453070 431733966 428433031 424574763 419969141 414591134 408597529 401946366
1607.2D01946366p597536q222610q178442q927048j0736704r961873r247482j0571390
$$ 401946366 394348830 386126220 377947778 369020730 358284026 348322153 339074671 328503281
1623.5C28503281j0589868r747922r207636p824868o803900o932945n243301k627343
$$ 328503281 317913413 308165491 298957855 291132987 284329087 277396142 272152841 269525498
1639.8B69525498j047075M2379R92894J587093J633197K278567L262967K909809L071785
$$ 269525498 268478423 268520802 269513696 271100789 272733986 275012553 278275520 281185329 284257114
1658.2B84257114M181236N456001O150364O050051O845325P769942P100493P310957
$$ 284257114 288438350 293894351 300044715 306094766 312940091 320710033 327810526 335121483
1674.5C35121483P978886P497728P377028Q668155J0878294R900302Q806348J0016173
$$ 335121483 343100369 350598097 357975125 366643280 377521574 387421876 396228224 406244397
1690.8D06244397J0789335J3178825J5308887J5193820J6183436J3105094J0795147
$$ 406244397 417033732 430212557 445521444 460715264 476898700 490003794 500798941
1705.1E00798941J0747194R186566P828951P162094O909132O765246N304992L785611
$$ 500798941 511546135 520732701 528561652 535723746 542632878 549398124 554703116 558488727
1721.4E58488727L547430L495872L031552K756655K632975K607167J968682J491368
$$ 558488727 562036157 565532029 568563581 571320236 573953211 576560378 578529060 580020428
1737.7E80020428K058625K658129L030717L758788M825533N941450O373108O003975
$$ 580020428 582079053 584737182 587767899 591526687 596352220 602293670 608666778 614670753
1754F14670753O296039O659925O319881O236076N782008N385578N405307N212843N088985
$$ 614670753 620966792 627626717 633946598 640182674 645964682 651350260 656755567 661968410 667057395
1772.4F67057395M388034L394306L179252L317833L166914K791166K480805K476096
$$ 667057395 671445429 674839735 678018987 681336820 684503734 687294900 689775705 692251801
1788.7F92251801K726138K597749J916826J794756K106607K053678J703322J651763
$$ 692251801 694977939 697575688 699492514 701287270 703393877 705447555 707150877 708802640
1805G08802640J856924J816690J555860J451313J583755J540780J359582J450420J715123
$$ 708802640 710659564 712476254 714032114 715483427 717067182 718607962 719967544 721417964 723133087
1823.4G23133087J639247J292765J254559J235246J012803Q97526J019478J225352
$$ 723133087 724772334 726065099 727319658 728554904 729567707 730465233 731484711 732710063
1839.7G32710063J290083J135767Q54790P56204P40350O42538P20024R47535Q97765
$$ 732710063 734000146 735135913 735990703 736746907 737487257 738129795 738849819 739797354 740695119
1858G40695119O36876O04450Q70109J011967P91491N06937N21660O07073N02646N25177
$$ 740695119 741331995 741936445 742806554 743818521 744610012 745116949 745638609 746245682 746748328 747273505
1878.4G47273505P60436P98821N93961N90205Q24570P89822M90427M05967N68807O19888
$$ 747273505 748033941 748832762 749426723 750016928 750841498 751631320 752121747 752527714 753096521 753716409
1898.8G53716409M61698L83675N41985O02126L83377K54631M14014N72741M81844L11434
$$ 753716409 754178107 754561782 755103767 755705893 756089270 756343901 756757915 757330656 757812500 758123934
1919.2G58123934L53575M16636K24591J17361L03984M16160K59161J38104K89380M28617
$$ 758123934 758477509 758894145 759118736 759236097 759540081 759956241 760215402 760353506 760642886 761071503
1939.6G61071503L13938J02222J12235K48552K13921J48296K70844L99768K85566J55091
$$ 761071503 761385441 761487663 761599898 761848450 762062371 762210667 762481511 762881279 763166845 763321936
1960G63321936K56300L63886K43187R0123J51872K89917K35617Q4758J30475K41041
$$ 763321936 763578236 763942122 764185309 764275432 764427304 764717221 764952838 765037596 765168071 765409112
1980.4G65409112J75774N1022J04665K50280K26438M0353K205J52648J31666l6299
$$ 765409112 765584886 765635908 765740573 765990853 766217291 766257644 766259849 766412497 766544163 766507864
2000.8G66507864l6061Q1659L3617j28568j54793n0723p3433k39194k54392j37389
$$ 766507864 766471803 766553462 766587079 766458511 766303718 766252995 766179562 765940368 765685976 765548587
2021.2G65548587j56522l00586l00527j68621j61767k91288l05772j71065j39952k46406
$$ 765548587 765392065 765091479 764790952 764622331 764460564 764169276 763863504 763692439 763552487 763306081
2041.6G63306081k53439j02162m8220j26600j14918K2948P8797k2411m4048J01149
$$ 763306081 763052642 762950480 762902260 762775660 762660742 762683690 762762487 762740076 762696028 762797177
2062G62797177J69933O7115K4318J18911J59920N9962K921Q6963J39594N0723L100
$$ 762797177 762967110 763034225 763058543 763177454 763337374 763397336 763400257 763487220 763626814 763677537 763680637
2084.4G63680637J27196K32279J68026O0081J07050J98603J54317R6201J61410K29239
$$ 763680637 763807833 764040112 764208138 764268219 764375269 764573872 764728189 764824390 764985800 765215039
2104.8G65215039J59741P2360J27673K26438J55091M4823J01209J79648J12772J6570
$$ 765215039 765374780 765447140 765574813 765801251 765956342 766001165 766102374 766282022 766394794 766411364
2125.2G66411364O5446J62899J26303N2809J21355K02835J35839M2677J06037K29656
$$ 766411364 766476810 766639709 766766012 766818821 766940176 767143011 767278850 767321527 767427564 767657220
2145.6G67657220J93954Q9466J33634K38955K10404J54913K20954L03150K86221K56300
$$ 767657220 767851174 767940640 768074274 768313229 768523633 768678546 768899500 769202650 769488871 769745171
2166G69745171L36230M65572M71174L87788M02570M68254M35710L59416L85285M70101
$$ 769745171 770081401 770546973 771018147 771405935 771808505 772276759 772712469 773071885 773457170 773927271
2186.4G73927271M44949L33071L23951M20332M04835L07321L34144M18305L96014L17394
$$ 773927271 774372220 774705291 775029242 775449574 775854409 776161730 776495874 776914179 777310193 777627587
2206.8G77627587L22283L88324L83139L21090L18408L61204L50833K72274K22504K49267
$$ 777627587 777949870 778338194 778721333 779042423 779360831 779722035 780072868 780345142 780567646 780816913
2227.2G80816913K58088J85728J45078K13325K53975K07961J73151J88828J90734J45019
$$ 780816913 781075001 781260729 781405807 781619132 781873107 782081068 782254219 782443047 782633781 782778800
2247.6G82778800J29699J78337K03610J49786J09554J52826J93119J64211J29640J36077
$$ 782778800 782908499 783086836 783290446 783440232 783549786 783702612 783895731 784059942 784189582 784325659
2268G84325659J48893J07646L6299K9564N1260K4915Q821Q0466J41084J15753R3698
$$ 784325659 784474552 784582198 784618497 784648061 784699321 784724236 784733057 784813523 784954607 785070360 785164058
2290.4G85164058J07110J30176J45018J51098J40071J55032K52425L48509L76046L69012
$$ 785164058 785271168 785401344 785546362 785697460 785837531 785992563 786244988 786593497 786969543 787338555
2310.8G87338555L05652K52188L76880N79595O39260M95017L05950K86580L81529L09825
$$ 787338555 787644207 787896395 788273275 788852870 789492130 789987147 790293097 790579677 790961206 791271031
2331.2G91271031K1756j12415m709L3319j42157n86092j282454j378715m89473P46489
$$ 791271031 791292787 791180372 791175663 791208982 791066825 790480733 789198279 787819564 787330091 788076580
2351.6G88076580J574337J538098R45091J39535m48466p98583j185059j537443j707017
$$ 788076580 789650917 791189015 792134106 792273641 791825175 791026592 789841533 788304090 786597073
2370G86597073j764178j689971j500666j398742j340985j163125q93653o52134n02765
$$ 786597073 784832895 783142924 781642258 780243516 778902531 777739406 776845753 776193619 775690854
2388.3G75690854m34339l92914l72768l95655m17114l99649l96251m56572n22971n33283
$$ 775690854 775256515 774863601 774490833 774095178 773678064 773278415 772882164 772425592 771902621 771369338
2408.7G71369338n12600n26607n73516n97775n78344n82933o53863o91295o49690o34611
$$ 771369338 770856738 770330131 769756615 769158840 768580496 767997563 767343700 766652405 766002715 765368104
2429.1G65368104o93083p22408o84023o71268p21156p38025o85990o87837p42317p37249
$$ 765368104 764675021 763952613 763268590 762597322 761876166 761138141 760452151 759764314 759021997 758284748
2449.5G58284748o99699o91653o97910o94752o86169p01606p29144p10964o72698o81460
$$ 758284748 757585049 756893396 756195486 755500734 754814565 754112959 753383815 752672851 752000153 751318693
2469.9G51318693o94513o56605o40154o91712p29084o89566o40035o66618o95586o47605
$$ 751318693 750624180 749967575 749327421 748635709 747906625 747217059 746577024 745910406 745214820 744567215
2490.3G44567215o19649o48857o49809o18816n85317n75185o00934o15061n91397n61178
$$ 744567215 743947566 743298709 742648900 742030084 741444767 740869582 740268648 739653587 739062190 738501012
2510.7G38501012n54800n55575n71370o09636o37889o50227o42657o34015o70552p04050
$$ 738501012 737946212 737390637 736819267 736209631 735571742 734921515 734278858 733644843 732974291 732270241
2531.1G32270241o89030p02381p34627p23183p15614p31826p33435p03335o92784p16508
$$ 732270241 731581211 730878830 730144203 729421020 728705406 727973580 727240145 726536810 725844026 725127518
2551.5G25127518o99043o58572o63221p26998p72774p01666o28173o73711p20144o72578
$$ 725127518 724428475 723769903 723106682 722379684 721606910 720905244 720277071 719603360 718883216 718210638
2571.9G18210638o26028o56664p05123o95944o62565o84321p07865o85334o72996o85394
$$ 718210638 717584610 716927946 716222823 715526879 714864314 714179993 713472128 712786794 712113798 711428404
2592.3G11428404o93023o63936o39380o83903p37727p33971p40707q19445r07600r11236
$$ 711428404 710735381 710071445 709432065 708748162 708010435 707276464 706535757 705716312 704808712 703897476
2612.7G03897476q76665r24110j008392j041710j051247j092077j134812j115919j107156
$$ 703897476 703020811 702096701 701088309 700046599 698995352 697903275 696768463 695652544 694545388
2631F94545388j177490j224935j184523j140773j168311j212477j177550j119196j133204
$$ 694545388 693367898 692142963 690958440 689817667 688649356 687436879 686259329 685140133 684006929
2649.4F84006929j197993j222074j172424j153230j195968j176238j100838j105130
$$ 684006929 682808936 681586862 680414438 679261208 678065240 676889002 675788164 674683034
2665.7F74683034j145243j117230j063525j056016j073539j037896r88662r96947j033724
$$ 674683034 673537791 672420561 671357036 670301020 669227481 668189585 667200923 666203976 665170252
2684.1F65170252j049697j016677r82046j008749j046240j047850j052737j090705
$$ 665170252 664120555 663103878 662121832 661113083 660066843 659018993 657966256 656875551
2700.4F56875551j140714j150131j173258j246929j254559j198649j206100j255453
$$ 656875551 655734837 654584706 653411448 652164519 650909960 649711311 648505211 647249758
2716.7F47249758j241088j200080j201033j195073j135350j060664j042962j083494
$$ 647249758 646008670 644808590 643607557 642412484 641277134 640216470 639173508 638090014
2733F38090014j075029r96351r84788j027882r94027r44972r64165r97364r90272r55939
$$ 638090014 637014985 636018634 635033846 634005964 633011937 632066965 631102800 630105436 629115164 628159225
2753.4F28159225r53794r75966r69172r55522r59217r76265j002371j007557j018822
$$ 628159225 627205431 626229465 625260293 624304771 623345554 622369289 621366918 620359361 619340539
2771.8F19340539j074374j119613j142562j195609j248837j273811j323104j389682
$$ 619340539 618266165 617146552 616003990 614808381 613559544 612285733 610962629 609572947
2788.1F09572947j416445j431823j487135j530469j544058j591742j669407j750112
$$ 609572947 608156502 606724679 605237544 603707075 602163017 600571275 598901868 597151756
2804.4E97151756j816690j845419j850545j878322j939237k012789k065122k110303
$$ 597151756 595335066 593489647 591639102 589760780 587821543 585808754 583743632 581633329
2820.7E81633329k233684k361953k406537k481938k621055k757310k933562l231108
$$ 581633329 579399645 577037692 574631155 572149217 569528162 566770852 563837290 560606182
2837E60606182l658355m189789m814506n511820o099403o220340n659938m521668l186822
$$ 560606182 556947827 552758038 547943532 542431712 536332309 530111969 524452031 519930363 516743541
2855.4E16743541k153695j748621j974881k571583l255248l793001l959775l693610
$$ 516743541 514589846 512841225 510866344 508294761 505039513 501246512 497286737 493593127
2871.7D93593127l107161k404064j773029j315952j083791j034677j104653j224607
$$ 493593127 490485966 488081902 486308873 484992921 483909130 482874453 481769800 480545193
2888D80545193j341134j489610j662165j847028k067030k279848k476066k718747l065765
$$ 480545193 479204059 477714449 476052284 474205256 472138226 469858378 467382312 464663565 461597800
2906.4D61597800l496259l947497m436701m932583n235284n164862m697650l920168
$$ 461597800 458101541 454154044 449717343 444784760 439549476 434384614 429686964 425766796
2922.7D25766796k910644j755089o35176L71903J373946K393783L300935L949642M243165
$$ 425766796 422856152 421101063 420465887 420837790 422211736 424605519 427906454 431856096 436099261
2941D36099261M150301L706962L022373K290726J651823J145989R15289J108467J649291
$$ 436099261 440249562 443956524 446978897 449269623 450921446 452067435 452982724 454091191 455740482
2959.4D55740482K344250L062755L738284M325122M793763N096644N221665N198807
$$ 455740482 458084732 461147487 464885771 469210893 474004656 479101300 484322965 489521772
2975.7D89521772N064189M849881M539371M170775L735542L177405K655506K234816
$$ 489521772 494585961 499435842 503975213 508145988 511881530 515058935 517714441 519949257
2992E19949257J743615J148939N53012M5121l79086p83443j085162j203061j213312
$$ 519949257 521692872 522841811 523394823 523439944 523060858 522277415 521192253 519989192 518775880
3010.4E18775880j174926j114905j105309j192331j374126j623213j839638j959622
$$ 518775880 517600954 516486049 515380740 514188409 512814283 511191070 509351432 507391810
3026.7E07391810k034843k052962k005339k004266k089441k193659k258450k283722
$$ 507391810 505356967 503304005 501298666 499294400 497204959 495011300 492752850 490469128
3043D90469128k342433k437025k452761k394170k374440k404630k405942k349138k272367
$$ 490469128 488126695 485689670 483236909 480842739 478468299 476063669 473657727 471308589 469036222
3061.4D69036222k179266k030670j862377j781434j759559j680821j565069j490116
$$ 469036222 466856956 464826286 462963909 461182475 459422916 457742095 456177026 454686910
3077.7D54686910j457870j429737j381039j325876j277238j200259j140862j147390
$$ 454686910 453229040 451799303 450418264 449092388 447815150 446614891 445474029 444326639
3094D44326639j167029j163274j170725j242101j313805j312882j291514j344561j424343
$$ 444326639 443159610 441996336 440825611 439583510 438269705 436956823 435665309 434320748 432896405
3112.4D32896405j424253j435518j536161j656472j717925j704455j725107j807451
$$ 432896405 431472152 430036634 428500473 426844001 425126076 423421621 421696514 419889063
3128.7D19889063j819164j791835j830518j870006j873702j922071k004594k020806
$$ 419889063 418069899 416278064 414447546 412577540 410703838 408781767 406777173 404756367
3145D04756367j984209j967340j971871k012610k087444k106965k072930k078236k105325
$$ 404756367 402772158 400804818 398832947 396820337 394732893 392625928 390552998 388474762 386369437
3163.4C86369437k090126k067507k070456k091080k098859k078294k089560k092779
$$ 386369437 384279311 382211804 380141348 378050268 375951409 373873115 371783555 369690776
3179.7C69690776k069324k073437k043456j988679j976192j979351j968354j944215
$$ 369690776 367621452 365548015 363504559 361515880 359539688 357560337 355591983 353647768
3196C53647768j928001j914024j871974j832187j793951j748234j729578j726418j699955
$$ 353647768 351719767 349805743 347933769 346101582 344307631 342559397 340829819 339103401 337403446
3214.3C37403446j652330j642406j679748j677841j655430j698583j729608j697152
$$ 337403446 335751116 334108710 332428962 330751121 329095691 327397108 325667500 323970348
3230.7C23970348j685948j764863j867742j902878j926213j956076j960546j987785
$$ 323970348 322284400 320519537 318651795 316748917 314822704 312866628 310906082 308918297
3247C08918297k067804k122641k104610k081901k117842k179533k171934k089798k018899
$$ 308918297 306850493 304727852 302623242 300541341 298423499 296243966 294072032 291982234 289963335
3265.3B89963335j966804j847387j691401j604020j561940j484126j345873j210958
$$ 289963335 287996531 286149144 284457743 282853723 281291783 279807657 278461784 277250826
3281.6B77250826j127898j020193q74550p63535o77347o15746n65827m88162m36693
$$ 277250826 276122928 275102735 274228185 273464650 272787303 272171557 271605730 271117568 270680875
3300B70680875m19587l62069l17722l40730l52741l48418l42072l02255k63482k47955
$$ 270680875 270261288 269899219 269581497 269240767 268888026 268539608 268197536 267895281 267631799 267383844
3320.4B67383844k60175l13013l92080m44829m35442m35322m53562m26799m28528n24133
$$ 267383844 267123669 266810656 266418576 265973747 265538305 265102983 264649421 264222622 263794094 263269961
3340.8B63269961o28919o72489o53326o29634o80983p69913q13246q01146p81417p79420
$$ 263269961 262641042 261968553 261315227 260685593 260004610 259234697 258421451 257620305 256838888 256059468
3361.2B56059468p70182p37100p37042q02070q68260q47817p50333o66544o23792o35162
$$ 256059468 255289286 254552186 253815144 253013074 252144814 251296997 250546664 249880120 249256328 248621166
3381.6B48621166o28680n39348l94970k95713l88325n49897n09799k85297j39878k43127
$$ 248621166 247992486 247453138 247058168 246762455 246374130 245824233 245314434 245029137 244889259 244646132
3402B44646132m30107l88846k14234j31950r2402p1049q3431m0218O7979J51217K36362
$$ 244646132 244216025 243827179 243612945 243480995 243388593 243317544 243234113 243193895 243261874 243413091 243649453
3424.4B43649453L80337M96566M87403N29915O63638O55368N54561N74530P00593Q30978
$$ 243649453 244029790 244526356 245013759 245543674 246207312 246862680 247417241 247991771 248692364 249523342
3444.8B49523342R27001R36597R59367J049221J145064J235158J297861J282394J287341
$$ 249523342 250450343 251386940 252346307 253395528 254540592 255775750 257073611 258356005 259643346
3463.2B59643346J457512J601965J453995J185954J196146J447976J707285J782716
$$ 259643346 261100858 262702823 264156818 265342772 266538918 267986894 269694179 271476895
3479.5B71476895J653492J604796J686364J699954J683057J730799J794845J863599
$$ 271476895 273130387 274735183 276421547 278121501 279804558 281535357 283330202 285193801
3495.8B85193801J865178J867175J919330J847147J729399J800389J972079K104610
$$ 285193801 287058979 288926154 290845484 292692631 294422030 296222419 298194498 300299108
3512.1C00299108K134264K030968K008051K143502K273530K226114K107114K142906
$$ 300299108 302433372 304464340 306472391 308615893 310889423 313115537 315222651 317365557
3528.4C17365557K260745K359420K494812K538561K441407K501934K706886K806723
$$ 317365557 319626302 321985722 324480534 327019095 329460502 331962436 334669322 337476045
3544.7C37476045K676904K544552K648950K797842K805799K846778L037393L178417
$$ 337476045 340152949 342697501 345346451 348144293 350950092 353796870 356834263 360012680
3561.1C60012680L151894L217697L547788L591507L312439L299415L562153L761947
$$ 360012680 363164574 366382271 369930059 373521566 376834005 380133420 383695573 387457520
3577.4C87457520L844231L926724L995359M088432M201591M118889L933192M107624
$$ 387457520 391301751 395228475 399223834 403312266 407513857 411632746 415565938 419673562
3593.7D19673562M434615M481972M387766M367828M349202M328996M522294M670411
$$ 419673562 424108177 428590149 432977915 437345743 441694945 446023941 450546235 455216646
3610D55216646M637093M629939M520536M639923M939199M624545M193783M254401M934639
$$ 455216646 459853739 464483678 469004214 473644137 478583336 483207881 487401664 491656065 496590704
3628.4D96590704N157560M326224M092872M267216M239082M279733M373968M349112
$$ 496590704 501748264 506074488 510167360 514434576 518673658 522953391 527327359 531676471
3644.7E31676471M419863M752815M573763L696680L436029L935039L962099L545106
$$ 531676471 536096334 540849149 545422912 549119592 552555621 556490660 560452759 563997865
3661E63997865L381490L437162L503024L671468L674209L127098K968669K943158K466500
$$ 563997865 567379355 570816517 574319541 577991009 581665218 584792316 587760985 590704143 593170643
3679.4E93170643K355754K629042K851367K996147K831339K233029J868069J856744
$$ 593170643 595526397 598155439 601006806 604002953 606834292 609067321 610935390 612792134
3695.7F12792134J934469K013207J989007J765131J628340J749515J747668J480877
$$ 612792134 614726603 616739810 618728817 620493948 622122288 623871803 625619471 627100348
3712F27100348J289726J249790J333177J459301J448214J241803J099467J197398J363039
$$ 627100348 628390074 629639864 630973041 632432342 633880556 635122359 636221826 637419224 638782263
3730.3F38782263J528680J442075J008689P07150P03096Q20756J144707J287043R74775
$$ 638782263 640310943 641753018 642761707 643468857 644171953 644992709 646137416 647424459 648399234
3748.7F48399234P42733O12676O31571P91848Q33631P43031P15375Q11398Q32736P41900
$$ 648399234 649141967 649754643 650386214 651178062 652011693 652754724 653470099 654281497 655114233 655856133
3769.1F55856133O90400O71983P36356Q58545Q75771P42674N96702N35190N38290O40452
$$ 655856133 656546533 657218516 657954872 658813417 659689188 660431862 661028564 661563754 662102044 662742496
3789.5F62742496P30991P02798P41303Q52466Q37624P90000N88179L43620L61979M39287
$$ 662742496 663473487 664176285 664917588 665770054 666607678 667397678 667985857 668329477 668691456 669130743
3809.9F69130743N78463P35402Q21769P50124N12362M02093K84850K53678L70025M58122
$$ 669130743 669709206 670444608 671266377 672016501 672528863 672930956 673215806 673469484 673839509 674297631
3830.3F74297631O39081Q07106O81579M19379K40504J44840J91986L63946N96166O43372
$$ 674297631 674936712 675743818 676425397 676844776 677085280 677230120 677422106 677786052 678382218 679025590
3850.7F79025590M33743K92480J81973J64032L59893M74572M10855K94090K73644L54648
$$ 679025590 679459333 679751813 679933786 680097818 680457711 680932283 681343138 681637228 681910872 682265520
3871.1F82265520K46942J81198K86401L84867L98338K36451J83583K33531K01702K32935
$$ 682265520 682512462 682693660 682980061 683364928 683763266 683999717 684183300 684416831 684618533 684851468
3891.5F84851468K29656K12491L39031M19617K68578M6850o3360q4818K265J58668
$$ 684851468 685081124 685293615 685632646 686052263 686320841 686367691 686304331 686219513 686221778 686380446
3911.9F86380446K79188L43859K78354J39058N9366Q9228J49608J42216J74761K28048
$$ 686380446 686659634 687003493 687281847 687420905 687480271 687569499 687719107 687861323 688036084 688264132
3932.3F88264132J64628O6518P9573J55806J81735J54435J44363J27136P4685J21951
$$ 688264132 688428760 688495278 688574851 688730657 688912392 689066827 689211190 689338326 689413011 689534962
3952.7F89534962K27750K10285J23024R5248R8586P9453Q9586J34587J36316J15275
$$ 689534962 689762712 689972997 690096021 690191269 690289855 690369308 690458894 690593481 690729797 690845072
3973.1F90845072J12772P5221N5194J58668K39193J50740O0141R2507J45197J70588
$$ 690845072 690957844 691033065 691088259 691246927 691486120 691636860 691697001 691789508 691934705 692105293
3993.4F92105293K03610K10941
$$ 692105293 692308903 692519844
3997.5F92519844
$$ 692519844
##END=$$ End of the data block
