##TITLE=G18-52-CE $$ Begin of the data block
##JCAMP-DX=5.00 $$ ACD/SpecManager v 10.08
##SPECTROMETER/DATA SYSTEM=Alpha
##DATE=21 Oct 2013 11:04:12
##DATA TYPE=INFRARED SPECTRUM
##DATA CLASS=XYDATA
##ORIGIN=
##OWNER=
##NPOINTS=1765
##FIRSTX=399.75695801
##LASTX=3997.56933594
##MAXX=3997.56933594
##MINX=399.75695801
##MAXY=0.79349208
##MINY=0.24118836
##XFACTOR=1.0000000000
##YFACTOR=1.000000000000000e-9
##FIRSTY=0.48309815
##DELTAX=2.03957629
##XUNITS=1/CM
##YUNITS=ARBITRARY UNITS
##XYDATA=(X++(Y..Y))
399.8 483098149 479290336 476996273 476445287 476072639 475730628 476292163 477296799 477707356 477225572
418.1 477225572 476452470 475388795 473155588 470668256 469560027 468979836 467358053 465507954 465113610
436.5 465113610 465972155 466973454 468231082 470048279 471198320 470893919 470472157 470723450 470347375
454.8 470347375 468595862 466643453 465322167 463520497 460742325 458427310 457084358 455236912
471.1 455236912 452525914 450630873 449999928 449241668 447969705 447164893 446931779 446290344 444955230
489.5 444955230 443695515 442726970 441184103 438974291 437128663 435666829 433538109 430712909 428126425
507.9 428126425 425995916 423568338 420800894 418474823 416614711 414704502 412946135 412117451 412131339
526.2 412131339 412013859 411945820 412877738 414665997 416647792 418843836 421400249 423608750 424592823
544.6 424592823 424612433 424372435 423862040 422798455 421368212 420069039 418818235 417077035 415003866
562.9 415003866 413167983 411341786 409176052 407346606 406755418 407401264 408675134 410416991 412863582
581.3 412863582 415765792 418438822 420638233 422576636 424116522 424809158 424838364 424969077 425393641
599.6 425393641 425584316 425384521 425395250 425901294 426330686 426440954 426846236 427772671 428794712 430006951
620 430006951 431996644 434661925 437278122 439643055 442091465 444585472 446619332 448123485 449696541
638.4 449696541 451576829 453141659 454131305 455180794 456484377 457388490 457696944 458044082 458681405
656.7 458681405 459090769 459082693 459284395 460206658 461767852 462908357 463420153 464676499 466451675
675.1 466451675 467899799 469259828 470947176 472385943 473134965 473740131 474483162 474715501 474047005
693.5 474047005 473121107 472541004 472089976 471795976 472413927 474067628 475959152 477731407 480026096
711.8 480026096 483246744 486730605 490067959 493838131 498397440 503071010 507209539 511072993
728.1 511072993 515051782 518595695 521040559 522971869 525043964 526659369 527267277 527536333 528068304
746.5 528068304 528296411 527655602 526772439 526267648 525521100 524006128 522639990 522483766 523155570
764.8 523155570 524109781 526137352 529932499 534580767 539041460 543701649 548988938 553933084 557588160
783.2 557588160 560572863 563771009 566683292 568519175 570034504 572391152 575271368 577884436
799.5 577884436 580657363 584188879 587574244 589766979 591347277 593187511 594743669 595278978 595302582
817.9 595302582 595491469 595328867 594015002 592028022 590277195 588435709 585918427 583335400 581323385
836.2 581323385 579351902 576769054 574158549 572399378 571034491 569282293 567595065 566661894 566002905
854.6 566002905 564897954 564056993 564992309 568075538 572478592 577678263 583572388 589305341 593845487
872.9 593845487 597241163 599710763 600479424 598766625 595231652 591110706 586544514 581185818 575662076
891.3 575662076 570904195 566653132 562086403 557267606 552624762 547685862 541670442 534849763
907.6 534849763 528064847 521385372 514429629 507657588 502138734 498158067 495198876 493056953
923.9 493056953 491851091 491193414 490445793 489622623 489142895 488847792 488159686 487094820 485871226
942.3 485871226 483645886 479071587 471980602 463387698 454067647 444125175 433811754 423680574
958.6 423680574 413829774 403883249 393871397 384369373 375650078 367554188 360234350 354197472
974.9 354197472 349580228 346024841 343325257 341541201 340479732 339647382 338733584 337850302 337134451
993.3 337134451 336458355 335824132 335556626 335745722 335991710 335920334 335502893 334769607 333591998 332043082
1013.7 332043082 330534041 329246849 327920228 326388776 324789584 323204190 321532279 319714159
1030 319714159 317907333 316232890 314531952 312665641 310790271 309087187 307486027 305893749 304505944
1048.3 304505944 303618580 303309768 303518921 304199427 305354565 306926906 308818161 310993969 313153476
1066.7 313153476 314480156 314312220 313031852 311808109 311544389 312430888 314379483 317265272 320760399
1085 320760399 324452728 328145444 331814975 335318983 338391155 340909243 342935413 344497174 345653206
1103.4 345653206 346707463 348080695 349925220 352057606 354355842 356837720 359392911 361765712
1119.7 361765712 363777757 365552217 367414594 369574070 372115195 375009984 377968997 380504817
1136 380504817 382227689 383096069 383301914 383010507 382368833 381636292 381059170 380698770 380607009 381028950
1156.4 381028950 382229716 384211332 386793375 389924645 393620938 397739440 402199358 407199800
1172.7 407199800 412925959 419200361 425678879 432241112 438880533 445367247 451313585 456483364
1189.1 456483364 460799664 464090079 466138065 467032373 467170179 466852516 466151536 465258807 464558005
1207.4 464558005 464221358 464051068 463855028 463675708 463494837 463084161 462332904 461347520 460129052
1225.8 460129052 458566040 456715673 454875857 453291267 451950341 450849980 450202525 450182319 450704604
1244.1 450704604 451667160 453130931 455084205 457260579 459430397 461610824 463849217 466035008
1260.4 466035008 468072742 470126301 472365022 474645197 476736069 478602618 480225742 481488764
1276.8 481488764 482391417 483199239 484190345 485320985 486405581 487425596 488371104 488959223 488900334
1295.1 488900334 488232136 487164348 485761613 484005779 482062250 480182409 478458852 476906449
1311.4 476906449 475713700 475097299 474999368 475169748 475438833 475623965 475309372 474139750 472266287
1329.8 472266287 470139503 468017966 466022521 464344084 463152736 462389618 461832285 461314738 460753441
1348.1 460753441 459965557 458763033 457213610 455522209 453745782 451668262 449022681 445867449
1364.5 445867449 442500234 439160764 436240792 433731794 431132197 428210646 424961716 421375424
1380.8 421375424 417793840 414991230 413446158 412938029 412911206 412961483 412870198 412732244 412779480 413141578
1401.2 413141578 413865238 414967448 416293949 417662621 419004053 420331687 421791583 423529029
1417.5 423529029 425501287 427325338 429065913 430769652 432120919 432953298 433228552 433040947 432404280
1435.9 432404280 431549937 431119680 431232125 431606919 432079881 432593942 432990372 433202028 433650970 435212404
1456.2 435212404 437907577 440363437 442682445 445566595 449011266 453006417 458574772 466688186
1472.6 466688186 475357234 482386261 487880260 492110640 495075554 496551573 496545345 494997114 491996437
1490.9 491996437 488343388 484056860 478731781 473170251 468024522 463089764 456908971 447776020
1507.2 447776020 438921541 431439757 424361199 418366849 414102823 411481768 409316123 406936258
1523.6 406936258 404434234 401723504 399270028 397173673 395076007 393344045 392236739 391330361
1539.9 391330361 390605390 390522659 391242653 392833501 395321310 398515463 402221739 406268477 411385566
1558.2 411385566 416901976 420489103 423576713 426859170 430005133 432901084 435128480 436993122
1574.5 436993122 438690096 439667761 440099984 440216601 439976424 439323485 438282490 436743915 434613585
1592.9 434613585 431837440 428504884 424623728 419974208 414525926 408492297 401840866 394237757
1609.2 394237757 386002153 377754092 368655771 357843399 347955763 338681996 328019232 317404211
1625.5 317404211 307670891 298542887 290777773 283882618 276866347 271766663 269336313 268398106
1641.8 268398106 268417269 269310802 270909965 272591591 274830669 278207719 281383365 284619480 288873613
1660.2 288873613 294397324 300622791 306639016 313357174 321126521 328335166 335699946 343736708
1676.5 343736708 351290345 358601660 367072582 377902567 388009995 396959037 407018304 417737186
1692.8 417737186 430697352 445778012 460807800 477045208 490408570 501411915 512360692
1707.1 512360692 521723509 529582858 536597371 543236375 549905539 555497050 559602439 563305557
1723.4 563305557 566872358 569906235 572544217 574932992 577367663 579510450 581202865 583319604
1739.7 583319604 586034775 589103460 592832744 597586155 603517890 610043108 616188526 622490942
1756.1 622490942 629120171 635399818 641644776 647515535 652883053 658134997 663186550 668287456
1772.4 668287456 672911763 676507294 679738522 683049440 686225295 689049900 691585898 694017649
1788.7 694017649 696534216 699038267 701131821 703080118 705184340 707223475 709013402 710758865
1805 710758865 712594450 714321554 715880394 717432320 719070494 720614493 721989632 723415315 725016356
1823.4 725016356 726551712 727799356 729049683 730405807 731568098 732511282 733523309 734698772
1839.7 734698772 735819161 736785233 737725675 738688648 739538670 740214109 740953505 741909087 742786467
1858 742786467 743410170 744043469 744888961 745735109 746382475 746976793 747680187 748369753 748880863 749390423
1878.4 749390423 750120878 750906348 751508474 752082646 752842784 753590703 754101098 754565299 755199969 755836248
1898.8 755836248 756270826 756649256 757218182 757827103 758192956 758453071 758867800 759360611 759732962 760035753
1919.2 760035753 760443985 760900199 761175871 761348009 761675060 762081027 762325943 762481153 762797058 763185322
1939.6 763185322 763401508 763497233 763705671 764005840 764201343 764341950 764639437 765049517 765312731 765442491
1960 765442491 765685081 766039848 766282976 766399860 766588986 766882181 767108321 767228961 767399490 767634392
1980.4 767634392 767792642 767844021 767953932 768171966 768315732 768314838 768365920 768564820 768712759 768705547 768705368
2002.8 768705368 768801391 768805623 768632531 768474877 768444479 768363953 768126845 767898619 767755151 767570198
2023.2 767570198 767264724 766978145 766821027 766670167 766397595 766119421 765957892 765792549 765528500 765281200
2043.6 765281200 765184641 765150130 765046597 764946997 764964283 765005291 764960408 764949679 765079856 765217066 765234113
2066.1 765234113 765247285 765394807 765592694 765676320 765705645 765821338 765966237 765999854 765976846 766094208
2086.5 766094208 766331077 766497791 766578794 766721010 766914248 767044544 767157078 767367959 767626166 767775953
2106.9 767775953 767839730 767988384 768232286 768387914 768434286 768536389 768709183 768805087 768827140 768943191
2127.3 768943191 769161344 769307852 769355834 769477606 769693553 769827008 769833624 769907355 770138144 770351291
2147.7 770351291 770465910 770623803 770878851 771104038 771259844 771464407 771775663 772106171 772406697 772762954
2168 772762954 773230195 773700714 774087191 774469852 774907947 775351465 775753379 776155412 776607633 777050018
2188.4 777050018 777413666 777772069 778190732 778575778 778890967 779232502 779634714 780026376 780347168 780648172
2208.8 780648172 781003892 781382918 781737030 782092988 782470465 782808900 783050716 783275247 783586144 783901215
2229.2 783901215 784084260 784207046 784408212 784649432 784853876 785026312 785201907 785391033 785558343 785709679
2249.6 785709679 785892189 786087811 786225796 786307812 786427259 786611557 786786914 786930621 787085593 787253261
2270 787253261 787361741 787395835 787429631 787469983 787475526 787481189 787555039 787661076 787739635 787824869 787942648 788060188
2294.5 788060188 788176835 788336456 788508773 788648546 788821340 789091647 789423645 789753139 790007949 790208340
2314.9 790208340 790534914 791030943 791534662 791911483 792153478 792410135 792774379 793016076 792966127 792882085
2335.3 792882085 792925417 792928576 792759717 792223513 791039586 789767683 789294958 789894700 791227758 792558610
2355.7 792558610 793372512 793492079 793057621 792206585 791013241 789630890 788196027 786734998 785289407
2374 785289407 783928692 782662630 781487644 780452430 779638946 779027164 778536499 778111041 777711272
2392.4 777711272 777319074 776914895 776519537 776145816 775718987 775211394 774689794 774191916 773684919 773121476
2412.8 773121476 772529185 771964431 771407425 770787597 770107687 769448340 768809259 768136084 767441154 766775906
2433.2 766775906 766145527 765479267 764731228 763979375 763291240 762599826 761852920 761099279 760386646 759709954
2453.6 759709954 759027958 758317113 757611454 756921291 756224573 755535066 754854143 754155397 753447950 752769530
2474 752769530 752106249 751419604 750716984 750021279 749347925 748677492 747999609 747359633 746750116 746105075
2494.4 746105075 745439172 744823813 744257212 743674219 743060827 742455125 741859496 741268098 740697503 740139425
2514.8 740139425 739571154 738974333 738330841 737668633 737039328 736409962 735721409 735027313 734378278 733713508
2535.2 733713508 732998371 732277274 731560946 730807900 730033457 729296565 728585541 727856755 727145433 726496994
2555.6 726496994 725853026 725138307 724393129 723711610 723088503 722440243 721745729 721053183 720380247 719694495
2576 719694495 718984067 718296885 717660069 717005312 716292977 715579152 714910030 714248598 713550031 712872982
2596.4 712872982 712246478 711577237 710824490 710046470 709262609 708424926 707516968 706629574 705800116 704912543
2616.8 704912543 703930080 702928483 701887488 700748384 699575484 698440433 697308719 696126521
2633.1 696126521 694917858 693739474 692577541 691394567 690196037 689029634 687890232 686722755
2649.4 686722755 685544193 684386492 683236837 682052910 680836439 679675102 678592086 677494466
2665.7 677494466 676357031 675257623 674222410 673170030 672052860 670961797 669939339 668921113
2682 668921113 667893410 666875601 665868878 664871097 663858831 662832379 661807358 660751402 659634173
2700.4 659634173 658471346 657311857 656140506 654907584 653664708 652442575 651191473 649933875
2716.7 649933875 648724556 647528589 646289706 645057023 643943846 642934144 641900599 640800118
2733 640800118 639709353 638703644 637744844 636757314 635761797 634792507 633807898 632792890 631809592
2751.4 631809592 630888760 629967809 628990948 627989650 627018332 626069963 625085950 624059498 623043120
2769.7 623043120 622031927 620985091 619889796 618731499 617511034 616253674 614965916 613636076
2786 613636076 612254858 610829115 609364927 607878745 606400371 604863882 603207767 601494730 599737942
2804.4 599737942 597922564 596106410 594286859 592392862 590414882 588376045 586292684 584180057
2820.7 584180057 581972122 579626024 577198386 574693203 572048426 569227099 566235840 563028276
2837 563028276 559415698 555207670 550342202 544783771 538645267 532417834 526778817 522250116 518992126
2855.4 518992126 516762495 514999986 513042212 510440230 507103026 503250182 499274045 495581210
2871.7 495581210 492475718 490062505 488250345 486873567 485731155 484639794 483518839 482312590
2888 482312590 480962098 479469210 477839440 476000696 473911077 471625060 469164044 466458559 463386595
2906.4 463386595 459867805 455893219 451430887 446474969 441229582 436085612 431408614 427474618
2922.7 427474618 424519926 422695875 422015369 422402680 423822165 426270187 429604679 433546066 437765121
2941 437765121 441916108 445670485 448760569 451100141 452762872 453889996 454795867 455926895 457609117
2959.4 457609117 459994972 463110507 466889232 471250743 476079166 481214523 486491233 491754174
2975.7 491754174 496895552 501823664 506411910 510572016 514292836 517548740 520317197 522609949
2992 522609949 524387479 525574327 526171684 526269436 525912523 525106490 524006546 522841275 521677375
3010.4 521677375 520500958 519373953 518291056 517104864 515708625 514093220 512265503 510273397
3026.7 510273397 508229673 506225228 504244387 502215862 500103652 497894585 495623440 493336558
3043 493336558 490986109 488532692 486061841 483655721 481269985 478851020 476427555 474048197 471759766
3061.4 471759766 469598293 467561215 465665787 463895559 462159574 460455060 458853722 457354784
3077.7 457354784 455876470 454408467 453027308 451723486 450441867 449190587 447984964 446800292
3094 446800292 445618272 444450229 443284184 442056358 440730870 439370781 438026130 436647028 435210764
3112.4 435210764 433767408 432314068 430778623 429114312 427372277 425646931 423903525 422068566
3128.7 422068566 420213073 418381155 416503966 414581358 412677050 410744548 408720046 406666100
3145 406666100 404652685 402679294 400694281 398629218 396489233 394359022 392270088 390175641 388070971
3163.4 388070971 385979056 383865088 381730586 379619181 377500892 375349790 373212844 371136218
3179.7 371136218 369068027 366957664 364871353 362845570 360828698 358802229 356778443 354771107
3196 354771107 352817297 350911617 349027574 347154528 345292836 343474776 341708869 339978725 338288963
3214.3 338288963 336605638 334872037 333124816 331425548 329738766 328015357 326280713 324545056
3230.7 324545056 322794259 320992500 319094539 317155510 315215617 313235968 311233997 309240490
3247 309240490 307188928 305046171 302884430 300741345 298604935 296458274 294314533 292229086 290202856
3265.3 290202856 288224548 286362708 284631908 282981038 281408697 279930741 278566837 277342945
3281.6 277342945 276242673 275247127 274368882 273595780 272888809 272222906 271607161 271065980 270580500
3300 270580500 270134956 269755036 269382864 268962532 268573940 268252194 267952949 267640173 267281234 266916513
3320.4 266916513 266595900 266266137 265852809 265369892 264900148 264463246 264004081 263486207 262920707 262322485
3340.8 262322485 261688650 261025697 260342687 259626359 258865803 258073211 257253736 256424040 255601615 254781961
3361.2 254781961 253968567 253169328 252372295 251564831 250710100 249801651 248958409 248253524 247609064 246932715
3381.6 246932715 246262401 245706275 245308474 244999304 244604930 244052902 243508562 243165538 242982820 242725238
3402 242725238 242310524 241928086 241681412 241524860 241415486 241315737 241225690 241188362 241208240 241293982 241540655
3424.4 241540655 241966799 242496565 243047968 243653819 244355589 244985774 245448351 245924145 246591598 247430995
3444.8 247430995 248345226 249300629 250321090 251373142 252487779 253729999 255034864 256302774 257582963
3463.2 257582963 259041429 260664165 262185842 263466477 264723301 266159832 267816573 269551545
3479.5 269551545 271179020 272782803 274500996 276269734 278003395 279764920 281611830 283529222
3495.8 283529222 285419226 287273735 289180845 291051477 292830437 294676393 296668023 298794687
3512.1 298794687 300955445 303018600 305093467 307292551 309587777 311857909 314059317 316306293
3528.4 316306293 318620503 320974171 323486358 326116323 328627557 331137985 333885878 336785674
3544.7 336785674 339547336 342177927 344920486 347778708 350631565 353555620 356670231 359899461
3561.1 359899461 363098562 366314322 369834185 373514265 376998872 380435169 384072065 387907535
3577.4 387907535 391901791 396012396 400084794 404129833 408327639 412619203 416803598 421062320
3593.7 421062320 425552815 430133194 434702575 439285487 443793267 448175073 452703387 457383454
3610 457383454 462080061 466864318 471546650 476305425 481424749 486263871 490564406 494794816 499691427
3628.4 499691427 505009592 509615183 513894677 518288791 522687197 527081430 531425416 535587370
3644.7 535587370 539733648 544371426 549174249 553185403 556771040 560786068 564904690 568613529
3661 568613529 572103679 575552821 578873694 582222939 585719764 588802993 591770828 594908357 597672939
3679.4 597672939 600294828 603033662 605718195 608404160 611149073 613612950 615756094 617773771
3695.7 617773771 619719088 621623814 623521984 625365198 627069712 628659427 630187452 631728351
3712 631728351 633231997 634554207 635843277 637230814 638598442 639821947 641010523 642251909 643440723
3730.3 643440723 644626915 645854175 647019446 648019969 648795307 649436653 650457025 651830673 652797580
3748.7 652797580 653503120 654357255 655257642 656096399 656939030 657792091 658552051 659277439 660006166 660741806
3769.1 660741806 661577225 662428856 663222492 664031386 664869487 665645599 666311383 666931987 667522669 668114960
3789.5 668114960 668772817 669430137 670078456 670768082 671369195 672001541 672679186 673141658 673650324 674310207
3809.9 674310207 674936950 675469577 676034629 676675975 677167773 677676380 678183258 678577423 678987682 679406106
3830.3 679406106 679935753 680617034 681173563 681535602 681886733 682208061 682507753 682900965 683413863 683798134
3850.7 683798134 683888257 684179366 684698224 685097754 685481191 685914159 686367512 686657310 686774790 687072575
3871.1 687072575 687433362 687756240 688102543 688395500 688764393 689092934 689332187 689598858 689777136 690000832
3891.5 690000832 690350771 690597534 690718472 690849781 691005886 691190481 691454291 691684425 691804767 691909909
3911.9 691909909 692068756 692249835 692456424 692691147 692839503 692945898 693142951 693327367 693436325 693611383
3932.3 693611383 693845212 693999708 694112182 694230735 694354355 694507599 694655776 694779813 694908440 695080221
3952.7 695080221 695297956 695485175 695596397 695702732 695835471 695934236 696017504 696163595 696355581 696520686
3973.1 696520686 696674168 696819186 696920574 697057962 697267115 697417438 697441638 697479188 697632015 697806299
3993.4 697806299 697940052 698079228
3997.5 698079228
##END=$$ End of the data block
