##TITLE=G18-51-SE $$ Begin of the data block
##JCAMP-DX=5.00 $$ ACD/SpecManager v 10.08
##SPECTROMETER/DATA SYSTEM=Alpha
##DATE=23 Oct 2013 10:11:40
##DATA TYPE=INFRARED SPECTRUM
##DATA CLASS=XYDATA
##ORIGIN=
##OWNER=
##NPOINTS=1765
##FIRSTX=399.75695801
##LASTX=3997.56933594
##MAXX=3997.56933594
##MINX=399.75695801
##MAXY=0.84987736
##MINY=0.41445756
##XFACTOR=1.0000000000
##YFACTOR=1.000000000000000e-9
##FIRSTY=0.66127592
##DELTAX=2.03957629
##XUNITS=1/CM
##YUNITS=ARBITRARY UNITS
##XYDATA=(X++(Y..Y))
399.8F61275923q48174q06808p15196m61221k44796J05619M35531J61052r40979j789152
$$ 661275923 660427749 659620941 658905745 658444524 658199728 658305347 658740878 658901930 657960951 656171799
420.2F56171799j295448m02450m6671q06152j833618j843155j129746m27306L49760
$$ 656171799 654876351 654473901 654427230 653621078 651787460 649944305 648814559 648387253 648737013
438.5F48737013R41098R09329M91619J62720K33353N22851L51310o33955j734972j902282
$$ 648737013 649678111 650587440 651079059 651241779 651475132 651997983 652349293 651715338 649980366 648078084
458.9F48078084j372278j130163j244426j551211j855850j910925j488924p98345o65963
$$ 648078084 646705806 645575643 644331217 642780006 640924156 639013231 637524307 636725962 636059999
477.3F36059999j044273j140594p87616m13835k10822k55525p69615j572967j943528
$$ 636059999 635015726 633875132 633087516 632673681 632462859 632207334 631437719 629864752 627921224
495.6F27921224j484335j048744j318395j920581k515733k573788j989484j559615
$$ 627921224 626436889 625388145 624069750 622149169 619633436 617059648 615070164 613510549
511.9F13510549j696706k177536k426505j938045j086951m69446r119J47998j19388
$$ 613510549 611813843 609636307 607209802 605271757 604184806 603715360 603706241 603854239 603734851
530.3F03734851M2260J088678K095700K282977J841426J100242M35114J91211J26005
$$ 603734851 603777111 604865789 606961489 609244466 611085892 612186134 612621248 612812459 612938464
548.6F12938464j50085o59287j298368j671314j366198r27985j142323j778483k261460
$$ 612938464 612788379 612129092 610830724 609159410 607793212 606865227 605722904 603944421 601682961
567F01682961k183080j325845j92941N61118R28283J168728J560032K303958K909422
$$ 601682961 599499881 598174036 597981095 598542213 599470496 600639224 602199256 604503214 607412636
585.4F07412636K645254J600385N96404J59681K96474N42700M27544J10507j72734
$$ 607412636 610057890 611658275 612254679 612414360 612710834 613253534 613681078 613791585 613618851
603.7F13618851k53499j5914L86119O33239N71013M09186N99563J282573J949250K271831
$$ 613618851 613365352 613349438 613735557 614368796 614939809 615348995 615948558 617231131 619180381 621452212
624.1F21452212K252698K018869J814783J796126J848638J729071J401008J066386
$$ 621452212 623704910 625723779 627538562 629334688 631183326 632912397 634313405 635379791
640.4F35379791Q74698Q71897J019836J117527R68397O33240L05771J46985L19541
$$ 635379791 636254489 637126386 638146222 639263749 640232146 640865386 641171157 641318142 641637683
658.8F41637683O21736P06315N07295J14918L22223J197576J476586J502395J344621
$$ 641637683 642259419 642965734 643473029 643587947 643910170 645107746 646584332 648086727 649431348
677.1F49431348J033664Q13901Q76844J158655J240015P72953k265n63503o86884m56571
$$ 649431348 650465012 651278913 652155757 653314412 654554427 655327380 655325115 654761612 654074728 653618157
697.5F53618157K444M03642N24044N94557J016020J771153K436280K645910K353251
$$ 653618157 653620601 654024243 654548287 655142844 656158864 657930017 660366297 663012207 665365458
715.9F65365458K021908K352894L307163L950060L752470K916813K068519J833737
$$ 665365458 667387366 669740260 673047423 676997483 680749953 683666766 685735285 687569022
732.2F87569022K118468K271235J811445Q18908n1200j89245K20955N31077J95861
$$ 687569022 689687490 691958725 693770170 694589078 694537878 694348633 694569588 695100665 695296526
750.6F95296526o61731j334488j282275o13153n066J39177P5042L57628J322865K688229
$$ 695296526 694634795 693300307 692018032 691404879 691399813 691538990 691614032 691971660 693294525 695982754
771F95982754L747165M028142L573537K931595K722501K908349K917946K385855J563966
$$ 695982754 699729919 703758061 707331598 710263193 712985694 715894043 718811989 721197844 722761810
789.3G22761810R32932Q56518J468063K279341K493441K101124J693606J631141J841366
$$ 722761810 723694742 724551260 726019323 728298664 730792105 732893229 734586835 736217976 738059342
807.7G38059342J885354J528144Q14975N9485k16126o1393m2260m81009j200199j762212
$$ 738059342 739944696 741472840 742287815 742347300 742131174 742069781 742027521 741546512 740346313 738584101
828.1G38584101j944005j747668j342952j237214j602113j954496j945734j621664
$$ 738584101 736640096 734892428 733549476 732312262 730710149 728755653 726809919 725188255
844.4G25188255j163184q04127p02142q36850r50515p70092k01046Q65936K228439
$$ 725188255 724025071 723220944 722518802 721681952 720731437 719961345 719760299 720626235 722854674
862.7G22854674L225982L634453L849029L978968L709614K811909J343608k20776j379013
$$ 722854674 726080656 729715109 733564138 737543106 741252720 744064629 745408237 745187461 743808448
881.1G43808448k069831k447605k812028l312111l691852l689468l270149k768874
$$ 743808448 741738617 739291012 736478984 733166873 729475021 725785553 722515404 719746530
897.4G19746530k654314l114641l946304m562497m632771m472792m473806m707634
$$ 719746530 717092216 713977575 710031271 705468774 700836003 696363211 691889405 687181771
913.7F87181771m899621m571855l467143j941442p81119m81844p92861r59635n68390
$$ 687181771 682282150 677710295 674243152 672301710 671520591 671038747 670245886 669286251 668717861
932.1F68717861O8426L97146J22368n65290j270235j986801l062010m563093o185591
$$ 668717861 668786287 669183433 669305801 668740511 667470276 665483475 662421465 657858372 651672781
950.4F51672781p546604q296609q285940p857919p643580p869244q289039q470773
$$ 651672781 644126177 635829568 627543628 619685709 612042129 604172885 595883846 587413073
966.8E87413073q025647p023155n932153n099833m460394l671527k560139j376688
$$ 587413073 579387426 572364271 566432118 561332285 556871891 553200364 550640225 549263537
983.1E49263537n64098l74854o53982r35376q57055m67062n4360J56761J00672j07706
$$ 549263537 548699439 548324585 547670603 546735227 545878172 545411110 545356750 545513511 545614183 545506477
1003.5E45506477k81453l95834n59628q71778j329422j696110j670718j330852j041532
$$ 545506477 545225024 544829190 544269562 543397784 542068362 540372252 538701534 537370682 536329150
1021.8E36329150j070618j414955j786172j899541j747370j557052j553654j772702
$$ 536329150 535258532 533843577 532057405 530157864 528410494 526853442 525299788 523527086
1038.1E23527086k018333k034664j775682j404226j057088p31587l61920J21772P22170
$$ 523527086 521508753 519474089 517698407 516294181 515237093 514505506 514143586 514265358 514987528
1056.5E14987528J303256J740813K025068K080381J759767R27747k56658j120686j154185
$$ 514987528 516290784 518031597 520056665 522137046 523896813 524824560 524567902 523447216 522293031
1074.8E22293031n02586M87149J599907K604545L273427L521919L430903L209055L013849
$$ 522293031 521790445 522277594 523877501 526482046 529755473 533277392 536708295 539917350 542931199
1093.2E42931199K813399K495408J992166J368940R08971Q29935J091778J547933J953959
$$ 542931199 545744598 548240006 550232172 551601112 552510083 553340018 554431796 555979729 557933688
1111.6E57933688K121329K110780K003968J831531J638949J486123J490652J725197
$$ 557933688 560055017 562165797 564169765 566001296 567640245 569126368 570617020 572342217
1127.9E72342217K146900K515793K551496K217769J606107Q25584Q2731m25160o34849
$$ 572342217 574489117 577004910 579556406 581774175 583380282 584205866 584288597 583863437 583228588
1146.2E83228588n91874m61698l52561j74999K09391Q22544J533210K203286K727389
$$ 583228588 582636714 582175016 581822455 581647456 581856847 582679391 584212601 586415887 589143276
1164.6E89143276K997041L154337L538847M203022M857957N239129N345822N296051
$$ 589143276 592140317 595294654 598833501 603036523 607894480 613133609 618479431 623775482
1180.9F23775482N179167N052626M843235M359186L487587K378642J387179P41244
$$ 623775482 628954649 634007275 638850510 643209696 646697283 649075925 650463104 651204348
1197.2F51204348L66509O2942k93374n90205o01113k95877J11281L65973L07083k4199
$$ 651204348 651570857 651633799 651340425 650750220 650149107 649853230 649964511 650330484 650637567 650613368
1217.6F50613368l76881n55992n90622o90699j008808j439870j672983j499772j033366
$$ 650613368 650236487 649680495 649089873 648399174 647390366 645950496 644277513 642777741 641744375
1236F41744375n59568k68936j13249J23203N96821J220524J721502J858949J697004
$$ 641744375 641184807 640915871 640802622 640925825 641522646 642743170 644464672 646323621 648020625
1254.3F48020625J497090J438200J590789J785815J762509J549303J342714J267553
$$ 648020625 649517715 650955915 652546704 654332519 656095028 657644331 658987045 660254598
1270.6F60254598J347661J404285J213968P97748M40181M10080O80089R61005R81033
$$ 660254598 661602259 663006544 664220512 665018260 665458441 665868521 666548610 667509615 668490648
1289F68490648O72698J34707l87192o66559p15852p96318j119077j535833j699268
$$ 668490648 669163346 669298053 668910861 668244302 667528450 666732132 665613055 664077222 662377954
1307.4F62377954j468063j000643n63621l73900l29256j45197J46449K31802o5923
$$ 662377954 660909891 659909248 659345627 658971727 658642471 658497274 658643723 658875525 658809602
1325.7F58809602p16507j471222j938581j937270j609028j174867p22229m42505m58360
$$ 658809602 658093095 656621873 654683292 652746022 651136994 649962127 649239898 648797393 648339033
1344.1F48339033m98593l90708l61443o06537j046896j447916j673102j842678j991331
$$ 648339033 647840440 647449732 647088289 646481752 645434856 643986940 642313838 640471160 638479829
1362.4F38479829k101243k426982k760112k553880k211630k061666k033889k389133
$$ 638479829 636378586 633951604 631191492 628637612 626425982 624364316 622330427 619941294
1378.7F19941294k954006l153801k664208j617492m56571m5240m78566p90953l89815
$$ 619941294 616987288 613833487 611169279 609551787 609095216 609049976 608571410 607780457 607390642
1397.1F07390642K44439P21216P90894P53582R31978J120508J307010J395881J181305
$$ 607390642 607635081 608356297 609147191 609900773 610832751 611953259 613260269 614656150 615837455
1415.5F15837455R27806J314640J893222K022982J977682J514017P38264J59144l54409
$$ 615837455 616765261 618079901 619973123 621996105 623973787 625487804 626226068 626385212 626030803
1433.8F26030803q22902l51906M35174M02093P1108j00315N0187L55721K43545j42098
$$ 626030803 625207901 624855995 625291169 625693262 625764370 625664055 625714242 626069963 626313508 626171410
1454.2F26171410p033J538872K722800K493561K299666K712309L141582L714085N247116
$$ 626171410 626164377 627703249 630426049 632919610 635219276 637931585 641073167 644787252 650034368
1472.6F50034368O425619N965710M737735L250003J879394O04033o40035j653850k104282
$$ 650034368 656459987 662425697 667163432 670413435 672292829 672896862 672256827 670602977 668498695
1490.9F68498695k394617l549397m747450m282534l499866l887772o098867q479953
$$ 668498695 666104078 662554681 657807231 653524697 650024831 646137059 640038192 631558239
1507.2F31558239o588280n147278n443752n234420m114330k796471k347231j951277
$$ 631558239 624969959 619822681 614378929 609144509 605030179 602233708 599886477 597935200
1523.6E97935200j695633j855850j841844k176880k387762j657010j484215j862466
$$ 597935200 596239567 594383717 592541873 590364993 587977231 586320221 584836006 582973540
1539.9E82973540o79910P25329J242458J594723K108872K639532K777040K369106K641677
$$ 582973540 582293630 583018959 584261417 585856140 587965012 590604544 593381584 595750690 598392367
1558.2E98392367M557431M457474L427088K816856K219498K070666J871943J343787
$$ 598392367 602949798 607407272 610834360 613651216 615870714 617941380 619813323 621157110
1574.5F21157110J326918J448393P93576k6106l99352n62310q28862j391649k124131
$$ 621157110 622484028 623932421 624725997 624699891 624300539 623738229 622909367 621517718 619393587
1592.9F19393587k814591l236472l592492m198670m913449n622804o392062p154703
$$ 619393587 616578996 613342524 609750032 605551362 600637913 595015109 588623047 581468344
1609.2E81468344p453561p521093q652985j0104835q879542q522213r962380r731710
$$ 581468344 574014783 566493690 557840705 547735870 538856328 530334115 520371735 510640025
1625.5E10640025q992016q716583p818461p517606p512391m582494j600057m89682
$$ 510640025 501648009 492931426 485112965 477595359 470082968 465500474 463900417 463410735
1641.8D63410735j7047N69225J774609K238482K342850L886908M618585M304290M635781
$$ 463410735 463393688 463962913 465737522 467976004 470318854 474205762 478824347 483128637 487764418
1660.2D87764418N660266O589979O300211O405234P356703P243455P401287Q127511
$$ 487764418 493424684 500014663 506314874 512720108 520076811 527320266 534721553 542849064
1676.5E42849064P682502O889641P190884R494185R972692Q937656R341181R371102
$$ 542849064 550531566 557421207 564612091 574106276 584078968 593016624 602357805 611728907
1692.8F11728907J0494649J1934459J1975348J3168514J1307478Q960664Q505881P359445
$$ 611728907 622223556 634158015 646133363 659301877 670609355 679570019 688075900 695435345
1709.2F95435345N993545M860878M091978M254997M549205L874600L066302K622425
$$ 695435345 701428890 706289768 710381746 714636743 719185948 723060548 726126850 728749275
1725.5G28749275K135098J674473J212419J226186K047420K165437J989424K324164
$$ 728749275 730884373 732558846 733771265 734997451 737044871 739210308 741199732 743523896
1741.8G43523896K682864K800823K912938L428638M205644M123450L686607L526568
$$ 743523896 746206760 749007583 751920521 755349159 759554803 763678253 767364860 770891428
1758.1G70891428L296554L345072L380895K948165K490938K167821K281904K684176
$$ 770891428 774187982 777533054 780913949 783862114 786353052 788520873 790802777 793486953
1774.4G93486953K475381K015590J792312J662612J462638J308322J058698P89821
$$ 793486953 795962334 797977924 799770236 801432848 802895486 804203808 805262506 806052327
1790.7H06052327J144946J549840J236975Q01325Q94904J308501J368582J014233O36160
$$ 806052327 807197273 808747113 809984088 810785413 811680317 812988818 814357400 815371633 816007793
1809.1H16007793O07729Q50320J000762R78052Q77798O03437L08097L76284N89788
$$ 816007793 816615522 817465842 818466604 819444656 820322454 820925891 821233988 821610272 822200060
1827.4H22200060P05421R48787Q88347M98772M34995N65707L73304J50383M51564O99401
$$ 822200060 822905481 823854268 824742615 825241387 825676382 826242089 826615393 826765776 827217340 827916741
1847.8H27916741O27935N81622N43416M32253K56538J68443K18749K64764J32978R3400
$$ 827916741 828544676 829126298 829669714 830101967 830358505 830526948 830745697 831010461 831143439 831236839
1868.2H31236839M18902N88476M38571L61145M11808M00365K77698J46866P1048J05739
$$ 831236839 831655741 832244217 832682788 833043933 833455741 833856106 834133804 834280670 834351718 834457457
1888.6H34457457L80397N33819L52085K01404K00629K62201L00646K47121J12414K4617
$$ 834457457 834837854 835371673 835723758 835925162 836125791 836387992 836688638 836935759 837048173 837072790
1909H37072790P5042J50204J18553Q7559J88351J59681P9870K19286L28064K73049
$$ 837072790 837147832 837298036 837416589 837504148 837692499 837852180 837932050 838151336 838479400 838752449
1929.4H38752449J48713J5617k8491L7014N4121J8954R8169J55509Q3744O8009J42992
$$ 838752449 838901162 838916779 838888288 838925302 838979423 838998377 839096546 839252055 839335799 839403808 839546800
1951.9H39546800J78933J22607K6524n305N0545R6738Q8930J11938J11818N0127O0737
$$ 839546800 839725733 839848340 839874864 839869559 839920104 840016842 840105772 840217710 840329528 840379655 840440392
1974.3H40440392J11044J16587P8439J0312l8147k2292m471k1815K8193J06991P5340
$$ 840440392 840551436 840668023 840746462 840756774 840718627 840696335 840691864 840670049 840698242 840805233 840880573
1996.7H40880573K4736L8445o140r5427j07586n3108m6015j14619j74046j48058p1108
$$ 840880573 840905309 840943754 840937614 840842187 840734601 840681493 840635478 840520859 840346813 840198755 840127647
2019.2H40127647o3837j13725j40369j53780j64986j41919j22010j18673j49608k26915
$$ 840127647 840063810 839950085 839809716 839655936 839490950 839349031 839227021 839108348 838958740 838731825
2039.6H38731825j95264m4585K7001k0146p3970q5592k8550N1200P4565L6180m7981
$$ 838731825 838536561 838491976 838518977 838498831 838424861 838339269 838310719 838361919 838436484 838472664 838424683
2062H38424683q9348J1981J67072J94668J06991j1325q2791l1054J06454J73628J14978
$$ 838424683 838335335 838347316 838514388 838709056 838816047 838804722 838721931 838690877 838797331 838970959 839085937
2084.4H39085937K8431l4153J0371J47223K03133J32501M1127Q941O6578J77562K26737
$$ 839085937 839114368 839080215 839090586 839237809 839440942 839573443 839614570 839623511 839690089 839867651 840094388
2106.9H40094388J40726k2769o9618M8876J55687J71125J28686K7478l8683L5941J48952
$$ 840094388 840235114 840212345 840142727 840191603 840347290 840518415 840647101 840674579 840635896 840671837 840820789
2129.3H40820789J58251Q5652R059l5107K1577J36793J59383J06036O2585K5034M6253
$$ 840820789 840979040 841064692 841073751 841038644 841060221 841197014 841356397 841462433 841525018 841550052 841596305
2151.7H41596305J28746J60754J33753R7632P8261J06335J95265K58326K56896K30313
$$ 841596305 841725051 841885805 842019558 842117190 842195451 842301786 842497051 842755377 843012273 843242586
2172.1H43242586J85251J65403J88887K47359K97725K67208J69516R8109J22785K11239
$$ 843242586 843427837 843593240 843782127 844029486 844327211 844594419 844763935 844862044 844984829 845196068
2192.5H45196068K80738K58565J71185J38163J90675K46466K41339J83821J18017R7990
$$ 845196068 845476806 845735371 845906556 846044719 846235394 846481860 846723199 846907020 847025037 847123027
2212.9H47123027J32859J87575K27452K01165J22250P8856J01984J56224J76132J39951
$$ 847123027 847255886 847443461 847670913 847872078 847994328 848073184 848175168 848331392 848507524 848647475
2233.3H48647475P2122N007J1146Q0347J23083J08004N7280J6809J9490M6671Q9287
$$ 848647475 848719597 848724604 848735750 848816097 848939180 849047184 849104464 849121273 849140763 849187434 849276721
2255.8H49276721J18196N1499n9605q1181J9371J35601J44481N3764k9981k4855M0590
$$ 849276721 849394917 849446416 849386811 849305630 849325001 849460602 849605083 849658847 849628866 849604011 849644601
2278.2H49644601J05739J09792J7225j20937j83940j35839n6684p034o8009k09629
$$ 849644601 849750340 849860132 849877357 849756420 849572480 849436641 849379957 849372923 849304914 849095285
2298.6H49095285k55168j84714j59562k04563k51413l03924l18050k55585k35319l35574
$$ 849095285 848840117 848655403 848495841 848291278 848039865 847735941 847417891 847162306 846926987 846591413
2319H46591413m00305l51727l27766l34620k72453k20239k45154k77341l00824l03090
$$ 846591413 846191108 845839381 845511615 845176995 844904542 844684303 844439149 844161808 843860984 843557894
2339.4H43557894k09450M9233L44276L39628o0797n78165q56400p89463o36757n26964
$$ 843557894 843348444 843397677 843741953 844081581 844020784 843442619 842586219 841796756 841159999 840633035
2359.8H40633035l37661M650K75135L94940N09560N62608M74871L81410M23371N12243
$$ 840633035 840295374 840300024 840575159 840970099 841479659 842042267 842517138 842898548 843321919 843834162
2380.2H43834162M39822K05160m2439j76012j59324r3281r7990j89483k96414l24190
$$ 843834162 844273984 844479144 844436705 844260693 844101369 844008088 843910098 843720615 843424201 843100011
2400.6H43100011k44379j53005j55031k78414m28617m55737l46720k11775j82331k90692
$$ 843100011 842855632 842702627 842547596 842269182 841840565 841384828 841038108 840826333 840644002 840353310
2421H40353310m47333n27560m28677k43187j92463l16441m70281n22375m35233l00706
$$ 840353310 839905977 839378417 838949740 838706553 838514090 838197649 837727368 837204993 836769760 836469054
2441.3H36469054k70009l72708n13971n35190l91841k30968k16424l71993n22256n33640
$$ 836469054 836199045 835826337 835312366 834777176 834385335 834154367 833937943 833565950 833043694 832510054
2461.7H32510054m40121l29196k90096l47495m49657m95732m01795k53558k45035l87311
$$ 832510054 832069933 831740737 831450641 831103146 830653489 830157757 829755962 829502404 829257369 828870058
2482.1H28870058n18322n26786m08470k61665k24471l17573m32969m59134l57986k24232
$$ 828870058 828351736 827824950 827416480 827154815 826930344 826612771 826179802 825720668 825362682 825138450
2502.5H25138450k06292l22878m39763m36306l42489k74479k68221l28660m36544m59612
$$ 825138450 824932158 824609280 824169517 823733211 823390722 823116243 822848022 822519362 822082818 821623206
2522.9H21623206l73244k80559k76149l87072m88699m80055m02928l60727l96550m72963
$$ 821623206 821249962 820969403 820693254 820306182 819817483 819337428 818934500 818573773 818177223 817704260
2543.3H17704260n14865m86433m24326l35633k88427l70920m74572m90725m40359l56615
$$ 817704260 817189395 816702962 816278636 815943003 815654576 815283656 814809084 814318359 813878000 813521385
2563.7H13521385l27885l74138l97623l97622m10796m17173l98874l81708m06146m31895
$$ 813521385 813193500 812819362 812421739 812024117 811613321 811196148 810797274 810415566 810009420 809577525
2584.1H09577525m24922m15563m15445m11689l92675l83080l95715l98099m02272m21822
$$ 809577525 809152603 808737040 808321595 807909906 807517231 807134151 806738436 806340337 805938065 805516243
2604.5H05516243m55141n05149n17726n08726n50151n77867n66304o07073o70373o68407
$$ 805516243 805061102 804555953 804038227 803529501 802979350 802401483 801835179 801228106 800557733 799889326
2624.9G99889326o45518o47485o40333o49810p13825p74563p60197o95706o61969o75380
$$ 799889326 799243808 798596323 797955990 797306180 796592355 795817792 795057595 794361889 793699920 793024540
2645.3G93024540p11739p36177p26819o96898o75380o94334p26462p27892p08639o72162
$$ 793024540 792312801 791576624 790849805 790152907 789477527 788783193 788056731 787328839 786620200 785948038
2665.7G85948038o16789n81741o03736o60300o76036o41644o10590o15835o45757o52790
$$ 785948038 785331249 784749508 784145772 783485472 782809436 782167792 781557202 780941367 780295610 779642820
2686.1G79642820o30736n90324n69165o06120o74188p23541p27415p13408o98745o90818
$$ 779642820 779012084 778421760 777852595 777246475 776572287 775848746 775121331 774407923 773709178 773018360
2706.5G73018360p35044q06332q17180p72237p45714p53641p54297p32958p15793o95407
$$ 773018360 772283316 771476984 770659804 769887567 769141853 768388212 767633915 766900957 766185164 765489757
2726.9G65489757o58214o58691o99282o98030o65366o39081o21975o43134o47008n82338
$$ 765489757 764831543 764172852 763473570 762775540 762110174 761471093 760849118 760205984 759558976 758976638
2747.3G58976638n26905n53429o38485o99103o79195o02781n59867o02722o65009o58155
$$ 758976638 758449733 757896304 757257819 756558716 755879521 755276740 754716873 754114151 753449142 752790987
2767.7G52790987o32405o65188p05778p20322p37727p63238p70807p70151q26478r09806
$$ 752790987 752158582 751493394 750787616 750067294 749329567 748566329 747795522 747025371 746198893 745289087
2788.1G45289087r69052j007736r94622r62735r83596j057565j142263j177967j160562
$$ 745289087 744320035 743312299 742317677 741354942 740371346 739313781 738171518 736993551 735832989
2806.4G35832989j142740j177490j278400j383424j418233j377284j358748j432657
$$ 735832989 734690249 733512759 732234359 730850935 729432702 728055418 726696670 725264013
2822.7G25264013j554966j677573j769543j826703j891315k028108k300381k718926
$$ 725264013 723709047 722031474 720261931 718435228 716543913 714515805 712215424 709496498
2839.1G09496498l201127l647089m070759m492163m687190m341603l427088k249122
$$ 709496498 706295371 702648282 698577523 694085360 689398170 685056567 681629479 679380357
2855.4F79380357j288652r12845j130879j700282k303839k688706k757668k516807
$$ 679380357 678091705 677178860 676047981 674347699 672043860 669355154 666597486 664080679
2871.7F64080679k124607j749754j347840r38296p19369p37428q70049j025081j137734
$$ 664080679 661956072 660206318 658858478 657920182 657200813 656463385 655593336 654568255 653430521
2890.1F53430521j198530j281559j446128j697481j924038k060055k220869k461017
$$ 653430521 652231991 650950432 649504304 647806823 645882785 643822730 641601861 639140844
2906.4F39140844k808153l292322l826559m333019m612685m453718l945291l210128
$$ 639140844 636332691 633040369 629213810 624880791 620268106 615814388 611869097 608658969
2922.7F08658969k291381j273513k47478O98447J556277K331555K920330L288805L514409
$$ 608658969 606367588 605094075 604846597 605545044 607101321 609432876 612353206 615642011 619156420
2941F19156420L518284L113329K378345J656353J146674Q20816O92367Q39114J236856
$$ 619156420 622674704 625788033 628166378 629822731 630969405 631790221 632482588 633321702 634558558
2959.4F34558558J767517K302825K835512L371239L732383L874779L930211L895283
$$ 634558558 636326075 638628900 641464412 644835651 648568034 652442813 656373024 660268307
2975.7F60268307L819942L746391L486990L051222K649426K306044K009094J703084
$$ 660268307 664088249 667834640 671321630 674372852 677022278 679328322 681337416 683040500
2992F83040500J295387Q54612M07994k1458l23474n09799o47604p43866p97809q40187
$$ 683040500 684335887 685190499 685598493 685577035 685253561 684743762 684096158 683352292 682554483 681714296
3012.4F81714296q89122r25005r77754j122713j323581j471162j515925j461088j417220
$$ 681714296 680825174 679900169 678922415 677799702 676476121 675004959 673489034 672027946 670610726
3030.8F70610726j451612j527249j609385j631558j620591j658261j729786j806200
$$ 670610726 669159114 667631865 666022480 664390922 662770331 661112070 659382284 657576084
3047.1F57576084j857638j858175j848161j848579j850247j832247j756728j645624
$$ 657576084 655718446 653860271 652012110 650163531 648313284 646481037 644724309 643078685
3063.4F43078685j521766j403213j355231j374185j360416j238525j111806j105427
$$ 643078685 641556919 640153706 638798475 637424290 636063874 634825349 633713543 632608116
3079.7F32608116j125157j108706j082003r97186r07183r30369r89556r56893r07481
$$ 632608116 631482959 630374253 629292250 628295064 627387881 626457512 625467956 624511063 623603582
3098.1F23603582r48846j033068j052797j009643j012623j103878j155734j119494
$$ 623603582 622654736 621621668 620568871 619559228 618546605 617442727 616286993 615167499
3114.4F15167499j141310j252830j398742j520574j517058j448452j461506j529753
$$ 615167499 614026189 612773359 611374617 609854043 608336985 606888533 605427027 603897274
3130.7F03897274j546681j526595j510560j551211j699448j800239j750588j690865
$$ 603897274 602350593 600823998 599313438 597762227 596062779 594262540 592511952 590821087
3147E90821087j679718j668573j710534j829385j885474j829982j792908j845956j909911
$$ 590821087 589141369 587472796 585762262 583932877 582047403 580217421 578424513 576578557 574668646
3165.4E74668646j894713j839637j847148j904130j944185j954913j888811j822949
$$ 574668646 572773933 570934296 569087148 567183018 565238833 563283920 561395109 559572160
3181.7E59572160j856684j880050j886249j943946j945495j873970j846433j832306
$$ 559572160 557715476 555835426 553949177 552005231 550059736 548185766 546339333 544507027
3198E44507027j773477j722753j701593j683772j683414j696825j700401j702965j697480
$$ 544507027 542733550 541010797 539309204 537625432 535942018 534245193 532544792 530841827 529144347
3216.4E29144347j651824j593172j596213j654803j705945j719534j680315j658142
$$ 529144347 527492523 525899351 524303138 522648335 520942390 519222856 517542541 515884399
3232.7E15884399j783728j950205j966178j914978j926064j946390j962423k060473
$$ 515884399 514100671 512150466 510184288 508269310 506343246 504396856 502434433 500373960
3249E00373960k156258k121896k047181k077847k144784k113968k052188k037943j994461
$$ 500373960 498217702 496095806 494048625 491970778 489825994 487712026 485659838 483621895 481627434
3267.4D81627434j872062j776874j735360j645505j524657j428634j305997j153708
$$ 481627434 479755372 477978498 476243138 474597633 473072976 471644342 470338345 469184637
3283.7D69184637j040339r70066q93027p99059p36386p01070o73562o40243n71102
$$ 469184637 468144298 467174232 466281205 465482146 464745760 464044690 463371128 462730885 462159783
3302D62159783m92275m83036n51671o08474o19113n97656n76139n60909n39482n58317
$$ 462159783 461667508 461184472 460632801 460024327 459405214 458807558 458231419 457670510 457131028 456572711
3322.4D56572711o13272o82413p30008p10964p18862p95007q45671q95172r71675j004457
$$ 456572711 455959439 455277026 454547018 453836054 453117192 452322185 451476514 450581342 449609667 448605210
3342.8D48605210j029641j050621j044542j148343j305431j316339j241922j196593
$$ 448605210 447575569 446524948 445480406 444332063 443026632 441710293 440468371 439271778
3359.1D39271778j211643j266748j240671j180023j254052j396894j403391j256139
$$ 439271778 438060135 436793387 435552716 434372693 433118641 431721747 430318356 429062217
3375.5D29062217j134246j109153j096547j020461r18448q20816o95705o83755q40515
$$ 429062217 427927971 426818818 425722271 424701810 423783362 422962546 422266841 421583086 420742571
3393.8D20742571q60691n88208l87222n91218q33899o71625m05699l49492l95834m05372
$$ 420742571 419881880 419293672 418906450 418315232 417481333 416809708 416404009 416054517 415658683 415253311
3414.2D15253311l29226k28226j67191p1108J18106L06189M54158N26696N89490O77705
$$ 415253311 414924085 414695859 414528668 414457560 414575666 414881855 415336013 415862709 416452199 417129904
3434.6D17129904N90533M05997M32968O41853Q40813R66608J036436J128524J211018
$$ 417129904 417720437 418126434 418559402 419201255 420042068 421008676 422045112 423173636 424384654
3453D24384654J269579J364797J446545J410037J425475J674861J861304J665413J297623
$$ 424384654 425654233 427019030 428465575 429875612 431301087 432975948 434837252 436502665 437800288
3471.3D37800288J258642J545220J844466J910359J738429J740604J937360J927078
$$ 437800288 439058930 440604150 442448616 444358975 446097404 447838008 449775368 451702446
3487.6D51702446J807362J857161J976550K061963K039820J955896J942516J917153
$$ 451702446 453509808 455366969 457343519 459405482 461445302 463401198 465343714 467260867
3504D67260867J872450J943380K091885K244979K281844K140105K059728K165467K333969
$$ 467260867 469133317 471076697 473168582 475413561 477695405 479835510 481895238 484060705 486394674
3522.3D86394674K312660K153158K196074K410590K541036K611756K621829K527714
$$ 486394674 488707334 490860492 493056566 495467156 498008192 500619948 503241777 505769491
3538.6E05769491K554476K653897K652288K601266K653122K765894K810776K837658
$$ 505769491 508323967 510977864 513630152 516231418 518884540 521650434 524461210 527298868
3554.9E27298868K919078L011405K979517K807021K722860L145098L749669L760993
$$ 527298868 530217946 533229351 536208868 539015889 541738749 544883847 548633516 552394509
3571.3E52394509L479839L440678L583669L756404L861964L719032L419101L455341
$$ 552394509 555874348 559315026 562898695 566655099 570517063 574236095 577655196 581110537
3587.6E81110537L928006M008949L811299L934265M141449M105926M021764L930747
$$ 581110537 585038543 589047492 592858791 596793056 600934505 605040431 609062195 612992942
3603.9F12992942L699541L661633L864884L945172L948987L837526L756761M115999
$$ 612992942 616692483 620354116 624219000 628164172 632113159 635950685 639707446 643823445
3620.2F43823445M263341L754974L065169K989232L917754M275322L901958L585339
$$ 643823445 648086786 651841760 654906929 657896161 661813915 666089237 669991195 673576534
3636.5F73576534L373384L255427L100276K684236K185583K387225L390670L642559
$$ 673576534 676949918 680205345 683305621 685989857 688175440 690562665 693953335 697595894
3652.8F97595894L099025K981364L126502K757252K336800K134919J735687J409054
$$ 697595894 700694919 703676283 706802785 709560037 711896837 714031756 715767443 717176497
3669.2G17176497J775026J908541J623511K161146K640783K402485K018928J569927
$$ 717176497 718951523 720860064 722483575 724644721 727285504 729687989 731706917 733276844
3685.5G33276844J168072J207590J746655K003372J722574J298427R65894R27150J266003
$$ 733276844 734444916 735652506 737399161 739402533 741125107 742423534 743389428 744316578 745582581
3703.8G45582581J300394P68840L38257P09295J511931J518250R61483N68926M19974
$$ 745582581 746882975 747651815 747990072 748699367 750211298 751729548 752691031 753259957 753679931
3722.2G53679931M64320P44939R69172O09815K7656P1288Q27789J387715J048863N4181
$$ 753679931 754144251 754889190 755858362 756468177 756495833 756567121 757394910 758782625 759831488 759885669
3742.6G59885669l31104O02663P46488L57628J028776J458168R42350N45978P47025
$$ 759885669 759554565 760157228 760903716 761261344 762290120 763748288 764690638 765236616 765983641
3760.9G65983641P90894M55857L02493L40223N89013Q42453P02679M43577L25680L79801
$$ 765983641 766774535 767230392 767532885 767873108 768462121 769304574 770007253 770450830 770776510 771156311
3781.3G71156311L90232M06146N85079O24299M24445J13666j20998k4795l0697K5988
$$ 771156311 771546543 771952689 772537768 773162067 773586512 773700178 773579180 773554385 773523688 773549676
3801.7G73549676O56664O66261M98354Q49069O87420k3246l92496p3970K0087L04341
$$ 773549676 774206340 774872601 775370955 776220024 776907444 776884198 776491702 776417732 776437819 776742160
3822.1G76742160Q60334O72519L54528J83225P5936J63794K146j40906L11554O95407
$$ 776742160 777602494 778275013 778629541 778812766 778888702 779052496 779054642 778913736 779225290 779920697
3842.5G79920697P33733N83291J59026n74410j123786J9073J377106J046955K26319
$$ 779920697 780654430 781237721 781396747 780822337 779698551 779717624 781094730 782141685 782368004
3860.9G82368004j56581P2896K20299q3208N9724N24521O16789M51743j4245p0393
$$ 782368004 782211423 782284319 782504618 782421410 782481134 783005655 783622444 784074187 784059942 783989549
3881.3G83989549K69532J94490K50459K40504J0610K40147L42310j12474m41790k69413
$$ 783989549 784259081 784453571 784704030 784944534 784955144 785195291 785537601 785425127 784983337 784713924
3901.7G84713924J68860O51836P83563M99487K23696K2471j66833j00851J38163J75953
$$ 784713924 784882784 785534620 786318183 786817670 787041366 787063837 786897004 786796153 786934316 787110269
3922.1G87110269J01805J60754J69038J0848P093J99139K54453J61111N6386O080N8055
$$ 787110269 787212074 787372828 787541866 787552714 787559807 787758946 788013399 788174510 788230896 788236976 788295031
3944.5G88295031O1571M4167J47760K26379K07603R3460j0491O3718K06828K21908
$$ 788295031 788356602 788400769 788548529 788774908 788982511 789075971 789065480 789129198 789336026 789557934
3964.9G89557934J08838J7643j6689p868Q5354J88946K28465J91092P6831j4305J1742
$$ 789557934 789666772 789684415 789667726 789659858 789745212 789934158 790162623 790353715 790430546 790416241 790427983
3987.3G90427983P0691Q4579P8380M8041L9578
$$ 790427983 790498674 790583253 790661633 790709674 790749252
3997.5G90749252
$$ 790749252
##END=$$ End of the data block
