##TITLE=G18-51-SE $$ Begin of the data block
##JCAMP-DX=5.00 $$ ACD/SpecManager v 10.08
##SPECTROMETER/DATA SYSTEM=Alpha
##DATE=23 Oct 2013 10:11:40
##DATA TYPE=INFRARED SPECTRUM
##DATA CLASS=XYDATA
##ORIGIN=
##OWNER=
##NPOINTS=1765
##FIRSTX=399.75695801
##LASTX=3997.56933594
##MAXX=3997.56933594
##MINX=399.75695801
##MAXY=0.85043937
##MINY=0.41407028
##XFACTOR=1.0000000000
##YFACTOR=1.000000000000000e-9
##FIRSTY=0.66168469
##DELTAX=2.03957629
##XUNITS=1/CM
##YUNITS=ARBITRARY UNITS
##XYDATA=(X++(Y..Y))
399.8F61684692l68714r23217j345515q74937m08232p9453M02153K26974p75158j232386
$$ 661684692 661315978 660392761 659047246 658172309 657764077 657684624 658086777 658313751 657538593 656306207
420.2F56306207r63211q36849p49350r10997j350164j802922j724183p79450M63426
$$ 656306207 655342996 654506147 653756797 652845800 651495636 649692714 647968531 647189081 647652507
438.5F47652507J344085J311600O28888K57254L64840N77748J78933r46403j869797
$$ 647652507 648996592 650308192 650937080 651194334 651559174 652136922 652315855 651369452 649499655
456.9F49499655j801312j114786q48710j290560j886845k008676j878560j456439p13647
$$ 649499655 647698343 646583557 645734847 644444287 642557442 640548766 638670206 637213767 636500120
475.2F36500120m81725r22620j312733j105308m87745q7142k39074p07865j253605
$$ 636500120 636018395 635095775 633783042 632677734 632189989 632102847 631863773 631155908 629902303
493.6F29902303j803517j933873j520634j335680j724780k274811k438605k000272
$$ 629902303 628098786 626164913 624644279 623308599 621583819 619309008 616870403 614870131
509.9F14870131j598358j681030k103090k395809k022743j170993l70681Q8572N4598
$$ 614870131 613271773 611590743 609487653 607091844 605069101 603898108 603527427 603615999 603670597
528.3F03670597j60575J21057J045644K000094K334714J971125J197815M64976J56105
$$ 603670597 603510022 603631079 604676723 606676817 609011531 610982656 612180471 612645447 612801552
546.6F12801552O0499j68384o21080j183629j530111j492500j224101j149893j607179
$$ 612801552 612862051 612693667 612072587 610888958 609358847 607866347 606642246 605492353 603885174
565F03885174k247691k248347j422525k76267O64890J042246J174987J582682K207398
$$ 603885174 601637483 599389136 597966611 597690344 598355234 599397480 600572467 602155149 604362547
583.3F04362547K736271K646565J734138P19607J77860J82033M59313M84645J97649
$$ 604362547 607098818 609745383 611479521 612199128 612376988 612559021 613018334 613502979 613700628
601.7F13700628j13606k90275j15156M40538P70092N42641K16543M43697J308143K105415
$$ 613700628 613587022 613296747 613181591 613622129 614392221 614934862 615151405 615595102 616903245 619008660
622.1F19008660K423525K403796K168000J856148J690328J664579J709700J566410
$$ 619008660 621432185 623835981 626003981 627860129 629550457 631215036 632924736 634491146
638.4F34491146J155495R08852R43422J023650J104236J048148O42597K28048J53064
$$ 634491146 635646641 636555493 637498915 638522565 639626801 640674949 641317546 641545594 641698658
656.7F41698658L46363O29902P37309N04613J01984L66747J237512J488864J487851
$$ 641698658 642045021 642674923 643412232 643916845 644018829 644385576 645623088 647111952 648599803
675.1F48599803J360298J142442R24110Q39711R44376J049041Q31008J40071n85794
$$ 648599803 649960101 651102543 652026653 652866364 653810740 654859781 655690789 655830860 655245066
693.5F55245066p02262l38972O2883L11673L36230M73320J056850J843929K480924
$$ 655245066 654542804 654203832 654266715 654578388 654914618 655387938 656444788 658288717 660769641
711.8F60769641K683700K357184K039791K404511L310680L921151L696621K797007
$$ 660769641 663453341 665810525 667850316 670254827 673565507 677486658 681183279 683980286
728.1F83980286J994550J867116K187490K296746J766682Q04186l5882k50698J49787
$$ 683980286 685974836 687841952 690029442 692326188 694092870 694897056 694861174 694610476 694760263
746.5F94760263M94480J77324n67257j168430j265645p51257r7156J16348M9353L51191
$$ 694760263 695254743 695432067 694864810 693696380 692430735 691679478 691582322 691698670 691748023 692099214
766.9F92099214J339018K717197L786981M011452L514946K932191K755940K935469
$$ 692099214 693438232 696155429 699942410 703953862 707468808 710400999 713156939 716092408
783.2G16092408K968073K433419J554668R10401R43244J568555K245486K488375K155900
$$ 716092408 719060481 721493900 723048568 723958969 724902213 726470768 728716254 731204629 733360529
801.6G33360529J664460J616001J882493J887143J475215P41660J6034k30610p8082
$$ 733360529 735024989 736640990 738523483 740410626 741885841 742627501 742643535 742412925 742334843
819.9G42334843q0884n23567j229405j777232j896620j663506j347840j326084j609802
$$ 742334843 742253959 741730392 740500987 738723755 736827135 735163629 733815789 732489705 730879903
838.3G30879903j861215j902163j681149j216352p55131o31034q42035j031339q71659
$$ 730879903 729018688 727116525 725435376 724219024 723463893 722832859 721990824 720959485 720087826
856.6G20087826j89364R79901K307534L296316L687858L803671L905355L682256K782047
$$ 720087826 719898462 720878363 723185897 726482213 730170071 733973742 737879097 741561353 744343400
875G44343400J263320l29077j487970k146363k461791k793730l300845l693104l689110
$$ 744343400 745606720 745277643 743789673 741643310 739181519 736387789 733086944 729393840 725704730
893.3G25704730l265501k747356k625525l126920l950536m531324m625618m468799
$$ 725704730 722439229 719691873 717066348 713939428 709988892 705457568 700831950 696363151
909.6F96363151m455507m700780m882574m529595l443480j963019q25465n25653p84874
$$ 696363151 691907644 687206864 682324290 677794695 674351215 672388196 671562731 671037078 670252204
928F70252204r06587n52594M9173L89874J32144n51701j260280j972437l058791m595399
$$ 670252204 669345617 668793023 668842196 669232070 669364214 668812513 667552233 665579796 662521005 657925606
948.4F57925606o199539p506788q267641q340001p971048p673860p794618q247436
$$ 657925606 651726067 644219279 635951638 627611637 619640589 611966729 604172111 595924675
964.7E95924675q472085q005559p021487n967736n112410m436731l656506k575458
$$ 595924675 587452590 579447031 572425544 566457808 561345398 556908667 553252161 550676703
981E50676703j396358n51939l35991o23763r35614q93593m96506k4438J90079P0334
$$ 550676703 549280345 548728406 548392415 547768652 546833038 545939445 545442939 545418501 545608580 545678914
1001.4E45678914j63317l08454l81828n47647r14991j370549j641870j571118j293123
$$ 545678914 545515597 545207143 544825315 544277668 543362677 541992128 540350258 538779140 537486017
1019.8E37486017j060605j080156j407444j793265j898110j716137j535833j560450
$$ 537486017 536425412 535345256 533937812 532144547 530246437 528530300 526994467 525434017
1036.1E25434017j786232k015352k039790j808167j400888r86695o68883l85464N5194
$$ 525434017 523647785 521632433 519592643 517784476 516383588 515396893 514728010 514342546 514397740
1054.5E14397740O95587J323759J782715K044321K065777J747310R40383k25782j122356
$$ 514397740 515093327 516417086 518199801 520244122 522309899 524057209 524997592 524771810 523649454
1072.8E23649454j172662m86850M88579J565635K572239L248870L509700L451467L223419
$$ 523649454 522476792 521989942 522478521 524044156 526616395 529865265 533374965 536826432 540049851
1091.2E40049851K998233K839625K551376K002895J375080R27686Q00133J046896J535833
$$ 540049851 543048084 545887709 548439085 550441980 551817060 552744746 553544879 554591775 556127608
1109.5E56127608J955211K125382K106965K004027J844943J648009J501024J519382
$$ 556127608 558082819 560208201 562315166 564319193 566164136 567812145 569313169 570832551
1125.8E70832551J742363K145171K503097K545118K230704J597762P76827L9518m29511
$$ 570832551 572574914 574720085 577223182 579768300 581999004 583596766 584373593 584413111 583983600
1144.2E83983600o12378n85854m70340l25799j33038K23041Q03053J492322K174437
$$ 583983600 583371222 582785368 582315028 581989229 581856191 582079232 582882285 584374607 586549044
1162.6E86549044K708316K991139L195882L591776M200459M820048N235315N360603
$$ 586549044 589257360 592248499 595444381 599036157 603236616 608056664 613291979 618652582
1178.9F18652582N286217N158365N038500M842221M353941L464460K360880J386464
$$ 618652582 623938799 629097164 634135664 638977885 643331826 646796286 649157166 650543630
1195.2F50543630P33137L36170L7492l00110n90026n93722k71141J54316L93033L03209
$$ 650543630 651276767 651612937 651650429 651350319 650760293 650166571 649895430 650049746 650442779 650745988
1215.6F50745988l9816l83139n51760o13212p21813r97483j409948j654387j489758
$$ 650745988 650706172 650323033 649771273 649158061 648436248 647438765 646028817 644374430 642884672
1233.9F42884672j031697n48601k59042j32442R9361N90861J230836J742780J897276
$$ 642884672 641852975 641304374 641045332 640912890 641012251 641603112 642833948 644576728 646474004
1252.3F46474004J733541J495362J427769J591981J786113J765728J537084J311362
$$ 646474004 648207545 649702907 651130676 652722657 654508770 656274498 657811582 659122944
1268.6F59122944J256764J367867J415491J208663P99298M31955L91603O86168R96411
$$ 659122944 660379708 661747575 663163066 664371729 665171027 665602982 665994585 666680753 667677164
1287F67677164J014173O72937J08242m02809o58094p15137q17180j128018j521110
$$ 667677164 668691337 669364274 669472516 669069707 668411613 667696476 666879296 665751278 664230168
1305.3F64230168j675069j442731r96172n70059l58462l02375j45316J07348J99497
$$ 664230168 662555099 661112368 660116196 659546137 659187675 658885300 658739984 658847332 659046829
1323.7F59046829o5625p09593j453400j914382j930475j588583j140237p40945n13971
$$ 659046829 658981204 658271611 656818211 654903829 652973354 651384771 650244534 649503589 648989618
1342F48989618m92096m57823l42071l63768o42776j081765j457333j637519j785457
$$ 648989618 648497522 648039699 647697628 647333860 646691084 645609319 644151986 642514467 640729010
1360.4F40729010j974404k141177k460421k762734k549768k192974k044857k049744
$$ 640729010 638754606 636613429 634153008 631390274 628840506 626647532 624602675 622552931
1376.7F22552931k421677k977252l149867k622783j557469m58479r8050m75824p43031
$$ 622552931 620131254 617154002 614004135 611381352 609823883 609365404 609267354 608791530 608048499
1395.1F08048499l68417K19524O60300P71821P89344R37462J087308J287282J421332
$$ 608048499 607680082 607899606 608559906 609331727 610121071 611058533 612145841 613433123 614854455
1413.4F14854455J260936J036227J349688J839876J972139J931727J488089P42376
$$ 614854455 616115391 617151618 618501306 620341182 622313321 624245048 625733137 626475513
1429.7F26475513J46985l35813p39634l59654L21865L16620M5776m8935J20521L47614
$$ 626475513 626622498 626286685 625547051 625187397 625509262 625825882 625871658 625822723 625943244 626290858
1450.1F26290858K26259m7326J68979J549304K563893K413750K336204K733112L115117
$$ 626290858 626517117 626469791 626638770 628188074 630751967 633165717 635501921 638235033 641350150
1468.5F41350150L739178N313158O414771N887509M662394L210247J878619O52909
$$ 641350150 645089328 650402486 656817257 662704766 667367160 670577407 672456026 673108935
1484.8F73108935n31852j587212k210855k530218l524303m656911m310012l568888
$$ 673108935 672577083 670989871 668779016 666248798 662724495 658067584 653757572 650188684
1501.1F50188684l825068n860031q347988o753325n287886n448401n171537m067064
$$ 650188684 646363616 640503585 632155597 625402272 620114386 614665985 609494448 605427384
1517.4F05427384k758085k288103j946927j743078j912892j867234k125502k336383
$$ 605427384 602669299 600381196 598434269 596691191 594778299 592911065 590785563 588449180
1533.7E88449180j646280j366377j649201o74903N74171J133681J548945K093256K643526
$$ 588449180 586802900 585436523 583787322 583112419 583686590 584820271 586369216 588462472 591105998
1552.1E91105998K831816K547205K893030M462481M163146L274143K793073K272785
$$ 591105998 593937814 596485019 599378049 603840530 608003676 611277819 614070892 616343677
1568.4F16343677K082765J831591J362324J304746J318216P11322m5478m04418n43654
$$ 616343677 618426442 620258033 621620357 622925103 624243319 624954641 624909163 624504745 623961091
1586.8F23961091p99715j390875k136648k823770l273367l626526m188418m910529
$$ 623961091 623161376 621770501 619633853 616810083 613536716 609910190 605721772 600811243
1603.1F00811243n652785o416381p167756p457495p473409q554757j0085761q949459
$$ 600811243 595158458 588742077 581574321 574116826 566643417 558088660 548002899 539053440
1619.4E39053440q526802r935617r767354r037375q748532p819295p412076p390707
$$ 539053440 530526638 520591021 510823667 501786292 493037760 485218465 477806389 470415682
1635.7D70415682m634530j693427m94004P6205P07149J813263K234489K458155L949344
$$ 470415682 465781152 464087725 463593721 463669926 464377075 466190338 468424827 470882982 474832326
1654.1D74832326M476428M181266M619718N712151O618589O325662O471336P395208
$$ 474832326 479308754 483490020 488109738 493821889 500440478 506766140 513237476 520632684
1670.4E20632684P242859P407724Q095384P624567O913304P330656R571433R863734
$$ 520632684 527875543 535283267 543378651 551003218 557916522 565247178 574818611 584682345
1686.7E84682345Q840800R317457R414375J0595858J1998535J2013435J3168573J1234939
$$ 584682345 593523145 602840602 612254977 622850835 634849370 646862805 660031378 671266317
1703F71266317Q903802Q442700P294059O003379M976750M273712M340113M434645L729462
$$ 671266317 680170119 688612819 695906878 701910257 706887007 711160719 715500832 719935477 723664939
1721.4G23664939K996147K607107K151013J712918J310170J341879J997709K071262
$$ 723664939 726661086 729268193 731419206 733132124 734442294 735784173 737781882 739853144
1737.7G39853144J974404K309799K668440K832711K978682L473342M168093M051089
$$ 739853144 741827548 744137347 746805787 749638498 752617180 756090522 760258615 764309704
1754G64309704L658891L531635L294170L288269L290713K954363K609551K291799K310395
$$ 764309704 767968595 771500230 774794400 778082669 781373382 784327745 786937296 789229095 791539490
1772.4G91539490K588988K371430J992464J815498J667499J448811J297295J099825
$$ 791539490 794128478 796499908 798492372 800307870 801975369 803424180 804721475 805821300
1788.7H05821300Q99851J198232J491606J194418Q26657R16659J244247J269639R78053
$$ 805821300 806721151 807919383 809410989 810605407 811432064 812348723 813592970 814862609 815840662
1807H15840662O74724O66201Q64208R76026R44674Q28505N64456L40402M66227O71983
$$ 815840662 816515386 817181587 818045795 819021821 819966495 820795000 821359456 821699858 822166085 822838068
1827.4H22838068P35521Q87096Q06093M72725M22180N46515M07099K19584M48584O40929
$$ 822838068 823573589 824460685 825266778 825739503 826161683 826708198 827115297 827334881 827783465 828424394
1847.8H28424394N84781N61655N48780M59432K64764J54317K22265K86460J91331J73748
$$ 828424394 829009175 829570830 830119610 830579042 830843806 830998123 831220388 831506848 831698179 831871927
1868.2H31871927M11689N01216L63826L37065M31358M14491K61843J44899J19925J66237
$$ 831871927 832283616 832784832 833148658 833485723 833917081 834331572 834593415 834738314 834858239 835024476
1888.6H35024476L87192N13732L26753J41442J35123K35856L15607K80857J61409P0274
$$ 835024476 835411668 835925400 836252153 836393595 836528718 836764574 837080181 837361038 837522447 837592721
1909H37592721P3910J39057J53423J22189J67907J32620P0989J92106K86758K51353
$$ 837592721 837666631 837805688 837959111 838081300 838249207 838381827 838452816 838644922 838931680 839183033
1929.4H39183033J40428l040m4405M3869Q6307O4075J28925J48058M5061K8312J23442
$$ 839183033 839323461 839320421 839276016 839319885 839406192 839470267 839599192 839747250 839792311 839820623 839944065
1951.9H39944065J84655J46389O0797K9027N0604O9321Q1598J15514J02759L8862L9935
$$ 839944065 840128720 840275109 840335906 840364933 840415537 840484858 840566456 840681970 840784729 840823591 840863526
1974.3H40863526R8169J29580Q8513K0087j7345P75K5689j788R299O6697M1187j0133
$$ 840863526 840961695 841091275 841179788 841199875 841182530 841183305 841208994 841207206 841216505 841283202 841324389 841314256
1998.8H41314256J5140J7822l4869p0155p6830r7871j29759j36435j14680q7022q8394
$$ 841314256 841329396 841347218 841312349 841242194 841165364 841067493 840937734 840801299 840686619 840599597 840511203
2021.2H40511203j01090j36614j89721j86801j23143q6963j01567j52528k10226j60575
$$ 840511203 840410113 840273499 840083778 839896977 839773834 839686871 839585304 839432776 839222550 839061975
2041.6H39061975m8875j8657m1365o0380o7532k4557M1127Q0109M2796o8009j00016
$$ 839061975 839013100 838994443 838953078 838892698 838825166 838800609 838841736 838921845 838964641 838896632 838796616
2064H38796616J8656J67489K12490J33396o259q5890k7061J19388J90795J20997O080
$$ 838796616 838815272 838982761 839195251 839328647 839322388 839236498 839209437 839328825 839519620 839640617 839646697
2086.5H39646697o2764k861J36912K06411J50442L6836n245P6174J90020K33591J47700
$$ 839646697 839583933 839581072 839717984 839924395 840074837 840111673 840106428 840182602 840372622 840606213 840753913
2108.9H40753913k0742p0394M4048J63913J80423J17004K2054m4584J4901J44958J65224
$$ 840753913 840733171 840662777 840706825 840870738 841051161 841168165 841190219 841145635 841160536 841305494 841470718
2131.3H41470718P9215J4842m113L6895J26779J74821J36256N2213J908M1604J24454
$$ 841470718 841549933 841564775 841560662 841597557 841724336 841899157 842035413 842087626 842089534 842131138 842255592
2153.8H42255592J53363J33157J09374R9957J25945J83403K41936K71439K33114J68324
$$ 842255592 842408955 842542112 842651486 842751443 842877388 843060791 843302727 843574166 843807280 843975604
2174.2H43975604J64449J95801K38955K88546K67863J71423J14799J65701K45392K54035
$$ 843975604 844140053 844335854 844574809 844863355 845131218 845302641 845417440 845583141 845828533 846082568
2194.6H46082568K08318J71602J51217J60754K17974K38478J74403J16051J28746J77204
$$ 846082568 846290886 846462488 846613705 846774459 846992433 847230911 847405314 847521365 847650111 847827315
2215H47827315J99318K01226J90913J31071P2837Q5890J47581J84715J53243O2466
$$ 847827315 848026633 848227859 848418772 848549843 848622680 848708570 848856151 849040866 849194109 849256575
2235.4H49256575k6405j1265Q4221J46270J31786N4538M649M2081P6115P8857R5725
$$ 849256575 849230170 849218905 849303126 849449396 849581182 849635720 849640369 849682450 849758565 849837422 849933147
2257.8H49933147N7757m5001q3149K1041J57118J62899O1453k3544m2618K98P3016
$$ 849933147 849990904 849945903 849862754 849883795 850040913 850203812 850265265 850241721 850199103 850199401 850272417
2280.2H50272417J10507N6446p8440j72079j33335l0399J848j03772k20358k26200
$$ 850272417 850382924 850439370 850360930 850188851 850055516 850025117 850026965 849923193 849702835 849476635
2300.6H49476635j82688j63197j61767k09272k88129k87175k23041k34365l39985l67046
$$ 849476635 849293947 849130750 848968983 848759711 848471582 848184407 847961366 847727001 847387016 847019970
2321H47019970k75969k80976l74914l26991j82330j82987l14950l49641k69771j38521
$$ 847019970 846744001 846463025 846088111 845761120 845578790 845395803 845080853 844731212 844461441 844322920
2341.4H44322920J05262L05473K22326j19031n08487p24554o84738n42224m19497k86102
$$ 844322920 844428182 844733655 844955981 844836950 844328463 843603909 842919171 842376947 841957450 841671348
2361.8H41671348j10448J24097L62218N04434M93526L58939K92659L80635M70579L98338
$$ 841671348 841560900 841684997 842047215 842551649 843045175 843404114 843696773 844077408 844547987 844946325
2382.2H44946325J78754o8366j90735j51336r2328j16348k05994k98500l19302k43068
$$ 844946325 845125079 845056713 844865978 844714642 844622314 844505966 844299972 844001472 843682170 843439102
2402.6H43439102j58191j77145k96592m08709m27783l44932k14517j79708k98321m42684
$$ 843439102 843280911 843103766 842807174 842398465 841970682 841625750 841411233 841231525 840933204 840490520
2423H40490520m95255m08828k55406k16663l37303m85658n21064m27365l03209k68817
$$ 840490520 839995265 839586437 839331031 839114368 838777065 838291407 837770343 837342978 837039769 836770952
2443.4H36770952l64125n05924n49555m40002k77221k08497l14236m86493n33700m36365
$$ 836770952 836406827 835900903 835351348 834911346 834634125 834425628 834111392 833624899 833091199 832654834
2463.8H32654834l18468k80440l50237m61280m83811l82483k56479k50160l81351n09262
$$ 832654834 832336366 832055926 831705689 831244409 830760598 830378115 830121636 829871476 829490125 828980863
2484.2H28980863n02884l71754k59996k68280l58642m27663m21286l52442k64585k33114
$$ 828980863 828477979 828106225 827846229 827577949 827219307 826791644 826370358 826017916 825753331 825520217
2504.6H25520217l11791m26233m46558l66569k70963k35796l04281m15623m39167l67225
$$ 825520217 825208426 824782193 824335635 823969066 823698103 823462307 823158026 822742403 822303236 821936011
2525H21936011k94625l05117m12941n07950n03183m08828l39389l97265m87447m97043
$$ 821936011 821641386 821336269 820923328 820415378 819912195 819503367 819163978 818766713 818279266 817782223
2545.4H17782223m49538l98099l50893l38078l84747m33684m50492m24564l59118l46005
$$ 817782223 817332685 816934586 816583693 816245615 815860868 815427184 814976692 814552128 814193010 813847005
2565.8H13847005m05013m31478m08530m00603m08531l86416l68834m09067m43697m22239
$$ 813847005 813441992 813010514 812601984 812201381 811792850 811406434 811037600 810628533 810184836 809762597
2586.2H09762597m02152m22776m25577l74973l61860l93867l80576l79086m36663m81665
$$ 809762597 809360445 808937669 808512092 808137119 807775259 807381392 807000816 806621730 806185067 805703402
2606.6H05703402m94719n04076n26190n64158n80490n62966n82933o39022o64174o64890
$$ 805703402 805208683 804704607 804178417 803614259 803033769 802470803 801887870 801248848 800584674 799919784
2626.9G99919784o50108o37293o63578p17640p64370p60555o92010o34671o57498p16269
$$ 799919784 799269676 798632383 797968805 797251165 796486795 795726240 795034230 794399559 793742061 793025792
2647.3G93025792p48098p42078p04646o52671o40333p05003p51734p20203o76096o42478
$$ 793025792 792277694 791535616 790830970 790178299 789537966 788832963 788081229 787361026 786684930 786042452
2667.7G86042452o15358o22333o73115o92427o24537n74649o15179o54936o36935o15538
$$ 786042452 785427094 784804761 784131646 783439219 782814682 782240033 781624854 780969918 780332983 779717445
2688.1G79717445o09219o05642o14465o43492o88314p15196p02322o85393p15614p72416
$$ 779717445 779108226 778502584 777888119 777244627 776556313 775841117 775138795 774453402 773737788 772965372
2708.5G72965372p93279p63774p43210p74920p93814p50602p02560o88851o92248p04646
$$ 772965372 772172093 771408319 770665109 769890189 769096375 768345773 767643213 766954362 766262114 765557468
2728.9G65557468p18594p20441o85692o41584o41227o44565o28888o07133n69344n54740
$$ 765557468 764838874 764118433 763432741 762791157 762149930 761505365 760876477 760269344 759700000 759145260
2749.3G59145260n96047o52432o70791o35981n84543n70893n99981o36458o53267o45339
$$ 759145260 758549213 757896781 757225990 756590009 756005466 755434573 754834592 754198134 753544867 752899528
2769.7G52899528o25074o36697p14839q03709q27193p90775p78436q27730r03905r63270
$$ 752899528 752274454 751637757 750922918 750119209 749292016 748501241 747722805 746895075 745991170 745027900
2790.1G45027900r88066r81808r37402r42231j058936j168072j180887j163781j167178
$$ 745027900 744039834 743058026 742120624 741178393 740119457 738951385 737770498 736606717 735439539
2808.5G35439539j186729j255989j357257j423180j418054j390577j441597j565695
$$ 735439539 734252810 732996821 731639564 730216384 728798330 727407753 725966156 724400461
2824.8G24400461j696050j771570j787305j845181k016663k314806k734184l203810
$$ 724400461 722704411 720932841 719145536 717300355 715283692 712968886 710234702 707030892
2841.1G07030892l654778m089295m498899m679740m329801l403842k229214j284301
$$ 707030892 703376114 699286819 694787920 690108180 685778379 682374537 680145323 678861022
2857.4F78861022r25243j191854j760006k300322k683401k771259k513409k135276
$$ 678861022 677935779 676743925 674983919 672683597 670000196 667228937 664715528 662580252
2873.7F62580252j782060j363158r38595p15017p49230r00448j033783j134812j204491
$$ 662580252 660798192 659435034 658496439 657781422 657032192 656131744 655097961 653963149 652758658
2892.1F52758658j271963j430571j698137j937151k057611k186060k454401k845466
$$ 652758658 651486695 650056124 648357987 646420836 644363225 642177165 639722764 636877298
2908.4F36877298l314793l828048m318655m589677m458785l975212l229619k300083
$$ 636877298 633562505 629734457 625415802 620826125 616367340 612392128 609162509 606862426
2924.7F06862426j266539j99914P44343J530349K256095K884925L318905L553391L523111
$$ 606862426 605595887 605395973 606140316 607670665 609926760 612811685 616130590 619683981 623207092
2943.1F23207092L111124K408266J694024J151025P91133O66141Q49128J262903J781047
$$ 623207092 626318216 628726482 630420506 631571531 632362664 633028805 633877933 635140836 636921883
2961.4F36921883K319634K862572L370762L714681L899932L982603L937125L856957
$$ 636921883 639241517 642104089 645474851 649189532 653089464 657072067 661009192 664866149
2977.8F64866149L762186L487647L052592K622664K271712K015292J740992J352668
$$ 664866149 668628335 672115982 675168574 677791238 680062950 682078242 683819234 685171902
2994.1F85171902R16243M36842j1801l08157n15878o69718p59601q00073q20875q72016
$$ 685171902 686088145 686524987 686513186 686205029 685689151 685019433 684259832 683459759 682638884 681766868
3014.5F81766868r08614r66012j131296j316309j433015j484096j478255j452386j448274
$$ 681766868 680858254 679892242 678760946 677444637 676011622 674527526 673049271 671596885 670148611
3032.8F70148611j496553j598299j660943j645565j660705j753926j841724j862049
$$ 670148611 668652058 667053759 665392816 663747251 662086546 660332620 658490896 656628847
3049.1F56628847j847565j839459j838863j835048j800954j735628j653671j540840
$$ 656628847 654781282 652941823 651102960 649267912 647466958 645731330 644077659 642536819
3065.5F42536819j429617j378417j352132j295686j202702j135528j146078j137138
$$ 642536819 641107202 639728785 638376653 637080967 635878265 634742737 633596659 632459521
3081.8F32459521j081526j071632j064300r94683r47356r59516r42707q81970q83042
$$ 632459521 631377995 630306363 629242063 628247380 627300024 626340508 625397801 624515831 623632789
3100.1F23632789r77993j054407j056909j073182j149475j185298j167894j188218
$$ 623632789 622654796 621600389 620543480 619470298 618320823 617135525 615967631 614779413
3116.4F14779413j227975j333654j504242j546681j476169j482487j538634j540065
$$ 614779413 613551438 612217784 610713542 609166861 607690692 606208205 604669571 603129506
3132.8F03129506j516938j513779j579225j729548j808644j760065j702607j668274
$$ 603129506 601612568 600098789 598519564 596790016 594981372 593221307 591518700 589850426
3149.1E89850426j669050j744210j853705j875102j809776j794219j853407j896560
$$ 589850426 588181376 586437166 584583461 582708359 580898583 579104364 577250957 575354397
3165.4E75354397j900732j888752j857937j872122j945197j977146j913190j854837
$$ 575354397 573453665 571564913 569706976 567834854 565889657 563912511 561999321 560144484
3181.7E60144484j885831j909256j883447j873613j873493j846850j827300j849412
$$ 560144484 558258653 556349397 554465950 552592337 550718844 548871994 547044694 545195282
3198E45195282j851559j795769j745164j705289j654983j623571j662910j740753j734913
$$ 545195282 543343723 541547954 539802790 538097501 536442518 534818947 533156037 531415284 529680371
3216.4E29680371j659333j613021j636446j702607j745641j725435j662910j659274
$$ 529680371 528021038 526408017 524771571 523068964 521323323 519597888 517934978 516275704
3232.7E16275704j781106j927614j980067j976549j953304j920760j967966k102435
$$ 516275704 514494598 512566984 510586917 508610368 506657064 504736304 502768338 500665903
3249E00665903k156645k094090k072960k115250k136022k130240k100944k053201j977623
$$ 500665903 498509258 496415168 494342208 492226958 490090936 487960696 485859752 483806551 481828928
3267.4D81828928j819283j712709j728327j696944j568168j403898j286775j200497
$$ 481828928 480009645 478296936 476568609 474871665 473303497 471899599 470612824 469412327
3283.7D69412327j076728r79394r23634q40336p41243o83129o63221o45429o09100
$$ 469412327 468335599 467356205 466432571 465592235 464850992 464167863 463504642 462859213 462250113
3302D62250113n25206m60505n20796o17206o28591n99712n98371n77390n05388n08010
$$ 462250113 461724907 461264402 460743606 460126400 459497809 458898097 458299726 457722336 457216948 456708938
3322.4D56708938o09428p32899q19712p92325p30485p48813q18699q97497r79096j036167
$$ 456708938 456099510 455366611 454546899 453754574 453024089 452275276 451456577 450559080 449579984 448543817
3342.8D48543817j072705j090199j079976j140595j270652j309067j246988j215995
$$ 448543817 447471112 446380913 445300937 444160342 442889690 441580623 440333635 439117640
3359.1D39117640j248926j262188j193195j149535j253486j425177j461625j305342
$$ 439117640 437868714 436606526 435413331 434263796 433010310 431585133 430123508 428818166
3375.5D28818166j153707j125574j136780j062036r32127p95811o45340o65456q64446
$$ 428818166 427664459 426538885 425402105 424340069 423407942 422612131 421966791 421301335 420436889
3393.8D20436889q92967o17832m01497n89967q50200p11859m53293l89755l79711l56942
$$ 420436889 419543922 418926090 418524593 417934626 417084426 416372567 415919274 415529519 415149808 414792866
3414.2D14792866l22760k23964j21147n4717O6221K52962M28319M80265N27739O78480
$$ 414792866 414470106 414246142 414124995 414070278 414136499 414389461 414817780 415298045 415825784 416504264
3434.6D16504264O44296M23402M28945O89685R19372J000374R90808J058519J211614
$$ 416504264 417148560 417571962 418000907 418690592 419609964 420610338 421601146 422659665 423871279
3453D23871279J333236J400531J428216J384646J421929J688391J878231J662642J293689
$$ 423871279 425204515 426605046 428033262 429417908 430839837 432528228 434406459 436069101 437362790
3471.3D37362790J294643J608312J885235J912803J720726J699746J894235J909048
$$ 437362790 438657433 440265745 442150980 444063783 445784509 447484255 449378490 451287538
3487.6D51287538J823216J919628K023458K022833J999199K028674K033949J909047
$$ 451287538 453110754 455030382 457053840 459076673 461075872 463104546 465138495 467047542
3504D67047542J837790J957447K124160K244830K257556K134532K091557K221673K381236
$$ 467047542 468885332 470842779 472966939 475211769 477469325 479603857 481695414 483917087 486298323
3522.3D86298323K310544K127349K200067K427966K590567K687841K641201K516389
$$ 486298323 488608867 490736216 492936283 495364249 497954816 500642657 503283858 505800247
3538.6E05800247K574682K694607K711237K645492K647400K741993K814889K909243
$$ 505800247 508374929 511069536 513780773 516426265 519073665 521815658 524630547 527539790
3554.9E27539790L009796L070414L036499K838552K718091L169000L794849L738582
$$ 527539790 530549586 533620000 536656499 539495051 542213142 545382142 549176991 552915573
3571.3E52915573L399551L408909L649652L860295L927052L755569L480435L496646
$$ 552915573 556315124 559724033 563373685 567233980 571161032 574916601 578397036 581893682
3587.6E81893682L885627M010141L920376L986836M096687M109144M078865L978968
$$ 581893682 585779309 589789450 593709826 597696662 601793349 605902493 609981358 613960326
3603.9F13960326L753066L726542L927290L995776L987253L882170L817260M153192
$$ 613960326 617713392 621439934 625367224 629363000 633350253 637232423 641049683 645202875
3620.2F45202875M244745L738820L131330L087044L893137M185498L850341L574014
$$ 645202875 649447620 653186440 656317770 659404814 663297951 667483449 671333790 674907804
3636.5F74907804L391563L281713L133416K769590K336978K485097L309846L509939
$$ 674907804 678299367 681581080 684714496 687484086 689821064 692306161 695616007 699125946
3652.8F99125946L045260K942920L068924K727568K319694K199113J894534J512766
$$ 699125946 702171206 705114126 708183050 710910618 713230312 715429425 717323959 718836725
3669.2G18836725J786947J903832J575291K069950K562762K312362J976490J673043
$$ 718836725 720623672 722527504 724102795 726172745 728735507 731047869 733024359 734697402
3685.5G34697402J357615J299381J662135J880288J661956J295090R99093R83775J280427
$$ 734697402 736055017 737354398 739016533 740896821 742558777 743853867 744852960 745836735 747117162
3703.8G47117162J279592Q06392L93390O66738J399994J432120R29475N92530M96328
$$ 747117162 748396754 749203146 749596536 750263274 751663268 753095388 754024863 754617393 755113721
3722.2G55113721N57005P73490R38177O54757K06351K51830Q17478J212537R29236
$$ 755113721 755670726 756444216 757382393 758037150 758243501 758495331 759312809 760525346 761454582
3740.5G61454582J12117k21074N82576P31766L78132R21786J352071R42946M97877
$$ 761454582 761566699 761345625 761928201 762659967 763038099 763959885 765311956 766254902 766752779
3758.9G66752779O20604P59602N47707M11331L73721N12660P27773O42121M48107L60608
$$ 766752779 767373383 768132985 768680692 769092023 769465744 769978404 770706177 771348298 771796405 772157013
3779.3G72157013M25041M51923M33623N15282N23627M06623J71781o4016K6346P7068
$$ 772157013 772582054 773033977 773467600 773982882 774506509 774913132 775084913 775020897 775047243 775124311
3799.7G75124311J20223N99206O19471N24282P64370N51879m2080l24369j5438J11700
$$ 775124311 775244534 775843740 776463211 776987493 777751863 778303742 778261662 777937293 777921855 778033555
3820.1G78033555L76641Q40783O38485L19899J64091R5964K04205J2636j95205K57909
$$ 778033555 778410196 779250979 779889464 780209363 780373454 780469418 780673623 780686259 780491054 780748963
3840.5G80748963O79970P45177N67615J23442m96507r35018O8843J243055R11057K27392
$$ 780748963 781428933 782174110 782741725 782865167 782368660 781433642 781502485 782745540 783656597 783883989
3860.9G83883989m3094J03533J89424m5538P5280M41969M88579L77178L6478J2994
$$ 783883989 783840895 783944428 784133852 784088314 784163594 784605563 785094142 785471320 785507798 785520792
3881.3G85520792L09289K20716K08616J74284L6061K89976L65734p8380m45485k72870
$$ 785520792 785830081 786050797 786259413 786433697 786469758 786759734 787125468 787047088 786601603 786328733
3901.7G86328733K15173O21855P07507M57883J54018l5584j14798j9968J29342J18673
$$ 786328733 786543906 787165761 787873268 788331151 788485169 788449585 788334787 788314819 788444161 788562834
3922.1G88562834P0513J35898J45316L5882M5717J92821K08318J42098J09434M4465
$$ 788562834 788633347 788769245 788914561 788950443 788996160 789188981 789397299 789539397 789648831 789693296
3942.5G89693296M0531O8426O6102J35243K19702J89543O0082K7716J05858J59859
$$ 789693296 789733827 789802253 789868355 790003598 790223300 790412843 790472925 790500641 790606499 790766358
3962.9G90766358J70887J34110M8578m2438k8432J05381J85251J38522R0420R2268
$$ 790766358 790937245 791071355 791119933 791077495 791049063 791154444 791339695 791478217 791568637 791660905
3983.2G91660905Q2910O1929O0737O1810M7505L6180M1187
$$ 791660905 791743815 791805744 791866481 791928291 791975796 792011976 792053163
3997.5G92053163
$$ 792053163
##END=$$ End of the data block
