##TITLE=G18-51-SE $$ Begin of the data block
##JCAMP-DX=5.00 $$ ACD/SpecManager v 10.08
##SPECTROMETER/DATA SYSTEM=Alpha
##DATE=23 Oct 2013 10:11:40
##DATA TYPE=INFRARED SPECTRUM
##DATA CLASS=XYDATA
##ORIGIN=
##OWNER=
##NPOINTS=1765
##FIRSTX=399.75695801
##LASTX=3997.56933594
##MAXX=3997.56933594
##MINX=399.75695801
##MAXY=0.85206121
##MINY=0.41267490
##XFACTOR=1.0000000000
##YFACTOR=1.000000000000000e-9
##FIRSTY=0.66016144
##DELTAX=2.03957629
##XUNITS=1/CM
##YUNITS=ARBITRARY UNITS
##XYDATA=(X++(Y..Y))
$$ plain form
399.8 660161436 659331143 658577383 657505453 656636059 656533003 657056689 657503247 657328188 656267643
418.1 656267643 654704988 653585017 653097391 652718186 651803493 650298953 648542702 647078693 646471500
436.5 646471500 646907568 648035288 649291515 650198042 650608361 650841117 651084840 651084244 650533080 649308205
456.9 649308205 647694826 646339417 645202339 643735707 641827226 639712274 637608171 636006355
473.2 636006355 635208786 634594917 633690596 632666767 631774485 631289363 631228149 631007493 629990578 628321588
493.6 628321588 626597166 625116348 623882651 622609675 620847702 618493676 616127253 614336014
509.9 614336014 612856984 611171842 609084964 606678784 604507446 603136301 602646589 602766454 602936029
528.3 602936029 602926195 603195667 604219019 606020391 608273685 610321224 611551046 612035692 612238109
$$ packed form
399.8F60161436q30293p53760j071930q69394j03056N23686M46558j75059j060545
418.1F56267643j562655j119971m87626l79205r14693j504540j756251j464009o07193
436.5F46471500M36068J127720J256227R06527M10319K32756K43723n96n51164j224875
456.9F49308205j613379j355409j137078j466632j908481k114952k104103j601816
473.2F36006355p97569o13869r04321j023829q92282m85122o1214k20656j016915j668990
493.6F28321588j724422j480818j233697j272976j761973k354026k366423j791239
509.9F14336014j479030j685142k086878k406180k171338j371145m89712J19865J69575
528.3F02936029r834K69472J023352J801372K253294K047539J229822M84646K02417
$$ plain form
546.6 612238109 612367213 612290621 611666262 610399485 608865857 607507110 606456995 605291545 603520155
565 603520155 601206601 598904610 597453117 597301781 598042727 599070907 600238740 601815343 604122877
583.3 604122877 606929481 609474897 611122727 611799300 611922622 612045527 612493098 613106370 613444686
601.7 613444686 613382161 613226831 613291740 613671243 614273250 614865899 615330219 615970910 617182612 619087219
622.1 619087219 621484876 623887420 626018465 627944291 629751027 631472945 633183837 634729505
638.4 634729505 635899961 636818707 637771606 638903677 640065312 641038299 641709030 642049670 642247975
656.7 642247975 642662942 643374801 644152641 644744396 644913554 645132601 646266401 647752523 649175823
675.1 649175823 650475681 651619911 652571559 653536618 654759824 656043589 656800687 656699419 656001806
$$ packed form
546.6F12238109J29104p6592o24359j266777j533628j358747j050115j165450j771390
565F03520155k313554k301991j451493j51336P40946J028180J167833J576603K307534
583.3F04122877K806604K545416J647830O76573J23322J22905M47571O13272L38316
601.7F13444686o2525j55330O4909L79503O02007N92649M64320O40691J211702J904607
622.1F19087219K397657K402544K131045J925826J806736J721918J710892J545668
638.4F34729505J170456R18746R52899J132071J161635R72987O70731L40640J98305
656.7F42247975M14967P11859P77840N91755J69158K19047J133800J486122J423300
675.1F49175823J299858J144230R51648R65059J223206J283765P57098j01268o97613
$$ plain form
693.5 656001806 655205727 654750705 654894948 655371606 655790567 656270981 657308757 659162939 661579311
711.8 661579311 664150298 666523814 668663442 671108067 674392641 678291261 682055533 685002804
728.1 685002804 687082529 688917160 691005230 693207920 694935262 695666194 695522189 695287704 695573688
746.5 695573688 696164370 696273148 695500195 694133222 692769110 692045927 692056596 692276299 692387044 692776978
766.9 692776978 694170535 696914732 700613558 704525650 708061039 711013854 713742018 716669381
783.2 716669381 719607472 721995294 723555684 724521041 725509584 727106512 729354501 731764257 733855486
801.6 733855486 735502779 737048984 738931477 740977347 742590129 743307531 743180752 742821813 742726505
819.9 742726505 742722571 742274225 741070807 739270806 737280369 735494316 734095275 732771039 731066704
$$ packed form
693.5F56001806p96079m55022J44243M76658M18961M80414J037776J854182K416372
711.8F61579311K570987K373516K139628K444625L284574L898620L764272K947271
728.1F85002804K079725J834631K088070K202690J727342P30932j44005k34485K85984
746.5F95573688N90682J08778p72953j366973j364112p23183J0669K19703J10745L89934
766.9F92776978J393557K744197L698826L912092L535389K952815K728164K927363
783.2G16669381K938091K387822J560390R65357R88543J596928K247989K409756K091229
801.6G33855486J647293J546205J882493K045870J612782P17402j26779l58939r5308
819.9G42726505l934m48346j203418j800001j990437j786053j399041j324236j704335
$$ plain form
838.3 731066704 729023993 727108419 725619376 724493682 723612487 722871661 722070634 721128285 720319450
856.6 720319450 720160306 721143663 723422587 726640880 730267107 734072387 737976730 741622329 744330883
875 744330883 745499671 745121360 743657649 741574645 739133656 736307442 732947588 729115486 725267351
893.3 725267351 721966982 719280243 716698408 713590145 709618986 705004752 700341761 695931315
909.6 695931315 691508293 686762393 681841552 677338898 673959672 672058225 671283305 670798659 670009375
928 670009375 669032156 668437064 668486655 668843627 668943346 668373764 667090356 665108740 662076414 657525063
948.4 657525063 651335955 643808901 635531127 627212763 619273424 611604035 603784978 595526814
964.7 595526814 587075412 579101503 572126389 566188097 561068237 556639194 553011298 550468862
$$ packed form
838.3G31066704k042711j915574j489043j125694q81195p40826q01027r42349q08835
856.6G20319450j59144R83357K278924L218293L626227L805280L904343L645599K708554
875G44330883J168788l78311j463711k083004k440989k826214l359854l832102l848135
893.3G25267351l300369k686739k581835l108263l971159m614234m662991m410446
909.6F95931315m423022m745900m920841m502654l379226j901447p74920m84646p89284
928F70009375r77219n95092M9591L56972R9719n69582j283408j981616l032326m551351
948.4F57525063o189108p527054q277774q318364p939339p669389p819057q258164
964.7E95526814q451402p973909o975114n938292n119860m429043l627896k542436
$$ plain form
981 550468862 549104989 548549652 548187435 547562420 546666145 545816302 545308471 545260370 545482337 545579493
1001.4 545579493 545395792 545073092 544669271 544075608 543148696 541810811 540188849 538600385 537297368
1019.8 537297368 536234498 535143793 533738613 531940937 530007303 528267920 526774585 525266588
1036.1 525266588 523483157 521463215 519456804 517701864 516319394 515324831 514669120 514324546 514420331
1054.5 514420331 515123487 516413093 518130839 520105958 522134602 523877561 524806738 524563313 523458958
1072.8 523458958 522327483 521870494 522385538 523974955 526560962 529811382 533291161 536682010 539878666
1091.2 539878666 542908490 545759380 548295677 550320983 551723897 552658677 553504646 554634154 556222081
1109.5 556222081 558191001 560334861 562474430 564475715 566276670 567903697 569418788 570930243
$$ packed form
981E50468862j363873n55337l62217o25015q96275q49843n07831m8101K21967R7156
1001.4E45579493j83701l22700m03821n93663r26912j337885j621962j588464j303017
1019.8E37297368j062870j090705j405180j797676j933634j739383j493335j507997
1036.1E25266588j783431k019942k006411j754940j382470r94563o55711l44574R5785
1054.5E14420331P03156J289606J717746J975119K028644J742959R29177k43425j104355
1072.8E23458958j131475m56989N15044J589417K586007L250420L479779L390849L196656
1091.2E39878666L029824K850890K536297K025306J402914R34780Q45969J129508J587927
1109.5E56222081J968920K143860K139569K001285J800955J627027J515091J511455
$$ plain form
1125.8 570930243 572638631 574770153 577281654 579826713 582038283 583633184 584448040 584542990 584154546
1144.2 584154546 583546162 582948267 582476974 582131624 581976473 582199395 583007932 584546983 586778760
1162.6 586778760 589472234 592397928 595519483 599032164 603190064 608013809 613221169 618535340
1178.9 618535340 623805702 628940403 633946240 638770282 643097460 646524072 648880720 650283635
1195.2 650283635 651007891 651343822 651405334 651121557 650545180 649964154 649684727 649818778 650198579 650472462
1215.6 650472462 650397599 650023758 649520397 648959279 648249328 647231102 645835340 644240141 642813563
1233.9 642813563 641820073 641271830 641009152 640907705 641038358 641635299 642875254 644626558 646494269
1252.3 646494269 648172617 649642467 651097238 652729869 654524684 656284392 657829821 659167707
$$ packed form
1125.8E70930243J708388K131522K511501K545059K211570J594901Q14856R4950l88444
1144.2E84154546o08384n97895m71293l45350j55151K22922Q08537J539051K231777
1162.6E86778760K693474K925694L121555L512681M157900M823745N207360N314171
1178.9F18535340N270362N134701N005837M824042M327178L426612K356648J402915
1195.2F50283635P24256L35931O1512k83777n76377n81026k79427J34051L79801K73883
1215.6F50472462p4863l73841n03361n61118p09951j018226j395762j595199j426578
1233.9F42813563r93490n48243k62678j01447J30653N96941J239955J751304J867711
1252.3F46494269J678348J469850J454771J632631J794815J759708J545429J337886
$$ plain form
1268.6 659167707 660465419 661854148 663256586 664461136 665259838 665688872 666094959 666778624 667762220
1287 667762220 668782175 669453144 669545949 669138730 668501318 667840660 667084932 665980458 664458096 662786067
1307.4 662786067 661354125 660371244 659806550 659436524 659110963 658944905 659055293 659285247 659236610 658508778
1327.8 658508778 657011509 655061185 653157949 651662052 650611341 649867833 649266541 648706138 648225546
1346.1 648225546 647863090 647486567 646857142 645793259 644338071 642717421 641014218 639108121 636894703
1364.5 636894703 634306669 631487429 628967464 626842201 624804378 622700632 620253384 617268980
1380.8 617268980 614131093 611586094 610075831 609553337 609433472 609061360 608431220 608098805 608307242
1399.1 608307242 608941972 609715402 610502243 611417472 612548470 613900363 615341485 616688371 617883205
$$ packed form
1268.6F59167707J297712J388729J402438J204550P98702M29034M06087O83665R83596
1287F67762220J019955O70969R2805m07219o37412o60658p55728j104474j522362j672029
1307.4F62786067j431942r82881n64694l70026l25561j66058J10388K29954m8637p27832
1327.8F58508778j497269j950324j903236j495897j050711p43508o01292n60403m80592
1346.1F48225546l62456l76523o29425j063883j455188j620650j703203j906097k213418
1364.5F36894703k588034k819240k519965k125263k037823k103746k447248k984404
1380.8F17268980l137887k544999j510263n22494j19865l72112o30140l32415K08437
1399.1F08307242O34730P73430P86841R15229J130998J351893J441122J346886J194834
$$ plain form
1417.5 617883205 619235516 620927453 622805953 624691963 626169920 626926422 627066314 626793563 626179278
1435.9 626179278 625764728 625897050 626116812 626173139 626184523 626371920 626761854 627041519 627140522 627510369
1456.2 627510369 628993034 631304264 633625686 635954678 638575196 641619444 645499706 650986433
1472.6 650986433 657334030 663009524 667483270 670556486 672349751 673029304 672637999 671145678 668826580
1490.9 668826580 666127801 662591815 658016324 653661489 649964511 646171510 640627027 632537305
1507.2 632537305 625639915 620176256 614741564 609729171 605815351 603167236 600937665 598934233
1523.6 598934233 597128451 595178902 593316019 591313601 589099407 587518036 586370230 585030675
1539.9 585030675 584400296 584829748 585808039 587299883 589441836 592167020 595128655 597890913 600962162
$$ packed form
1417.5F17883205J352311J691937J878500J886010J477957P56502J39892k72751o14285
1435.9F26179278m14550J32322K19762N6327J1384J87397L89934K79665R9003L69847
1456.2F27510369J482665K311230K321422K328992K620518L044248L880262N486727
1472.6F50986433O347597N675494M473746L073216J793265O79553l91305j492321k319098
1490.9F68826580k698779l535986m575491m354835l696978l793001n544483q089722
1507.2F32537305o897390n463659n434692n012393l913820k648115k229571k003432
1523.6E98934233j805782j949549j862883k002418k214194j581371j147806j339555
1539.9E85030675o30379M29452R78291J491844K141953K725184K961635K762258L071249
$$ plain form
1558.2 600962162 605206370 609048009 612205207 614992559 617291749 619348288 621114790 622505665
1574.5 622505665 623820007 624973178 625485003 625300169 624832690 624270022 623431087 621990383 619833410
1592.9 619833410 616990328 613680780 610040665 605862021 600945354 595276058 588873684 581747472
1609.2 581747472 574321210 566884696 558389723 548282743 539240897 530710518 520827413 511046171
1625.5 511046171 501939058 493115187 485302359 478023499 470734388 466016114 464220077 463726103
1641.8 463726103 463930786 464877546 466868758 469204128 471833199 475795567 480062902 484158665 488862664
1660.2 488862664 494676352 501299441 507637262 514222443 521700561 528922915 536302328 544348240
1676.5 544348240 551951170 558971643 566500425 576107323 585775793 594456911 603682101 613090038
$$ packed form
1558.2F00962162M244208L841639L157198K787352K299190K056539J766502J390875
1574.5F22505665J314342J153171N11825j84834m67479n62668q38935j440704k156973
1592.9F19833410k843082l309548l640115m178644m916667n669296o402374p126212
1609.2E81747472p426262p436514q494973j0106980r041846q530379r883105r781242
1625.5E11046171r107113q823871p812828p278860p289111m718274j796037m93974
1641.8D63726103K04683R46760J991212K335370K629071L962368M267335M095763M703999
1660.2D88862664N813688O623089O337821O585181P478118P222354P379413Q045912
1676.5E44348240P602930P020473P528782R606898R668470Q681118R225190R407937
$$ plain form
1692.8 613090038 623813450 635983229 648108840 661213338 672302544 681186438 689612806 696828127
1709.2 696828127 702835381 707939029 712423742 716921210 721243143 724751234 727625847 730205894
1725.5 730205894 732413232 734273493 735805809 737305164 739201605 741161883 743163884 745517433
1741.8 745517433 748199880 751076102 754163504 757688463 761717677 765621245 769263029 772792637
1758.1 772792637 776082933 779369831 782611787 785561144 788240135 790642381 792995989 795458853
1774.4 795458853 797708869 799698949 801548183 803216159 804643154 805921674 807098866 808164477
1790.7 808164477 809378028 810713649 811825931 812683880 813624620 814815640 816005647 816962063 817687213
1809.1 817687213 818368196 819176435 820132673 821090758 821909368 822501838 822930396 823446572 824133813 824873626
$$ packed form
1692.8F13090038J0723412J2169779J2125611J3104498J1089206Q883894Q426368P215321
1709.2F96828127O007254N103648M484713M497468M321933L508091K874613K580047
1725.5G30205894K207338J860261J532316J499355J896441J960278K002001K353549
1741.8G45517433K682447K876222L087402L524959M029214L903568L641784L529608
1758.1G72792637L290296L286898L241956K949357K678991K402246K353608K462864
1774.4G95458853K250016J990080J849234J667976J426995J278520J177192J065611
1790.7H08164477J213551J335621J112282Q57949R40740J191020J190007R56416P25150
1809.1H17687213O80983Q08239R56238R58085Q18610N92470M28558N16176O87241P39813
$$ plain form
1829.5 824873626 825675547 826373458 826811194 827244401 827832818 828366756 828707933 829078376 829551518 830046296
1849.9 830046296 830604553 831187546 831665158 831944883 832114637 832339168 832669675 832962751 833191633 833527505
1870.3 833527505 833920598 834247649 834579766 834992886 835395515 835661292 835806072 835953355 836183310 836572766
1890.7 836572766 837023437 837319076 837469220 837627590 837885082 838193655 838465214 838627160 838667631 838713944
1911.1 838713944 838877559 839085877 839250922 839420080 839533210 839585662 839755297 840033650 840273023 840397000
1931.5 840397000 840408385 840382159 840428054 840560794 840677381 840739965 840791702 840842485 840924144 841077983 841264665
1953.9 841264665 841388464 841408312 841400206 841457486 841582417 841695547 841784418 841857553 841901064 841972530 842095554
1976.3 842095554 842210650 842263818 842272103 842267752 842279911 842310369 842322946 842341959 842392862 842428386 842444360 842470527
$$ packed form
1829.5H24873626Q01921O97911M37736M33207N88417N33938L41177L70443M73142M94778
1849.9H30046296N58257N82993M77612K79725J69754K24531L30507K93076K28882L35872
1870.3H33527505L93093L27051L32117M13120M02629K65777J44780J47283K29955L89456
1890.7H36572766M50671K95639J50144J58370K57492L08573K71559J61946M0471M6313
1911.1H38713944J63615K08318J65045J69158J13130N2452J69635K78353K39373J23977
1931.5H40397000J1385k6226M5895J32740J16587O2584N1737N0783Q1659J53839J86682
1953.9H41264665J23799J9848q106N7280J24931J13130Q8871P3135M3511P1466J23024
1976.3H42095554J15096N3168Q285m351J2159L0458J2577J9013N0903L5524J5974K6167
$$ plain form
2000.8 842470527 842459619 842391670 842325747 842294455 842235148 842112839 841966808 841845036 841765821 841676593 841549277
2023.2 841549277 841376722 841186166 841044426 840955317 840872169 840758502 840581357 840353608 840187728 840161443
2043.6 840161443 840194643 840169370 840070903 839967787 839945614 840013027 840113878 840165198 840104699 840008795 840030432
2066.1 840030432 840203643 840399444 840497613 840473711 840408325 840420663 840557516 840742886 840864301 840885580
2086.5 840885580 840847850 840877116 841041625 841253400 841366529 841359138 841359079 841466188 841675401 841899037 842014194
2108.9 842014194 841993093 841958344 842023730 842190027 842365921 842465639 842477560 842464089 842535794 842716634 842896700
2131.3 842896700 842980087 842961609 842914999 842965007 843140423 843329132 843432486 843461335 843477309 843526423 843634665
2153.8 843634665 843783915 843933821 844065368 844173074 844299912 844509244 844767570 845007837 845211625 845393181
$$ packed form
2000.8H42470527j0908o7949o5923l1292n9307j22309j46031j21772p9215q9228j27316
2023.2H41549277j72555j90556j41740q9109q3148j13667j77145k27749j65880k6285
2043.6H40161443L3200k5273r8467j03116k2173O7413J00851N1320o0499r5904K1637
2066.1H40030432J73211J95801R8169k3902o5386J2338J36853J85370J21415K1279
2086.5H40885580l7730K9266J64509K11775J13129p391n9J07109K09213K23636J15157
2108.9H42014194k1101l4749O5386J66297J75894R9718J1921j3471P1705J80840J80066
2131.3H42896700Q3387j8478m6610N0008J75416J88709J03354K8849J5974M9114J08242
2153.8H43634665J49250J49906J31547J07706J26838K09332K58326K40267K03788J81556
$$ plain form
2174.2 845393181 845580757 845781863 846015394 846285522 846540630 846724033 846858919 847049654 847323000 847601831
2194.6 847601831 847826362 847983479 848115027 848296344 848536491 848770022 848943293 849061906 849176586 849335372
2215 849335372 849540353 849750280 849912524 850007474 850086927 850214481 850394070 850579977 850714266 850769103
2235.4 850769103 850764096 850773931 850868404 851016879 851144969 851210833 851215363 851224422 851295233 851413071 851521730
2257.8 851521730 851562798 851519048 851444602 851470649 851630390 851780891 851828933 851816893 851810992 851851106 851944387
2280.2 851944387 852034688 852061212 851983249 851823151 851703644 851682186 851674974 851579010 851397872 851230502 851134956
2302.7 851134956 851056576 850927293 850708067 850403428 850129962 849954784 849766731 849475145 849150419 848862469
2323.1 848862469 848565698 848287702 848151028 848061383 847816527 847470880 847153544 846851707 846637070 846698940
$$ packed form
2174.2H45393181J87576K01106K33531K70128K55108J83403J34886J90735K73346K78831
2194.6H47601831K24531J57117J31548J81317K40147K33531J73271J18613J14680J58786
2215H49335372K04981K09927J62244R4950P9453J27554J79589J85907J34289N4837
2235.4H50769103n007R835R4473J48475J28090O5864M530R059P0811J17838J08659
2257.8H51521730M1068m3750p4446K6047J59741J50501M8042j2040n901M0114R3281
2280.2H51944387R0301K6524p7963j60098j19507k1458p212r5964j81138j67370r5546
2302.7H51134956p8380j29283k19226l04639k73466j75178j88053k91586l24726k87950
2323.1H48862469k96771k77996j36674q9645k44856l45647l17336l01837k14637O1870
$$ plain form
2343.5 846698940 846965313 847159445 847060800 846626937 846069157 845568359 845086992 844627500 844269276 844163775
2363.8 844163775 844325483 844611704 844959497 845300913 845542073 845757723 846077323 846467674 846760333 846839011
2384.2 846839011 846721649 846510231 846339345 846259296 846176445 845981002 845657766 845307589 845055759 844904900
2404.6 844904900 844741106 844451189 844036758 843608141 843282044 843087852 842902124 842584729 842135549 841653347
2425 841653347 841269433 841017365 840775490 840419769 839935720 839439034 839065671 838805258 838524759 838119388
2445.4 838119388 837589860 837059021 836677611 836446166 836204767 835812867 835300505 834794402 834387660 834098816
2465.8 834098816 833837509 833479822 833003402 832503796 832109988 831844211 831566930 831149995 830623925 830123186
2486.2 830123186 829763114 829535961 829318762 828985512 828541458 828117728 827800691 827574193 827352047 827011347
$$ packed form
2343.5H46698940K66373J94132r8645m33863n57780n00798m81367m59492l58224j05501
2363.8H44163775J61708K86221L47793L41416K41160K15650L19600L90351K92659P8678
2384.2H46839011j17362k11418j70886q0049q2851j95443l23236l50177k51830j50859
2404.6H44904900j63794k89917m14431m28617l26097j94192j85728l17395m49180m82202
2425H41653347l83914k52068k41875l55721m84049m96686l73363k60413k80499m05371
2445.4H38119388n29528n30839l81410k31445k41399l91900n12362n06103m06742k88844
2465.8H34098816k61307l57687m76420m99606l93808k65777k77281m16935n26070n00739
2486.2H30123186l60072k27153k17199l33250m44054m23730l17037k26498k22146l40700
$$ plain form
2506.6 827011347 826557159 826137304 825812697 825526953 825248361 824927092 824508786 824058115 823665321 823353827
2527 823353827 823067069 822697461 822239697 821773767 821354628 820993841 820629120 820182621 819695711 819246292
2547.4 819246292 818828940 818452239 818118870 817759693 817341506 816892743 816450536 816054523 815684378 815280795
2567.8 815280795 814869523 814491093 814107180 813698053 813301384 812906981 812480330 812044084 811622679 811213911
2588.2 811213911 810810089 810421824 810068309 809709013 809305787 808887005 808474183 808057666 807621658 807144344
2608.6 807144344 806610763 806062162 805532694 804981291 804404914 803814113 803165674 802487731 801847517 801225662
2629 801225662 800585032 799918056 799211919 798460782 797705829 797007322 796340942 795661330 794983685 794295967
2649.4 794295967 793572247 792861342 792199135 791528225 790800333 790039718 789308846 788649797 788046479 787433863
$$ packed form
2506.6H27011347m54188m19855l24607k85744k78592l21269m18306m50671l92794l11494
2527H23353827k86758l69608m57764m65930m19139l60787l64721m46499m86910m49419
2547.4H19246292m17352l76701l33369l59177m18187m48763m42207l96013l70145m03583
2567.8H15280795m11272l78430l83913m09127l96669l94403m26651m36246m21405m08768
2588.2H11213911m03822l88265l53515l59296m03226m18782m12822m16517m36008m77314
2608.6H07144344n33581n48601n29468n51403n76377n90801o48439o77943o40214o21855
2629H01225662o40630o66976p06137p51137p54953o98507o66380o79612o77645o87718
2649.4G94295967p23720p10905o62207o70910p27892p60615p30872o59049o03318o12616
$$ plain form
2669.8 787433863 786772549 786088407 785440266 784873068 784341395 783751190 783080101 782388866 781738997 781129360
2690.2 781129360 780533910 779920638 779268205 778593421 777911246 777218938 776521981 775815845 775067508 774268389
2710.6 774268389 773467779 772718728 771993339 771224499 770432770 769676745 768977165 768313289 767644703 766961694
2731 766961694 766269863 765588403 764928699 764293492 763677180 763036132 762382746 761770010 761202633 760648370
2751.4 760648370 760050654 759400964 758762419 758165717 757575750 756952286 756303132 755677223 755072415 754431605
2771.8 754431605 753734112 752997100 752248764 751493692 750724554 749940455 749104500 748171270 747168303
2790.1 747168303 746190727 745269120 744351387 743381262 742312431 741166830 739999712 738835156 737693369
2808.5 737693369 736533165 735262752 733878374 732451141 731041551 729654014 728206813 726638556
$$ packed form
2669.8G87433863o61314o84142o48141n67198n31673n90205o71089o91235o49869o09637
2690.2G81129360n95450o13272o52433o74784o82175o92308o96957p06136p48337p99119
2710.6G74268389q00610p49051p25389p68840p91729p56025o99580o63876o68586o83009
2731G66961694o91831o81460o59704o35207o16312o41048o53386o12736n67377n54263
2751.4G60648370n97716o49690o38545n96702n89967o23464o49154o25909o04808o40810
2771.8G54431605o97493p37012p48336p55072p69138p84099q35955r33230j002967
2790.1G47168303r77576r21607r17733r70125j068831j145601j167118j164556j141787
2808.5G37693369j160204j270413j384378j427233j409590j387537j447201j568257
$$ plain form
2824.8 726638556 724958360 723189175 721364260 719471216 717429519 715119958 712409854 709222019
2841.1 709222019 705569744 701475859 696943581 692206264 687838376 684412420 682143331 680812299
2857.4 680812299 679862559 678677022 676912069 674582243 671894670 669130325 666598737 664433777
2873.7 664433777 662634671 661278844 660357356 659635782 658865511 657968581 656948328 655815721 654614270
2892.1 654614270 653345883 651899517 650169432 648224592 646172106 643973053 641507089 638651371
2908.4 638651371 635316372 631454349 627116024 622560978 618141651 614157975 610897839 608602643
2924.7 608602643 607372940 607167244 607854605 609351397 611617208 614505887 617827058 621408582 624970615
2943.1 624970615 628100157 630478561 632126331 633281171 634125292 634849548 635744452 637043595 638877213
$$ packed form
2824.8G26638556j680196j769185j824915j893044k041697k309561k710104l187835
2841.1G09222019l652275m093885m532278m737317m367888l425956k269089j331032
2857.4F80812299r49740j185537j764953k329826k687573k764345k531588k164960
2873.7F64433777j799106j355827r21488p21574p70271q96930j020253j132607j201451
2892.1F54614270j268387j446366j730085j944840k052486k199053k465964k855718
2908.4F38651371l334999l862023m338325m555046m419327l983676l260136k295196
2924.7F08602643j229703k05696O87361J496792K265811K888679L321171L581524L562033
2943.1F24970615L129542K378404J647770J154840Q44121P24256Q94904J299143J833618
$$ plain form
2961.4 638877213 641264200 644165874 647555172 651288509 655188680 659179807 663168132 667080164
2977.8 667080164 670877635 674406767 677520037 680213869 682544053 684593439 686369777 687750101
2994.1 687750101 688655376 689084172 689105153 688860357 688398242 687727749 686955512 686171949 685356021 684485734
3014.5 684485734 683599830 682665050 681566715 680273473 678856194 677382171 675907850 674467564 673031509
3032.8 673031509 671508193 669862866 668206632 666601360 664976299 663256645 661427140 659557164
3049.1 659557164 657728136 655931354 654103816 652223229 650346398 648573875 646950066 645443141
3065.5 645443141 644019246 642635524 641292810 640021741 638813317 637662411 636524558 635359585
3081.8 635359585 634190023 633054733 631997883 631017506 630073786 629139960 628218293 627316177 626370370
$$ packed form
2961.4F38877213K386987K901674L389298L733337L900171L991127L988325L912032
2977.8F67080164L797471L529132L113270K693832K330184K049386J776338J380324
2994.1F87750101R05275M28796K0981k44796m62115o70493p72237p83563q15928q70287
3014.5F84485734q85904r34780j098335j293242j417279j474023j474321j440286j436055
3032.8F73031509j523316j645327j656234j605272j625061j719654j829505j869976
3049.1F59557164j829028j796782j827538j880587j876831j772523j623809j506925
3065.5F45443141j423895j383722j342714j271069j208424j150906j137853j164973
3081.8F35359585j169562j135290j056850r80377r43720r33826r21667r02116r45807
$$ plain form
3100.1 626370370 625341594 624273241 623193979 622124016 621021450 619857788 618693054 617522717
3116.4 617522717 616303861 614964962 613449931 611870408 610349596 608861506 607353389 605804205
3132.8 605804205 604203522 602608263 601023495 599330664 597548902 595793664 594069421 592373550
3149.1 592373550 590688109 588938653 587084234 585191429 583349049 581523895 579639018 577696085
3165.4 577696085 575758457 573873341 572006345 570096493 568156421 566206157 564259827 562350690
3181.7 562350690 560456336 558551610 556638420 554706037 552773178 550880075 549019575 547152698
3198 547152698 545270205 543416381 541654289 539966702 538256288 536509216 534772098 533034682 531312108
3216.4 531312108 529644608 527982950 526272476 524537146 522789955 521039128 519319296 517601728
$$ packed form
3100.1F26370370j028776j068353j079262j069963j102566j163662j164734j170337
3116.4F17522717j218856j338899j515031j579523j520812j488090j508117j549184
3132.8F05804205j600683j595259j584768j692831j781762j755238j724243j695871
3149.1E92373550j685441j749456j854419j892805j842380j825154j884877j942933
3165.4E77696085j937628j885116j866996j909852j940072j950264j946330j909137
3181.7E62350690j894354j904726j913190j932383j932859j893103j860500j866877
3198E47152698j882493j853824j762092j687587j710414j747072j737118j737416j722574
3216.4E31312108j667500j661658j710474j735330j747191j750827j719832j717568
$$ plain form
3232.7 517601728 515783250 513821900 511819959 509861529 507903755 505919039 503897667 501806438
3249 501806438 499672025 497548491 495445639 493311882 491152257 489036828 486970931 484915167 482904822
3267.4 482904822 481061637 479350388 477622092 475901306 474307328 472867161 471548259 470348001
3283.7 470348001 469252557 468207389 467242330 466413468 465660065 464915216 464178085 463489264 462892115
3302 462892115 462378919 461868137 461275965 460604817 459928483 459307581 458709687 458099574 457487494 456856549
3322.4 456856549 456184626 455465794 454695314 453884095 453051418 452201039 451346457 450434357 449410677
3340.8 449410677 448348999 447252929 446103394 444970310 443783671 442455024 441075623 439757496
3357.1 439757496 438519001 437253743 435903400 434610248 433416605 432145089 430705607 429252028
$$ packed form
3232.7E17601728j818478j961350k001941j958430j957774j984716k021372k091229
3249E01806438k134413k123534k102852k133757k159625k115429k065897k055764k010345
3267.4D82904822j843185j711249j728296j720786j593978j440167j318902j200258
3283.7D70348001j095444j045168r65059q28862p53403p44849p37131o88821n97149
3302D62892115n13196n10782n92172o71148o76334o20902n97894o10113o12080o30945
3322.4D56856549o71923p18832p70480q11219q32677q50379q54582r12100j023680
3340.8D49410677j061678j096070j149535j133084j186639j328647j379401j318127
3357.1D39757496j238495j265258j350343j293152j193643j271516j439482j453579
$$ plain form
3373.4 429252028 427944511 426738530 425557733 424420238 423390687 422446728 421569824 420850784 420126975
3391.8 420126975 419217438 418356240 417772353 417345464 416718960 415836841 415117234 414674461 414276928 413891673
3412.2 413891673 413540751 413188666 412903994 412738740 412674904 412755400 413048297 413540900 414061904 414578289
3432.6 414578289 415226221 415873080 416347206 416833371 417523563 418370813 419308364 420331568 421470433
3450.9 421470433 422685087 423935324 425299942 426796734 428275973 429760635 431460500 433314800
3467.2 433314800 434966594 436267614 437578022 439226031 441175103 443161517 444943935 446654797
3483.6 446654797 448538691 450481117 452332288 454235077 456263810 458342075 460396826 462454528
3499.9 462454528 464547664 466545671 468438178 470417857 472559273 474868983 477229714 479434311
$$ packed form
3373.4D29252028j307517j205981j180797j137495j029551r43959q76904p19040p23809
3391.8D20126975r09537q61198n83887m26889o26504q82119p19607m42773l97533l85255
3412.2D13891673l50922l52085k84672j65254o3836Q0496K92897M92603N21004N16385
3432.6D14578289O47932O46859M74126M86165O90192Q47250R37551J023204J138865
3450.9D21470433J214654J250237J364618J496792J479239J484662J699865J854300
3467.2D33314800J651794J301020J310408J648009J949072J986414J782418J710862
3483.6D46654797J883894J942426J851171J902789K028733K078265K054751K057702
3499.9D62454528K093136J998007J892507J979679K141416K309710K360731K204597
$$ plain form
3516.2 479434311 481565982 483833522 486263543 488626033 490810215 493049711 495518833 498138666
3532.5 498138666 500820041 503493309 506084383 508741081 511572063 514431477 517126739 519754767
3548.8 519754767 522515178 525410533 528402030 531463683 534569740 537687182 540732682 543720424
3565.1 543720424 547004879 550705612 554412901 557970881 561525345 565152109 568928659 572877645
3581.5 572877645 576815009 580575526 584301770 588282168 592344344 596332729 600399196 604601324
3597.8 604601324 608807325 612964034 617056966 620976388 624845266 628861129 632983685 637101173
3614.1 637101173 641079068 644980013 649090111 653216183 656994522 660369456 663719893 667665303
3630.4 667665303 671763957 675523400 679017663 682372093 685675561 688904405 691849649 694404781
$$ packed form
3516.2D79434311K131671K267540K430021K362490K184182K239496K469122K619833
3532.5D98138666K681375K673268K591074K656698K830982K859414K695262K628028
3548.8E19754767K760411K895355K991497L061653L106057L117442L045500K987742
3565.1E43720424L284455L700733L707289L557980L554464L626764L776550L948986
3581.5E72877645L937364L760517L726244L980398M062176L988385M066467M202128
3597.8F04601324M206001M156709M092932L919422L868878M015863M122556M117488
3614.1F37101173L977895L900945M110098M126072L778339L374934L350437L945410
3630.4F67665303M098654L759443L494263L354430L303468L228844K945244K555132
$$ plain form
3646.7 694404781 697039664 700260401 703595281 706585884 709494591 712446630 715075612 717392504
3663 717392504 719642639 721638560 723313987 725215793 727191389 728787303 730666935 733005464 735248864
3681.4 735248864 737225235 738931715 740392685 741716325 743252277 745030046 746677816 748027205
3697.7 748027205 749108136 750108421 751334012 752580345 753442585 753993928 754719436 755954027 757240534
3716.1 757240534 758173108 758877158 759543359 760178626 760853112 761701286 762433529 762815118 763145208 763865352
3736.5 763865352 764958084 765881717 766104758 765970528 766530693 767282605 767663419 768392205 769520164
3754.8 769520164 770380735 770901978 771511316 772228003 772793114 773222685 773558617 773996055 774656594 775293767
3775.2 775293767 775778890 776132822 776487052 776887417 777314723 777856529 778420031 778844893 779077649 779164374
$$ packed form
3646.7F94404781K634883L220737L334880K990603K908707K952039K628982K316892
3663G17392504K250135J995921J675427J901806J975596J595914J879632K338529K243400
3681.4G35248864J976371J706480J460970J323640J535952J777769J647770J349389
3697.7G48027205J080931J000285J225591J246333Q62240N51343P25508J234591J286507
3716.1G57240534R32574P04050O66201O35267O74486Q48174P32243L81589L30090P20144
3736.5G63865352J092732R23633K23041j34230N60165P51912L80814P28786J127959
3754.8G69520164Q60571N21243O09338P16687N65111M29571L35932M37438O60539O37173
3775.2G75293767M85123L53932L54230M00365M27306N41806N63502M24862K32756Q6725
$$ plain form
3795.6 779164374 779326379 779436052 779469848 779957652 780517161 780937254 781602204 782201052 782331705 782195330
3816 782195330 782338262 782534182 782759607 783328533 783817947 784140706 784409404 784630597 784924328 785009265
3836.4 785009265 784848273 785075247 785655499 786203742 786642313 786892414 786739469 786079049 785976827 786894500
3856.8 786894500 787683010 787943900 787952542 788072884 788323939 788346827 788368583 788732767 789184988 789553583
3877.2 789553583 789659381 789725840 790015996 790190816 790333569 790493369 790543437 790798664 791160643 791200399
3897.6 791200399 790964842 790814519 790904164 791266561 791786253 792149603 792294681 792344391 792293370 792253673
3918 792253673 792371631 792508006 792574227 792728245 792946577 792970300 792885661 793004572 793248594 793438137
3938.4 793438137 793578327 793639064 793654680 793719590 793828130 793988347 794211507 794419467 794480205 794424951
$$ packed form
3795.6G79164374J62005J09673L3796M87804N59509M20093O64950N98848J30653j36375
3816G82195330J42932J95920K25425N68926M89414L22759K68698K21193K93731Q4937
3836.4G85009265j60992K26974N80252N48243M38571K50101j52945o60420j02222R17673
3856.8G86894500P88510K60890Q642J20342K51055K2888K1756L64184M52221L68595
3877.2G89553583J05798O6459K90156J74820J42753J59800N0068K55227L61979L9756
3897.6G91200399k35557j50323Q9645L62397N19692L63350J45078M9710n1021l9697
3918G92253673J17958J36375O6221J54018K18332K3723q4639J18911K44022J89543
3938.4G93438137J40190O0737J5616O4910J08540J60217K23160K07960O0738n5254
$$ plain form
3958.8 794424951 794438720 794567168 794715047 794838727 794920504 794948339 795024395 795210838 795392096 795505404
3979.2 795505404 795604646 795674384 795704424 795748651 795806527 795860469 795898139 795945823 796060503
3997.5 796060503
$$ packed form
3958.8G94424951J3769J28448J47879J23680Q1777K7835P6056J86443J81258J13308
3979.2G95505404R9242O9738L0040M4227N7876N3942L7670M7684J14680
3997.5G96060503
##END=$$ End of the data block
