##TITLE=G18-51-CE $$ Begin of the data block
##JCAMP-DX=5.00 $$ ACD/SpecManager v 10.08
##SPECTROMETER/DATA SYSTEM=Alpha
##DATE=23 Oct 2013 10:11:40
##DATA TYPE=INFRARED SPECTRUM
##DATA CLASS=XYDATA
##ORIGIN=
##OWNER=
##NPOINTS=1765
##FIRSTX=399.75695801
##LASTX=3997.56933594
##MAXX=3997.56933594
##MINX=399.75695801
##MAXY=0.83080226
##MINY=0.32078868
##XFACTOR=1.0000000000
##YFACTOR=1.000000000000000e-9
##FIRSTY=0.59968048
##DELTAX=2.03957629
##XUNITS=1/CM
##YUNITS=ARBITRARY UNITS
##XYDATA=(X++(Y..Y))
399.8E99680483l127217j713157p54594r11296j401186o70493R48906R82762j191855
418.1E91842353k484858j230538o42538j456499k209067j763761p29323p67171j626730
436.5E78931868j186073R47356K215386J000583m33743j43349M27008m26889k057910
454.8E79274237k678931j719653j246631k417505l097773k301931j532078j878858
471.1E62400877k451717j586974j29521J7524q70705j196801l75867J59025p72655
489.5E55193186j985431j950025j150966j297832k641618l437877k544403j635849
505.8E38549185k363503l445029l130198k117276k119720k924085k911925j770795
522.1E17766654q03351p57933q77142l27348P02560J196444R86218J351714K335608
$$ plain form
399.8 599680483 596553266 594840109 594085515 593174219 591773033 591102540 592051446 593034208 591842353
418.1 591842353 589357495 588126957 587484419 586027920 583818853 582055092 581325769 580558598 578931868
436.5 578931868 577745795 578693151 580908537 581909120 581475377 581332028 581759036 581332147 579274237
454.8 579274237 576595306 574875653 573629022 571211517 568113744 565811813 564279735 562400877
471.1 562400877 559949160 558362186 558232665 558250189 557379484 556182683 555806816 555965841 555193186
489.5 555193186 553207755 551257730 550106764 548808932 546167314 542729437 540185034 538549185
505.8 538549185 536185682 532740653 529610455 527493179 525373459 522449374 519537449 517766654
522.1 517766654 516963303 516205370 515328228 515000880 515703440 516899884 517886102 519237816 521573424
540.5E21573424K475620J343727J13308j76787N0485j58548r01759j288176r47356
558.8E22083938q26180j440644k179444k239764j546859r99630q54194l04580R04143
577.2E12596786J939952K191961K125025K317369K497971J975775R45926L05354M14312
595.6E27310431N56707J33038k34842m4346L65197N69582L28958o3359J8298N03838
616E29443502R84669J388908J864016K420544K777696K700150K284706K041578K080142
634.3E47985911J948715J488328J115381J141250J276970J050592N06878K27928M39763
652.7E57181716O40988M00544M2796J01745N30898N94676O3062K12431J296520J665830
673.1E62731206J621485J280666J071214J293540J413048J021742M98474L68834M47094
$$ plain form
540.5 521573424 524049044 525392771 525506079 525329292 525379777 525221229 524319470 523031294 522083938
558.8 522083938 521257758 519817114 517637670 515397906 513851047 512851417 511997223 511692643 512596786
577.2 512596786 514536738 516728699 518853724 521171093 523669064 525644839 526590765 526896119 527310431
595.6 527310431 527867138 528000176 527765334 527720988 528086185 528655767 528984725 528921366 528939664 529443502
616 529443502 530428171 531817079 533681095 536101639 538879335 541579485 543864191 545905769 547985911
634.3 547985911 549934626 551422954 552538335 553679585 554956555 556007147 556514025 556741953 557181716
652.7 557181716 557822704 558223248 558266044 558367789 558898687 559493363 559556425 559768856 561065376 562731206
673.1 562731206 564352691 565633357 566704571 567998111 569411159 570432901 570931375 571300209 571747303
691.4E71747303J7583p57455r54628k39611P59542J277208J376927J787841K623380
709.8E77638090L165722L060936K835691L185690L922760M152716L806531L680766
726.1F05448902L846466L668606K853692J944423J608848J622022J220583K97487j90735
744.4F22320294J51635M60088K2948o71983p96795m54068l82483p50303p39217K51293
764.8F19411409J579523K267361K567291L296018M260301M562676L963649L246010
781.2F45154238L092229L131747K616287J737177J373827J804412K299726K291798
797.5F63501441K150655K532006L212750L167271K292454J574457J500547J445293
813.8F81376874P79331j01030l95298l08037p07983j642883k266288k037048j540244
$$ plain form
691.4 571747303 571764886 571007431 570052803 569813192 570572734 571849942 573226869 575014710 577638090
709.8 577638090 580803812 583864748 586700439 589886129 593808889 597961605 601768136 605448902
726.1 605448902 609295368 612963974 615817666 617762089 619370937 620992959 622213542 622511029 622320294
744.4 622320294 622471929 622932017 622954965 622282982 621486187 621032119 620649636 619899333 619160116 619411409
764.8 619411409 620990932 623258293 625825584 629121602 633381903 637944579 641908228 645154238
781.2 645154238 648246467 651378214 653994501 655731678 657105505 658909917 661209643 663501441
797.5 663501441 665652096 668184102 671396852 674564123 676856577 678431034 679931581 681376874
813.8 681376874 682156205 682055175 681659877 681351840 680643857 679000974 676734686 674697638 673157394
832.1F73157394j700103k360165k465010j879096j592994j862645j860321j207530
848.5F58229530m32432k01046n37753o17564J97410J492441K535284L328740M253626
866.8F68248236N014241M761696L470838K189457J404763M65452j180827k947569l766179
885.2F77660108l659189l658533m207254m581451m155994l550767l753722m645348
901.5F45447850n300045n397737n529582o109059o585241o239056n248487m344463
917.8F00694180l703237k807736j557529o30022m81069o83128m87924P4685K42352
936.2E90660572j63615m95851n88119j256525l127456n542159p260621p949710q320808
954.5E55955708q917749r427845r491980r376705r526730r887516r880245r250611
$$ plain form
832.1 673157394 671457291 669097126 666632116 664753020 663160026 661297381 659437060 658229530
848.5 658229530 657797098 657596052 657058299 656440735 656638145 658130586 660665870 663994610 668248236
866.8 668248236 673262477 678024173 681495011 683684468 685089231 685554683 684373856 681426287 677660108
885.2 677660108 674000919 670342386 666135132 661553681 657397687 653846920 650093198 645447850
901.5 645447850 640147805 634750068 629220486 623111427 616526186 610287130 605038643 600694180
917.8 600694180 596990943 594183207 592625678 591995656 591514587 590831459 590343535 590418220 590660572
936.2 590660572 590496957 590001106 589412987 588156462 585029006 579486847 572226226 564276516 555955708
954.5 555955708 547037959 537610114 528118134 518741429 509214699 499327183 489446938 480196327
970.8D80196327q394927p660866o891220n797565m506797l454745k875924k540797
987.1D38073486k105802j649380j482218j494796j288890p88868l31431k58416n27025
1005.5D28146660q59975j106978j359552j669765j849413j774460j680940j924962
1021.8D15920615k414733k703488k660543k552539k571106k602845k457202k210438
1038.1C95747721k080381k081185j968831j588404j099408o72191k42591L23266R74804
1056.5C87312800J525014J863629K128065K433270K406806J489669q1689j225203j169473
1074.8C96682888j44362J096844K218724L267824M117698M540682M509568M279643
1091.2D20569509M079700L774017L153264K370954J760215J507192J545310J727105
$$ plain form
970.8 480196327 471801400 464140534 457249314 451451749 446944952 443490207 440614283 438073486
987.1 438073486 435967684 434318304 432836086 431341290 430052400 429263532 428932101 428673685 428146660
1005.5 428146660 427286685 426179707 424820155 423150390 421300977 419526517 417845577 415920615
1021.8 415920615 413505882 410802394 408141851 405589312 403018206 400415361 397958159 395747721
1038.1 395747721 393667340 391586155 389617324 388028920 386929512 386257321 386014730 386337996 387312800
1056.5 387312800 388837814 390701443 392829508 395262778 397669584 399159253 399077564 397852361 396682888
1074.8 396682888 396538526 397635370 399854094 403121918 407239616 411780298 416289866 420569509
1091.2 420569509 424649209 428423226 431576490 433947444 435707659 437214851 438760161 440487266
1107.5D40487266K025961K428949K800197K900779K649248K315968K136141K034783
1123.8D59779292J952321K057910K512812L013283L024400K453863J627386Q85337
1140.1D77306604L37184j02759m71919o37949m87864j45495K07246O48707J384556
1158.5D78038311K367646L250718L798693M171878M644781N244434N805970O217420
1174.8E13539851O499111O707251O722451O381392N779386N141020M509449L669321
1191.1E58949232K492309J282453M27306j09673n83767j003564j117408q36611m41849
1209.5E59058428k89023l83973m64976m71532o14822r59575j308740j493394j549125
1227.8E51523268j661479j774729j635968j220227p43091l54170L9219N77569J212597
$$ plain form
1107.5 440487266 442513227 444942176 447742373 450643152 453292400 455608368 457744509 459779292
1123.8 459779292 461731613 463789523 466302335 469315618 472340018 474793881 476421267 477306604
1140.1 477306604 477643788 477541029 477069110 476431161 475943297 475797802 476005048 476653755 478038311
1158.5 478038311 480405957 483656675 487455368 491627246 496272027 501516461 507322431 513539851
1174.8 513539851 520038962 526746213 533468664 539850056 545629442 550770462 555279911 558949232
1191.1 558949232 561441541 562723994 563151300 563041627 562457860 561454296 560336888 559500277 559058428
1209.5 559058428 558769405 558385432 557920456 557448924 556834102 555874527 554565787 553072393 551523268
1227.8 551523268 549861789 548087060 546451092 545230865 544487774 544133604 544172823 544750392 545962989
1246.2E45962989J680732J852393J925588K111018K299904K269507K066314J937091
1262.5E62105536J987637K058804J967787J772940J658619J525342J219571Q96335
1278.8E75192571P99834R33826J081527J059115Q75651O72937M11928n9128o96302
1297.2E80271959j239776j497150j550376j636028j761556j704693j419425j006067
1313.5E68456888o01172k39432J64211M46140K73109l16501j028835j620651j961887
1331.8E63571870k110600k116680j875222j272619o70194m76480n52475p21157r44257
1350.2E52832186j176655j448751j728892j996338k408266k889037l251791l611684
1366.5E34320772l733218l274202k991975l212154l464698l785909m187822m366219
$$ plain form
1246.2 545962989 547643721 549496114 551421702 553532720 555832624 558102131 560168445 562105536
1262.5 562105536 564093173 566151977 568119764 569892704 571551323 573076665 574296236 575192571
1278.8 575192571 575992405 576926231 578007758 579066873 579942524 580615461 581027389 580968261 580271959
1297.2 580271959 579032183 577535033 575984657 574348629 572587073 570882380 569462955 568456888
1313.5 568456888 567855716 567616284 567780495 568226635 568499744 568183243 567154408 565533757 563571870
1331.8 563571870 561461270 559344590 557469368 556196749 555526555 555050075 554497600 553776443 552832186
1350.2 552832186 551655531 550206780 548477888 546481550 544073284 541184247 537932456 534320772
1366.5 534320772 530587554 527313352 524321377 521109223 517644525 513858616 509670794 505304575
1382.8E05304575l966093k876043j451463o77437p23570p55876l00795L66270R27002
1401.2D95846570J165837J496017J964777K150297K144814K046049J883089K040804
1417.5E10738254K897441L196776K795994K533853K040386J301170M72843m51803j029730
1435.9E24495184n46753J21176J27912M5895J31429L21090L20673l0399j30355R81569
1456.2E25837421L290236L810108L010452K951324L595233L980696M732549O859184
1472.6E58067203Q109927O952286N042016L147423J567066j12116k143145m025519
1488.9E76605141m861653m875421n914092p487059p235706o243646o364345q731843
1505.2E24891376j1629462r415984p569700p789582p295788n622059l622174k771705
$$ plain form
1382.8 505304575 501338482 498462439 497010976 496333539 495609969 494854093 494553298 494919568 495846570
1401.2 495846570 497012407 498508424 500473201 502623498 504768312 506814361 508697450 510738254
1417.5 510738254 513635695 516832471 519628465 522162318 524202704 525503874 525976717 525524914 524495184
1435.9 524495184 523948431 524069607 524197519 524243414 524374843 524695933 525016606 524986207 524855852 525837421
1456.2 525837421 529127657 532937765 535948217 538899541 542494774 546475470 551208019 558067203
1472.6 558067203 566177130 573129416 578171432 581318855 582885921 582773805 580630660 576605141
1488.9 576605141 571743488 566868067 560953975 553466916 546231210 539987564 533623219 524891376
1505.2 524891376 513261914 503845930 496276230 488486648 481190860 475568801 471946627 469174922
1521.5D69174922k559126k675623k912044k626300k617806k649099k023756j895547
1537.8D49215621j977295m65155J050890J721978K236217K903581L522456L731817
1554.1D61940110L473669M483938O850839N644232M136145L696740L495872L669798
1570.5D97391343L033638K082765K128721K214074J534462Q09729L93510N5849l75330
1588.8E09268761r96411j677513k311766k845407l540009m486203n375773o139934
1605.1D81895745o953985p945627q659273r060979j0357201j1946797j0751635j0576189
1621.4D05644059j2389690j2206375j1262238j0770679r575426r047240r047866o008804
1637.8C25335741k713740j288801n44518K57790J413315J619518J768708L565669M258216
$$ plain form
1521.5 469174922 466615796 463940173 461028129 458401829 455784023 453134924 451111168 449215621
1537.8 449215621 447238326 446773171 447824061 449546039 451782256 454685837 458208293 461940110
1554.1 461940110 465413779 469897717 476748556 482392788 486528933 490225673 493721545 497391343
1570.5 497391343 500424981 502507746 504636467 506850541 508385003 509194732 509588242 509644091 509268761
1588.8 509268761 508272350 506594837 504283071 501437664 497897655 493411452 488035679 481895745
1605.1 481895745 474941760 466996133 458336860 449275881 438918680 426971883 416220248 405644059
1621.4 405644059 393254369 381047994 369785756 359015077 349439651 340392411 331344545 325335741
1637.8 325335741 322622001 321333200 320788682 321046472 322459787 324079305 325848013 329413682 333671898
1656.1C33671898L948211M478664N687296O711543O476581O885558Q188665Q014649
1672.4C84063065Q206099R102643Q637816P874190Q634389J1736095J2039572J0684728
1688.8D60978597J1512816J1946917J4025330J6355604J6631842J8619299J6028881
1703E66099286J3033867J2711227J1006832R066463P539451O497323O738305O842077
1719.3F39534831N554676M446268L907025L260076K681971K171457K462923L422976
1735.7F67442203L200709L013552L494620L834188L992438M268408N081058O029605
1752G00356781N708814N161584N075156M762173M757702M609347L911793L362000L040194
1770.3G40745544L348887L857315L373504K658724K389491K309024K157450K019167
$$ plain form
1656.1 333671898 337620109 342098773 347786069 354497612 360974193 367859751 376048416 384063065
1672.4 384063065 392269164 401371807 410009623 417883813 426518202 438254297 450293869 460978597
1688.8 460978597 472491413 484438330 498463660 514819264 531451106 550070405 566099286
1703 566099286 579133153 591844380 602851212 611917675 619457126 625954449 632692754 639534831
1719.3 639534831 645089507 649535775 653442800 656702876 659384847 661556304 664019227 667442203
1735.7 667442203 670642912 673656464 677151084 680985272 684977710 689246118 694327176 700356781
1752 700356781 706065595 711227179 716302335 721064508 725822210 730431557 734343350 737705350 740745544
1770.3 740745544 744094431 747951746 751325250 753983974 756373465 758682489 760839939 762859106
1786.7G62859106J648963J222729J594305K084315J786709J343608J388967J643360
1803G75572062J581788J304984J120865J221657J354396J273871J158535J135290R49800
1821.3G86673248O79910P17223Q34107R15349J235723J254976R19521Q08298P07567
1839.7G94745922L00288J96815Q60929J214505R61065O86467N73396N86808N74946
1858H00701141N17726M48585L48806J30058J54674O68704R16660P15196N31852M33088
1878.4H05566490L81112M35769M78924L68535K51174M17590N73337M89831M36724M06682
1898.8H09806168L74079L61025L07679K25783K26915L45468L69549J54376L934K09808
1919.2H12384784L62694L72530M44471L51668J78694J59622K03848J98364J59442M8518
$$ plain form
1786.7 762859106 764508069 765730798 767325103 769409418 771196127 772539735 773928702 775572062
1803 775572062 777153850 778458834 779579699 780801356 782155752 783429623 784588158 785723448 786673248
1821.3 786673248 787353158 788070381 788904488 789819837 791055560 792310536 793230057 794038355 794745922
1839.7 794745922 795046210 795243025 796103954 797318459 798279524 798965991 799539387 800126195 800701141
1858 800701141 801218867 801667452 802016258 802146316 802300990 802969694 803886354 804601550 805133402 805566490
1878.4 805566490 805947602 806383371 806862295 807230830 807482004 807899594 808472931 808962762 809399486 809806168
1898.8 809806168 810180247 810541272 810848951 811074734 811301649 811647117 812016666 812171042 812174976 812384784
1919.2 812384784 812747478 813120008 813564479 813916147 814094841 814254463 814458311 814656675 814816117 814864635
1939.6H14864635j6093J68503L31044K65181J79231J71602J93894K00629J87874K07483
1960H16753983K13027J17481K9683J41263K97249K65479J46389Q8632J13189J51813
1980.4H18318188J49071P6294N186L695K7121P7366J32144J25050J17660J13845K9266
2002.8H19174886m6253m0949J431J132q5711j80483j38223k8134o8247j66595j68264
2025.3H18254590j24693j14620j50501j96874j60814r4473j18852j62244j33156o4791
2045.7H16933572m5418o0261n0723J6451Q2016M8697k6823k7775L3498R7811J14560
2068.1H17115605M9770K9802R5308J20938M5359j133O6579J43826J31428N0306M4942
2090.5H17892730J27256J73152J08659L4451P5400J53125J54972R7155P5639J23500
$$ plain form
1939.6 814864635 814848542 815017045 815348089 815613270 815792501 815964103 816157997 816358626 816546500 816753983
1960 816753983 816967010 817084491 817114174 817255437 817552686 817818165 817964554 818053186 818166375 818318188
1980.4 818318188 818467259 818543553 818548739 818552434 818579555 818656921 818789065 818914115 819031775 819145620 819174886
2002.8 819174886 819128633 819087684 819089115 819090247 819004536 818824053 818685830 818657696 818589449 818422854 818254590
2025.3 818254590 818129897 818015277 817864776 817667902 817507088 817412615 817293763 817131519 816998363 816933572
2045.7 816933572 816888154 816827893 816777170 816793621 816875637 816924334 816897511 816869736 816903234 817001045 817115605
2068.1 817115605 817165375 817195177 817290485 817411423 817456782 817455649 817522228 817666054 817797482 817847788 817892730
2090.5 817892730 818019986 818193138 818301797 818336248 818411648 818564773 818719745 818816900 818892539 819016039
2110.9H19016039J55390J08301N0545N1558J19746J39355N1797k444O2406J55151J47700
2133.4H20055544P2480M6432R5367J33693J04904N1380O5863J43826J52707Q3327O4790
2155.8H21070313J48297K41697K48432J71602J45018K52306L46959L09229K31385K42770
2176.2H23408008L07202L15726K60710K18988K59340L17156K82109K10881K23637K83360
2196.6H26087117K70367J99437J93417K59638K91169K48730J86562J73986K23816K40445
2217H28374684J68741J22606J87397K55227J98961R5486O8665J20699J72794J10686
2237.4H29875946R239M0769J27495J03116K3544K2947R5725J19031L2723l3498r775
2259.8H30407262M4763P7009M7803J7166O9678J08361L0220n0664l6061K7120M6849
$$ plain form
2110.9 819016039 819171429 819279730 819330275 819381833 819501579 819640934 819692731 819690287 819752693 819907844 820055544
2133.4 820055544 820128024 820174456 820269823 820403516 820508420 820559800 820625663 820769489 820922196 821005523 821070313
2155.8 821070313 821218610 821460307 821708739 821880341 822025359 822277665 822624624 822933853 823165238 823408008
2176.2 823408008 823715210 824030936 824291646 824510634 824769974 825087130 825369239 825580120 825803757 826087117
2196.6 826087117 826357484 826556921 826750338 827009976 827301145 827549875 827736437 827910423 828134239 828374684
2217 828374684 828543425 828666031 828853428 829108655 829307616 829403102 829471767 829592466 829765260 829875946
2237.4 829875946 829885185 829925954 830053449 830156565 830180109 830203056 830298781 830417812 830450535 830417037 830407262
2259.8 830407262 830452025 830529034 830576837 830594003 830663681 830772042 830802262 830751598 830715537 830742657 830789506
2282.3H30789506l8087j41740j33157p3075j20580k30610k45393j76787j68026k66850
2302.7H29195201l79681l87788l46780l83854m28796m07457m40836n69820o46293n75304
2323.1H24628592l95060k88308l76463m61042l51607k14816k40206l97384l95596n246
2343.5H21502864N37277N51581j34349r44197j330435j136124p55012m77732k19822
2361.8H17594051J43588M34756M79818N18560O47247P03692O59466N68748N09202M69148
2382.2H22728276L30866P3671j50323k35200k28941k28226k78831l55244l67224l33130
2402.6H20955694l56794m13119m42267l97980l44813l94285m79519m92990m50552m47631
2423H16735744n08189n59807n49554m94421m68314n18083n45621n00918m90129n36859
$$ plain form
2282.3 830789506 830751419 830609679 830476522 830403447 830282867 830052257 829806864 829630077 829462051 829195201
2302.7 829195201 828815520 828427732 828080952 827697098 827268302 826860845 826420009 825850189 825203896 824628592
2323.1 824628592 824233532 823945224 823568761 823107719 822756112 822541296 822301090 821903706 821508110 821502864
2343.5 821502864 822040141 822591722 822457373 821513176 820182741 819046617 818291605 817813873 817594051
2361.8 817594051 817737639 818172395 818652213 819170773 819818020 820521712 821181178 821749926 822259128 822728276
2382.2 822728276 823059142 823132813 822982490 822747290 822518349 822290123 822011292 821656048 821288824 820955694
2402.6 820955694 820598900 820185781 819743514 819345534 819000721 818606436 818126917 817633927 817183375 816735744
2423 816735744 816227555 815667748 815118194 814623773 814155459 813637376 813091755 812590837 812100708 811563849
2443.4H11563849n76674n76199n37932n09798n33104n62310n44727n16832n19395n35846
2463.8H06151032n43594n18441m85718n05805n40734n36143n13256n28455n76913n80192
2484.2H00821781n25892m59551m43042n00083n32627m91142m63367m91619n14388m79221
2504.6G95920849m31001m62413n32210m97103l99947l82543m56333n47170n50509m80056
2525G91181564m75049n31137n58614n45264n00738n04256n74231n90563n67019n81085
2545.4G85753608n94139n53072m97818n13196n79357n99861n41568m79460n12719n87106
2565.8G80295312n82456n13256m86612n48303n92590n42283n05209n43594n79000n62131
2586.2G74839878n25176n17190n54442n81861n72801n65111n97775o42061o31214o06358
$$ plain form
2443.4 811563849 810987175 810410976 809873044 809363246 808830142 808267832 807723105 807206273 806686878 806151032
2463.8 806151032 805607438 805088997 804603279 804097474 803556740 803020597 802507341 801978886 801401973 800821781
2484.2 800821781 800295889 799836338 799393296 798893213 798360586 797869444 797406077 796914458 796400070 795920849
2504.6 795920849 795489848 795027435 794495225 793998122 793598175 793215632 792759299 792212129 791661620 791181564
2525 791181564 790706515 790175378 789616764 789071500 788570762 788066506 787492275 786901712 786334693 785753608
2545.4 785753608 785159469 784606397 784108579 783595383 783016026 782416165 781874597 781395137 780882418 780295312
2565.8 780295312 779712856 779199600 778712988 778164685 777572095 777029812 776524603 775981009 775402009 774839878
2586.2 774839878 774314702 773797512 773243070 772661209 772088408 771523297 770925522 770283461 769652247 769045889
2606.6G69045889o30676p09713p73430p47084p04408p47800q56161r15110q60512q00372
2626.9G61300623q79407r88245r61542q82089q84831r43064r65655r22919q53836q84473
2647.3G52134562j002193j009047q98600q60929r52482j030445r35317p78853q21650
2665.7G43845046r70841r78470q73565q17061q44598q98838q91447q01742p66694q34644
2686.1G35167146q61943p88510p62820q61228r71138r66251q68976q63612r90808j067221
2706.5G26164639j005471r40859r99987j118124j127779j011372r51588j017332j074731
2724.8G16917396j011551r12428r21249j002073j006425q97884q09849q59260r51767
2743.2G08544910r19163q20816q08835q92520r74119r18567p87854q03709r21667r41515
$$ plain form
2606.6 769045889 768415213 767705500 766932070 766184986 765480578 764732778 763876617 762961507 762100995 761300623
2626.9 761300623 760421216 759432971 758471429 757589340 756704509 755761445 754795790 753872871 753019035 752134562
2647.3 752134562 751132369 750123322 749224722 748363793 747411311 746380866 745445549 744666696 743845046
2665.7 743845046 742874205 741895735 741022170 740205109 739360511 738461673 737570226 736768484 736001790 735167146
2686.1 735167146 734305203 733516693 732753873 731892645 730921507 729955256 729086280 728222668 727231860 726164639
2706.5 726164639 725159168 724218309 723218322 722100198 720972419 719961047 719009459 717992127 716917396
2724.8 716917396 715905845 714993417 714072168 713070095 712063670 711165786 710355937 709496677 708544910
2743.2 708544910 707625747 706804931 705996096 705103576 704129457 703210890 702423036 701619327 700697660 699756145
2763.6F99756145q54134p97629q88527j026749j008571r13381r62436j112938j163841
2782F91027939j081943j042068j164437j319170j349449j292944j273930j335919j416504
2800.3F79751575j449406j468182j552105j651644j666964j644551j681984j775026
2816.6F66861713j859784j892865j906633j972199k093792k239287k362907k467453
2832.9F50066793k667248k980531l354966l848434m489124n203485n806923n950868
2849.3F15765214n399227m309416l084004k109229j668334j893402k602517l375650
2865.6E91323435l850400l877044l526270k940417k222538j503169r97305q29101q94189
2883.9E70683002j027166j144767j285911j521766j787662j995802k167881k359211
$$ plain form
2763.6 699756145 698902011 698104382 697215855 696189106 695180535 694267154 693304718 692191780 691027939
2782 691027939 689945996 688903928 687739491 686420321 685070872 683777928 682503998 681168079 679751575
2800.3 679751575 678302169 676833987 675281882 673630238 671963274 670318723 668636739 666861713
2816.6 666861713 665001929 663109064 661202431 659230232 657136440 654897153 652534246 650066793
2832.9 650066793 647399545 644419014 641064048 637215614 632726490 627523005 621716082 615765214
2849.3 615765214 610365987 606056571 602972567 600863338 599195004 597301602 594699085 591323435
2865.6 591323435 587473035 583595991 580069721 577129304 574906766 573403597 572406292 571577191 570683002
2883.9 570683002 569655836 568511069 567225158 565703392 563915730 561919928 559752047 557392836
2900.2E57392836k608776k914608l260791l672779m186213m768610n260289n513131
2916.6E25207639n455733m992723m151523l082991j884281p02620L48330J362264K395987
2934.9E09044349L308177L938317M221321M118979L636002K860725J968205J191676
2951.2E34287751O46531M25160O43790J244247K042472K856911L591358M217088M718781
2969.6E54674089N105555N331934N331099N195856M994690M680455M286349L843247
2985.9E93443274L355980K869785K375841J834691J280785P19308J72079k48432n59271
3004.3F05244040q32736j021504j074136j029372r87351j046121j203775j383663j556456
3022.6E95108926j765787j950324j975834j900792j853526j893461j970410k002657
$$ plain form
2900.2 557392836 554784060 551869452 548608661 544935882 540749669 535981059 530720770 525207639
2916.6 525207639 519751906 514759183 510607660 507524669 505640388 504937768 505286098 506648362 509044349
2934.9 509044349 512352526 516290843 520512164 524631143 528267145 531127870 533096075 534287751
2951.2 534287751 534934282 535359442 536003232 537247479 539289951 542146862 545738220 549955308 554674089
2969.6 554674089 559779644 565111578 570442677 575638533 580633223 585313678 589600027 593443274
2985.9 593443274 596799254 599669039 602044880 603879571 605160356 605879664 606051743 605803311 605244040
3004.3 605244040 604411304 603389800 602315664 601286292 600298941 599252820 598049045 596665382 595108926
3022.6 595108926 593343139 591392815 589416981 587516189 585662663 583769202 581798792 579796135
3038.9E79796135k060413k184212k284885k329051k314866k290666k344191k371967
3055.3E61615884k306223k223372k146423k060175j929283j754463j616776j555085
3071.6E46024084j506150j428604j346886j324892j323640j257420j169980j081526
3087.9E35584986j024067j044214j052856r91822r42409r94622j110197j164019j161396
3106.2E26099384j187205j241982j312912j395404j428783j435340j556992j727820
3122.6E14812946j772940j753747j774431j833617j907766j915515j857102j871347
3138.9E00126481j973808k067446k104849k099753k081841k075314k133608k228439
3155.2D83361423k245158k199411k192378k206982k206146k240867k281755k268732
$$ plain form
3038.9 579796135 577735722 575551510 573266625 570937574 568622708 566332042 563987851 561615884
3055.3 561615884 559309661 557086289 554939866 552879691 550950408 549195945 547579169 546024084
3071.6 546024084 544517934 543089330 541742444 540417552 539093912 537836492 536666512 535584986
3087.9 535584986 534560919 533516705 532463849 531472027 530529618 529534996 528424799 527260780 526099384
3106.2 526099384 524912179 523670197 522357285 520961881 519533098 518097758 516540766 514812946
3122.6 514812946 513040006 511286259 509511828 507678211 505770445 503854930 501997828 500126481
3138.9 500126481 498152673 496085227 493980378 491880625 489798784 487723470 485589862 483361423
3155.2 483361423 481116265 478916854 476724476 474517494 472311348 470070481 467788726 465519994
3171.5D65519994k229392k210617k249837k278626k247810k236575k238780k203852
3187.8D47624505k169759k149820k131492k142906k135992k054483j969963j934230
3204.1D30935860j923025j918256j893133j857042j837761j851916j878142j832456
3220.5D15944129j777828j834690j896560j879692j869142j898110k000094k151251
3236.8D00636762k223521k208173k194524k236933k333015k423108k460569k487957
3253.1C82068962k511144k517283k494305k456665k470225k456188k318562k127826
3269.4C62716764k026528j971483j846790j712472j572936j399994j217902j048684
3285.7C49919975r31561q38250p24405n93633m95344m41670l97385l35157k24620j59770
$$ plain form
3171.5 465519994 463290602 461079985 458830148 456551522 454303712 452067137 449828357 447624505
3187.8 447624505 445454746 443304926 441173434 439030528 436894536 434840053 432870090 430935860
3204.1 430935860 429012835 427094579 425201446 423344404 421506643 419654727 417776585 415944129
3220.5 415944129 414166301 412331611 410435051 408555359 406686217 404788107 402788013 400636762
3236.8 400636762 398413241 396205068 394010544 391773611 389440596 387017488 384556919 382068962
3253.1 382068962 379557818 377040535 374546230 372089565 369619340 367163152 364844590 362716764
3269.4 362716764 360690236 358718753 356871963 355159491 353586555 352186561 350968659 349919975
3285.7 349919975 348988414 348150164 347425759 346832126 346336782 345895112 345497727 345162570 344937950 344778180
3306.1C44778180j93566k05070j55300j09434q9079o1303k7955m2498p5489q3596r3072
3328.6C43641818j20521j66923j61260j28389j74164k88099l91663m04268l84927l98278
3348.9C41023326m09991m56720n32955n21928m63397n01811n60522m92036m24177m90367
3369.3C36169422n99087o52313n99593n02795m53502m17888l45081k60174j52111q8752
3389.7C32098126j59889k53737k50071j04994N3167O408j36226q9169P2062J50055
3410.1C31385732J62124J41263J25975K14934L79533N09023O05226O94424P85917Q47936
3430.5C35852087R64850J091897R67622P43747P98970J049549J179486J233757J331865
3448.9C45213830J391143J411557J490414J571566J601219J584501J599520J784861
$$ plain form
3306.1 344778180 344584614 344379544 344224244 344114810 344025731 343964428 343936473 343893975 343818486 343734890 343641818
3328.6 343641818 343521297 343354374 343193114 343064725 342890561 342602462 342210799 341806531 341421604 341023326
3348.9 341023326 340613335 340156615 339623660 339101732 338638335 338136524 337576002 337083966 336659789 336169422
3369.3 336169422 335570335 334918022 334318429 333815634 333362132 332944244 332599163 332338989 332186878 332098126
3389.7 332098126 331938237 331684500 331434429 331329435 331382602 331389010 331252784 331163615 331235677 331385732
3410.1 331385732 331547856 331689119 331815094 332030028 332409561 332918584 333523810 334218234 335004151 335852087
3430.5 335852087 336816937 337908834 338876456 339620203 340419173 341468722 342648208 343881965 345213830
3448.9 345213830 346604973 348016530 349506944 351078510 352679729 354264230 355863750 357648611
3465.2C57648611J959741J816124J540571J566291J813054K035082K082139J957387
3481.5C72419000J959771K117216K134383K036601K068520K196431K276212K221227
3497.8C89429361K171337K232224K218097K108843K130061K313763K523571K561122
3514.2D07688379K421558K378077K472013K589076K548665K440155K544075K726078
3530.5D27808076K817005K908498K918691K810269K830684K921790K966315K982139
3546.8D50963467K979726K987683L089547L224343L254503L261626L248006L072321
3563.1D76081222K951503L516138M228830M091650L720016L767699L973186M063546
3579.4E06393790M054964L870010L654897L919661M450441M362106M094124M231870
$$ plain form
3465.2 357648611 359608352 361424476 362965047 364531338 366344392 368379474 370461613 372419000
3481.5 372419000 374378771 376495987 378630370 380666971 382735491 384931922 387208134 389429361
3497.8 389429361 391600698 393832922 396051019 398159862 400289923 402603686 405127257 407688379
3514.2 407688379 410109937 412488014 414960027 417549103 420097768 422537923 425081998 427808076
3530.5 427808076 430625081 433533579 436452270 439262539 442093223 445015013 447981328 450963467
3546.8 450963467 453943193 456930876 460020423 463244766 466499269 469760895 473008901 476081222
3563.1 476081222 479032725 482548863 486777693 490869343 494589359 498357058 502330244 506393790
3579.4 506393790 510448754 514318764 517973661 521893322 526343763 530705869 534799993 539031863
3595.7E39031863M443407M439831M407644M272878L914893L911674M250169M327416
3612.1E72999775M248143L957271L845096M467964M706681M099607L381789L607214
3628.4F05313540M828035M922629M406154M152238L904224L726482L546417L049254
3644.7F37848973K442301K800703M165232M320025L468752L386557L657937L295243
3661F65385723K852500K558708K031088J792907K389074K302944J934410K735316L084600
3679.4F87067270K656937K242386J706720J176178J250506J924574K203524J894713
3695.7G02122808J507639J359463J563132J945496J840710J264990R50694J479804
3712G14034736K190828J966417J324356R18627P71105P64489R69768J207113Q43048
$$ plain form
3595.7 539031863 543475270 547915101 552322745 556595623 560510516 564422190 568672359 572999775
3612.1 572999775 577247918 581205189 585050285 589518249 594224930 598324537 601706326 605313540
3628.4 605313540 610141575 615064204 619470358 623622596 627526820 631253302 634799719 637848973
3644.7 637848973 640291274 643091977 647257209 651577234 655045986 658432543 662090480 665385723
3661 665385723 668238223 670796931 672828019 674620926 677010000 679312944 681247354 683982670 687067270
3679.4 687067270 689724207 691966593 693673313 694849491 696099997 698024571 700228095 702122808
3695.7 702122808 703630447 704989910 706553042 708498538 710339248 711604238 712554932 714034736
3712 714034736 716225564 718191981 719516337 720434964 721206069 721970558 722940326 724147439 724990487
3730.3G24990487J87457K30610J143575J731455J139581J6511r954J118123R41456
3748.7G31489301M02391J105725J576364J121402P02262Q70526R56595P01189N40733
3767.1G39466488M76897P21157J022517Q22902M41551L39151N50627O51181O34492
3785.4G45126963P25627O90937M72247J89185J8418J22667j9610P1883Q54671Q14378
3805.8G49067366O07073R45867P81536N2511l25322O56P2181N11646J087904P51794
3826.2G53553212M38690L03030J68741J72972j12176k49326M20511R62794R87708P90477
3846.6G57436633K64704p32183j419962R6620J700878J277029L46899j25110J00613
3865G58946121K28643r3937J08838N75126P41601O04331P1645O4432L60191K13921
$$ plain form
3730.3 724990487 725177944 725408554 726552129 728283584 729423165 729439676 729429722 730547845 731489301
3748.7 731489301 731891692 732997417 734573781 735695183 736397445 737267971 738224566 738925755 739466488
3767.1 739466488 739943385 740664542 741687059 742509961 742951512 743290663 743841290 744492471 745126963
3785.4 745126963 745852590 746543527 747015774 747204959 747223377 747346044 747326434 747398317 748252988 749067366
3805.8 749067366 749674439 750620306 751401842 751454353 751129031 751129687 751201868 751713514 752801418 753553212
3826.2 753553212 753991902 754294932 754463673 754636645 754524469 754275143 754695654 755658448 756646156 757436633
3846.6 757436633 757701337 756969154 755549192 755645812 757346690 758623719 758970618 758845508 758946121
3865 758946121 759174764 759080827 759189665 759764791 760506392 761110723 761182368 761246800 761606991 761820912
3885.4G61820912K72394K01404L6180M34279N12898r5367n27978l60728J94014Q21352
3905.7G63309360R55939N86569K39492j9670k33412p7367K55287K21431R8885K12073
3926.1G65548587J87933m4822J3649L87609M84467K21729p7665j22607J20998J56700
3946.5G66876578M1008J68383K97487K36631J26898P8082L9280N6743J69635J52349
3966.9G68243074L4631O5565J78993K20120J72138O0975K7657J32620J75834Q8632
3987.3G69400239P0930J39832J58668J48773J17779
3997.5G70036221
$$ plain form
3885.4 761820912 762093306 762294710 762330890 762765169 763278067 763182700 762654722 762293994 762488008 763309360
3905.7 763309360 764265299 764851868 765091360 765071690 764838278 764760911 765016198 765237629 765336514 765548587
3926.1 765548587 765736520 765691698 765705347 766092956 766577423 766799152 766721487 766598880 766719878 766876578
3946.5 766876578 766917586 767085969 767383456 767620087 767746985 767825067 767864347 767921090 768090725 768243074
3966.9 768243074 768277705 768343270 768522263 768742383 768914521 768975496 769003153 769135773 769311607 769400239
3987.3 769400239 769471169 769611001 769769669 769918442 770036221
3997.5 770036221
##END=$$ End of the data block
