##TITLE=G18-51-CE $$ Begin of the data block
##JCAMP-DX=5.00 $$ ACD/SpecManager v 10.08
##SPECTROMETER/DATA SYSTEM=Alpha
##DATE=23 Oct 2013 10:11:40
##DATA TYPE=INFRARED SPECTRUM
##DATA CLASS=XYDATA
##ORIGIN=
##OWNER=
##NPOINTS=1765
##FIRSTX=399.75695801
##LASTX=3997.56933594
##MAXX=3997.56933594
##MINX=399.75695801
##MAXY=0.83125120
##MINY=0.32119206
##XFACTOR=1.0000000000
##YFACTOR=1.000000000000000e-9
##FIRSTY=0.60262394
##DELTAX=2.03957629
##XUNITS=1/CM
##YUNITS=ARBITRARY UNITS
##XYDATA=(X++(Y..Y))
399.8F02623940l139377k133787q98063j056492j606644l80575J184165N40376j723170
418.1E93410373k455712r98020n81443j496434k308190j866341p53999r82046j802921
436.5E80165267q93593J044214J966298J143693k11238n04017j59323n24641j590073
454.8E80436587k151370j630783j418471k486646l323376k689183j605273j658737
471.1E63472748k369523j717747j52707J95563p85768j403630o88314M9770n57542
489.5E56042850j589239j714229j261592j509488k636671l276825k501011j784503
505.8E39769292k514362l400922k993822k223909k466381l121257k918422j744032
522.1E18386185o98864p32124j018644m27663P58290J452089J246631J315474K167762
$$ y = [602623940, 599484563, 597350776, 596452713, 595396221, 593789577, 593409002, 594593167, 595133543, 593410373, 590954661, 589956641, 589375198, 587878764, 585570574, 583704233, 582950234, 581968188, 580165267, 579271674, 580315888, 582282186, 583425879, 583214641, 582710624, 582551301, 582026660, 580436587, 578285217, 576654434, 575235963, 572749317, 569425941, 566736758, 565131485, 563472748, 561103225, 559385478, 559232771, 559428334, 558642566, 557238936, 556550622, 556600392, 556042850, 554453611, 552739382, 551477790, 549968302, 547331631, 544054806, 541553795, 539769292, 537254930, 533854008, 530860186, 528636277, 526169896, 523048639, 520130217, 518386185, 517687321, 516955197, 515936553, 515508890, 516267180, 517719269, 518965900, 520281374, 522449136]
540.5E22449136K377927J198888p3731k89023J22607R5725o87480j224935q93355p91251
560.9E22284508j583278k277732k217651j633644j057684q41737l22402R22084K028704
579.2E15301168K304077K101719K184451K511382K188981J139700K73466J69754L93808
597.6E28568506K55287j39535j82449K16961M61638K31206k1339K13743O99877J020790
618E31324685J283049J773417K409697K791345K700746K262056J960635K032816J999557
636.3E50538003J531840J145661J226484J333118J021504N64397M04536M87149M94659
654.7E58747351K60055r238R9182N28872O04510K21729L75271J212776J603484J628637
675.1E65272629J204849R73343J376331J584649J074672M88162L80099M17709k2590
$$ y = [522449136, 524827063, 526025951, 525952220, 525663197, 525785804, 525881529, 525194049, 523969114, 523075759, 522284508, 520701230, 518423498, 516205847, 514572203, 513514519, 512672782, 512350380, 513272464, 515301168, 517605245, 519706964, 521891415, 524402797, 526591778, 527731478, 528004944, 528174698, 528568506, 528823793, 528684258, 528501809, 528718770, 529180408, 529411614, 529390275, 529604018, 530303895, 531324685, 532607734, 534381151, 536790848, 539582193, 542282939, 544544995, 546505630, 548538446, 550538003, 552069843, 553215504, 554441988, 555775106, 556796610, 557361007, 557765543, 558252692, 558747351, 559007406, 558998168, 559097350, 559626222, 560230732, 560452461, 560827732, 562040508, 563643992, 565272629, 566477478, 567450821, 568827152, 570411801, 571486473, 571974635, 572354734, 572772443, 572749853]
693.5E72749853p83205j002312l46303O22154J268804J471042J842559K642691L108263
711.8E81573546K905071K782881L292143M000962M143357L746033L629804L841400
728.1F09915197L643870K776385J882195J669705J728833J176119K11000j17064K65420
746.5F23151660M57525l2842p03990q26896m89831m13417p54416p01249K81870J604796
766.9F21573210K323627K593875L262162M231513M541218L885508L135502L034473
783.2F48581088L137290K691686J843810J402796J814961K351224K299071K138257
799.5F66260183K575874L258228L150166K238094J515508J487792J522958Q57651j17183
817.9F82749271m62591l09289o43790j656889k354145k067686j523316j704394k355278
$$ y = [572749853, 571966648, 570964336, 570618033, 571240187, 572508991, 573980033, 575822592, 578465283, 581573546, 584478617, 587261498, 590553641, 594554603, 598697960, 602443993, 606073797, 609915197, 613559067, 616335452, 618217647, 619887352, 621616185, 622792304, 623003304, 622886240, 623151660, 623609185, 623576343, 622872353, 622045457, 621555626, 621142209, 620387793, 619686544, 619968414, 621573210, 623896837, 626490712, 629752874, 633984387, 638525605, 642411113, 645546615, 648581088, 651718378, 654410064, 656253874, 657656670, 659471631, 661822855, 664121926, 666260183, 668836057, 672094285, 675244451, 677482545, 678998053, 680485845, 682008803, 682866454, 682749271, 682286680, 681977391, 681333601, 679676712, 677322567, 675254881, 673731565, 672027171, 669671893]
836.2F69671893k476454j946926j593292j833796j940310j232028l36826j93000n98490
854.6F57520771o19173J77920J428664K545476L393650M253208M957021M742920L532350
872.9F81932807K228260J378298M51028j199841k983809l795385l701031l721655m217505
891.3F66371167m485488m066050l594578l877699m683197n213320n326748n575776
907.6F29548311o197750o588936o162405n222798m395425l743172k822995j562118
923.9E92852712o32644m80294o58691m58062R9719K68221j75357n53847o39140j290083
944.3E88332534l145039n538345p253527p938743q305907q919895r449780r482264
960.6E28299034r353280r531379r888560r906530r286910q376092p630527o895036
$$ y = [669671893, 667195439, 665248513, 663655221, 661821425, 659881115, 658649087, 658312261, 658119261, 657520771, 656901598, 657079518, 658508182, 661053658, 664447308, 668700516, 673657537, 678400457, 681932807, 684161067, 685539365, 685990393, 684790552, 681806743, 678011358, 674310327, 670588672, 666371167, 661885679, 657819629, 654225051, 650347352, 645664155, 640450835, 635124087, 629548311, 623350561, 616761625, 610599220, 605376422, 600980997, 597237825, 594414830, 592852712, 592220068, 591739774, 591081083, 590623021, 590722740, 590990961, 590815604, 590261757, 589622617, 588332534, 585187495, 579649150, 572395623, 564456880, 556150973, 547231078, 537781298, 528299034, 518945754, 509414375, 499525815, 489619285, 480332375, 471956283, 464325756, 457430720]
977D57430720n807966m487872l428906k882451k543866k063245j615763j512736j539677
995.3D31548238j289726p60376l05414k42442n22465q49485j095980j390964j706511
1013.7D23384875j836032j756370j690864j918555k375066k691209k704889k600044
1030D05811846k567202k554923k439558k245695k101451k052098j928539j585751j125992
1048.3C87210637p07209k59459L83318J070469J538337J802384K094061K440303K401829
1066.7C97974670J473844q9526j214177j147419j55598J064122K197981L245979M095585
1085D07445461M530936M525542M316479M087955L754288L147781K368122J754582J526773
1103.4D37457919J584500J742602K003818K408535K791106K881289K662986K387464
$$ y = [457430720, 451622754, 447134882, 443705976, 440823525, 438279659, 436216414, 434600651, 433087915, 431548238, 430258512, 429498136, 429192722, 428950280, 428427815, 427578330, 426482350, 425091386, 423384875, 421548843, 419792473, 418101609, 416183054, 413807988, 411116779, 408411890, 405811846, 403244644, 400689721, 398250163, 396004468, 393903017, 391850919, 389922380, 388336629, 387210637, 386503428, 386243969, 386627287, 387697756, 389236093, 391038477, 393132538, 395572841, 397974670, 399448514, 399358988, 398144811, 396997392, 396841794, 397905916, 400103897, 403349876, 407445461, 411976397, 416501939, 420818418, 424906373, 428660661, 431808442, 434176564, 435931146, 437457919, 439042419, 440785021, 442788839, 445197374, 447988480, 450869769, 453532755, 455920219]
1119.7D55920219K174825K009421J935184K048225K472102K977252L031493K480924
1136D75049645J651674R02891L39836j05589m67301o24031m88758j77562J99348O84202
1156.4D76964355J391649K334267L249645L839642M197269M619629N185902N775809
1172.7E07558167O243587O537258O700397O681025O348908N757153N132079M510343
1189.1E55468917L650784K469778J279116M19855j18136n83172j005054j104235q20995
1207.4E59656858m62293l17872l81887m44412m55558o05345r54390j310587j510024
1225.8E53214490j568257j642049j726091j608491j212477p40409l72589N841N79298
1244.1E44929266J251161J695991J842975J928807K112388K279818K254963K074778
$$ y = [455920219, 458095044, 460104465, 462039649, 464087874, 466559976, 469537228, 472568721, 475049645, 476701319, 477604210, 477944046, 477838457, 477371156, 476747125, 476258367, 476080805, 476280153, 476964355, 478356004, 480690271, 483939916, 487779558, 491976827, 496596456, 501782358, 507558167, 513801754, 520339012, 527039409, 533720434, 540069342, 545826495, 550958574, 555468917, 559119701, 561589479, 562868595, 563288450, 563170314, 562587142, 561582088, 560477853, 559656858, 559194565, 558876693, 558494806, 558050394, 557594836, 556989491, 556035101, 554724514, 553214490, 551646233, 550004184, 548278093, 546669602, 545457125, 544716716, 544344127, 544349968, 544929266, 546180427, 547876418, 549719393, 551648200, 553760588, 556040406, 558295369, 560370147]
1260.4E60370147J947642J981318K044737J976192J802564J670539J514018J219689
1276.8E74526846R17137Q16703R32574J069308J054585Q86738O93261M34161o1810
1295.1E81269503p31111j261413j484513j536727j653433j789630j700818j381815
1311.4E69730043r67085n79536k30849J52111M32849K75255l50595j092136j634717
1329.8E65735340j931965k094448k102792j845181j267076o82234m84467n92232p62343
1348.1E53972602r28283j143992j438975j740098k005041k382695k885223l311515
1364.5E38136780l659069l732562l257752k995193l238618l470838l770173m182041
1380.8E09830534m346787l914357k829611j435459o70850p04795p10309k43455L65883
$$ y = [560370147, 562317789, 564299107, 566343844, 568320036, 570122600, 571793139, 573307157, 574526846, 575443983, 576260686, 577193260, 578262568, 579317153, 580203891, 580897152, 581331313, 581269503, 580538392, 579276979, 577792466, 576255739, 574602306, 572812676, 571111858, 569730043, 568762958, 568183422, 567952573, 568104684, 568537533, 568812788, 568462193, 567370057, 565735340, 563803375, 561708927, 559606135, 557760954, 556493878, 555811644, 555327177, 554734945, 553972602, 553044319, 551900327, 550461352, 548721254, 546716213, 544333518, 541448295, 538136780, 534477711, 530745149, 527487397, 524492204, 521253586, 517782748, 514012575, 509830534, 505483747, 501569390, 498739779, 497304320, 496633470, 495928675, 495218366, 494974911, 495340794]
1399.1D95340794Q60125J111448J502901K011150K172351K126396K021074J886666
1415.5E09032905K100885K944946L141404K696990K462924K008021J275122M66883
1431.8E26130080l93867r61364n61297N9128R7931N3286J46091L17455K94745k9862
1452.2E25152326o2704J074671L268183L703713K970278K962649L589630L993929M797935
1470.5E51450610O913126Q086025O887615M990041L114581J535953j33813k150714
1486.8E80693424m044116m902422m895449n878687p421970p234812o313086o370008
1503.2E33632874q583843j1481047r461701p637501p790267p262200n595207l586799
1519.5D72234309k697647k527952k689928k933085k653748k598524k583652j978875
$$ y = [495340794, 496200919, 497312367, 498815268, 500826418, 502998769, 505125165, 507146239, 509032905, 511133790, 514078736, 517220140, 519917130, 522380054, 524388075, 525663197, 526130080, 525736213, 524774849, 524213552, 524272680, 524370611, 524423897, 524569988, 524887443, 525182188, 525152326, 525089622, 526164293, 529432476, 533136189, 536106467, 539069116, 542658746, 546652675, 551450610, 558363736, 566449761, 573337376, 578327417, 581441998, 582977951, 582844138, 580693424, 576649308, 571746886, 566851437, 560972750, 553550780, 546315968, 540002882, 533632874, 525049031, 513567984, 504106283, 496468782, 488678515, 481416315, 475821108, 472234309, 469536662, 467008710, 464318782, 461385697, 458731949, 456133425, 453549773, 451570898]
1535.8D51570898j834958j864344m19468J001149J653850K198220K898603L520430
1552.1D58724380L751188L572345M641950O846487N511135M051209L672778L501863
1568.4D94273335L634721K977967K106786K185225K175689J450539P44283L49820L8325
1586.8E09936690l72708j000523j689613k322555k856671l531695m459440n369008
1603.1D88334477o136030o919235p932842q684605r048253j0284365j1885196j0745316
1619.4D16698635j0571361j2393862j2267351j1323333j0776102r559691r005011q964270
1635.7C31837654n999267k775550j334429n36352L20405J435607J615852J826853L560156
1654.1C29950929M155248L885418M468352N707532O703913O459356O937444Q238524
$$ y = [451570898, 449735940, 447871596, 447452128, 448453277, 450107127, 452305347, 455203950, 458724380, 462475568, 466047913, 470689863, 477536350, 483047485, 487098694, 490771472, 494273335, 497908056, 500886023, 502992809, 505178034, 507353723, 508804262, 509548545, 509898365, 509936690, 509563982, 508563459, 506873846, 504551291, 501694620, 498162925, 493703485, 488334477, 482198447, 475279212, 467346370, 458661765, 449613512, 439329147, 427443951, 416698635, 406127274, 393733412, 381466061, 370142728, 359366626, 349806935, 340801924, 331837654, 325838387, 323062837, 321728408, 321192056, 321512461, 322948068, 324563920, 326390773, 329950929, 334106177, 337991595, 342459947, 348167479, 354871392, 361330748, 368268192, 376506716]
1670.4C76506716P978588Q172721R103119Q608818P848412Q692026J1812389J2010396
1686.7D50733185J0617047J1452437J1920631J4057755J6392261J6636133J8596769
1701E50406218J6009211J3051987J2727976J1005222R057999P542193O554306O806433
1717.3F33161545O834447N517245M415214L864348L244817K735913K271413K548576
1733.6F64593518L402114L162861L035724L483355L780246L980875M320561N123675
1749.9F94882929N984783N656183N164266N083442M765510M753053M575372L898680
1766.3G34764218L394485L103018L391385L824115L321290K625465K375305K317190
1782.6G59116471K168000K013862J653015J254738J608371K047658J748026J347482
$$ y = [376506716, 384485304, 392658025, 401761144, 410369962, 418218374, 426910400, 438722789, 450733185, 461350232, 472802669, 484723300, 498781055, 515173316, 531809449, 550406218, 566415429, 579467416, 592195392, 603200614, 612258613, 619800806, 626355112, 633161545, 639995992, 645513237, 649928451, 653792799, 657037616, 659773529, 662044942, 664593518, 667995632, 671158493, 674194217, 677677572, 681457818, 685438693, 689759254, 694882929, 700867712, 706523895, 711688161, 716771603, 721537113, 726290166, 730865538, 734764218, 738158703, 741261721, 744653106, 748477221, 751798511, 754423976, 756799281, 759116471, 761284471, 763298333, 764951348, 766206086, 767814457, 769862115, 771610141, 772957623]
1798.9G72957623J409709J642168J565039J294494J137256J239300J329601J230061
1815.2G83805251J149058J172603R88960O92367P28667Q49307R05752J191437J215279
1833.6G92698681R19819Q19981P05242L24369K60234Q74936J160860R13919O57379
1851.9G99335420N51283N91338O04749N41568M58359L56794J55687J88112O51539Q58843
1872.3H04293692O70195N11944M44472M09722M47333M74811L72350K59042M10258N65589
1892.7H08859408M89294M30406M08887L82543L72708L23117K12669J85728L19004L64125
1913.1H12347889J66714N4240K58446L69191L53515M06981L25322J83344J62065K00212
1933.5H14827919J97411J46925M5836N245J77741L23653K60234J91093J93298J85430
$$ y = [772957623, 774367332, 776009500, 777574539, 778869033, 780006289, 781245589, 782575190, 783805251, 784954309, 786126912, 787115872, 787808239, 788536906, 789386213, 790291965, 791483402, 792698681, 793618500, 794438481, 795143723, 795468092, 795728326, 796603262, 797764122, 798678041, 799335420, 799886703, 800478041, 801082790, 801624358, 802082717, 802439511, 802595198, 802783310, 803434849, 804293692, 804963887, 805475831, 805920303, 806330025, 806777358, 807252169, 807624519, 807883561, 808293819, 808859408, 809348702, 809779108, 810187995, 810570538, 810943246, 811266363, 811479032, 811664760, 811983764, 812347889, 812514603, 812568843, 812827289, 813196480, 813549995, 813956976, 814282298, 814465642, 814627707, 814827919, 815025330, 815172255, 815218091, 815223336, 815401077, 815724730, 815984964, 816176057, 816369355, 816554785]
1953.9H16554785J73449J77563J93536J89364J11639L4154J27494K71618K61307J74582
1974.3H18269491J32740J37388J37091J19746N5134J252K8193P7665J11341J16050
1994.7H19186091J01567J12593J06275L4392k1637k7358j4663l9756j01209j54972
2015.1H19181323j29580m0293o7711j74642j95264j27435r5308j43170j85073j39117
2035.5H17883730p8559j13845j82271j61350n3405j0491n5551p0513j1921M6552M2617
2057.9H17234993J0908Q463M9353R3520Q9228M0352M9949J23024J32501M1008m768
2080.3H17868531N3227J18494J23203O3121L5584J00732J70529J09970L5107R4474
2100.7H18772972J63734J45852R2209P1466J11520J67429J45376O3300M2617J20342
$$ y = [816554785, 816728234, 816905797, 817099333, 817288697, 817400336, 817434490, 817561984, 817833602, 818094909, 818269491, 818402231, 818539619, 818676710, 818796456, 818851590, 818852842, 818881035, 818958700, 819070041, 819186091, 819287658, 819400251, 819506526, 819540918, 819519281, 819491923, 819477260, 819437504, 819336295, 819181323, 819051743, 819011450, 818943739, 818769097, 818573833, 818446398, 818351090, 818207920, 818022847, 817883730, 817805171, 817691326, 817509055, 817347705, 817294300, 817283809, 817228258, 817157745, 817145824, 817192376, 817234993, 817245901, 817254364, 817303717, 817397237, 817486465, 817526817, 817576766, 817699790, 817832291, 817873299, 817868531, 817921758, 818040252, 818163455, 818226576, 818262160, 818362892, 818533421, 818643391, 818678498, 818772972, 818936706, 819082558, 819174767, 819246233, 819357753, 819525182, 819670558, 819733858, 819776475, 819896817]
2121.1H19896817J42753O0618K0623P1526J38760J31547N2929J2934P6354J38938J15872
2143.6H20859671O9677P9096J44481J80543J19448N3823J15871K38538K49565J45912
2164H22256625J32084K65300L53634L05891K35558K63512L23594K98321K37226K37286
2184.4H24909031K83480L20315K90812K08437K11120K93135K76923J66119J41441K39969
2204.8H27340782L08990K54393J75595J95265K73466K66433J43587P3076J52707K62379
2225.2H29446673K47777J20461N8412J27852J70231R5845K3543N3823J18435R6321
2245.6H30559373L0816L3318P8083R0420M8756K385k385L9697P2718K8550j5556M3749
2270H31009924R9361L1948m6014j1146Q1777Q5354n0008j64271j34229p6354j19805
$$ y = [819896817, 820039570, 820100188, 820120811, 820192337, 820331097, 820462644, 820515573, 820528507, 820604861, 820743799, 820859671, 820929348, 821008444, 821152925, 821333468, 821452916, 821506739, 821622610, 821861148, 822110713, 822256625, 822388709, 822654009, 823007643, 823313534, 823549092, 823812604, 824136198, 824434519, 824671745, 824909031, 825192511, 825512826, 825803638, 826012075, 826223195, 826516330, 826793253, 826959372, 827100813, 827340782, 827649772, 827904165, 828079760, 828275025, 828548491, 828814924, 828958511, 829031587, 829184294, 829446673, 829694450, 829814911, 829873323, 830001175, 830171406, 830267251, 830290794, 830344617, 830463052, 830559373, 830590189, 830623507, 830701590, 830792010, 830840766, 830843151, 830840766, 830880463, 830953181, 830981731, 830966175, 831009924, 831109285, 831141233, 831095219, 831084073, 831165850, 831251204, 831201196, 831036925, 830902696, 830826342, 830706537]
2292.5H30706537k05517k20239j94550k32279l06189l49581l26872l03626l77894m35233
2312.9H27754557m17530m84229o17623o32048n19931l92198l40820l85105m29452l83794
2333.3H23151827l04461k57849k60115k77936n2631M68969N28812j46091r52661j343429
2353.6H20554435j111269p22110m76778j73866J38640L60966M59432N24104O81639
2372H20235193P45713O40214N39362N03600M43578K95639O1512j52826k41280k28584
2392.4H22842121k31147l09884l74675l43859l10660l60369m37975m70877m02033l05474
2412.8H19295168l43382m73321n15163m59373m48346n05507n49674n37634m79758m59790
2433.2H14523220n26190n68866n13793m75883n43237o03080n64456n06460n08011n45740
$$ y = [830706537, 830501020, 830280781, 830086231, 829853952, 829547763, 829198182, 828871310, 828567684, 828189790, 827754557, 827337027, 826852798, 826235175, 825603127, 825083196, 824690998, 824350178, 823965073, 823535621, 823151827, 822847366, 822589517, 822329402, 822051466, 821998835, 822467804, 822996616, 822850525, 821897864, 820554435, 819443166, 818721056, 818244278, 818070412, 818209052, 818570018, 819029450, 819553554, 820235193, 820980906, 821621120, 822160482, 822664082, 823107660, 823403299, 823464811, 823311985, 823070705, 822842121, 822610974, 822301090, 821926415, 821582556, 821271896, 820911527, 820473552, 820002675, 819600642, 819295168, 818951786, 818478465, 817963302, 817503929, 817055583, 816550076, 816000402, 815462768, 814983010, 814523220, 813997030, 813428164, 812914371, 812438488, 811895251, 811292171, 810727715, 810221255, 809713244, 809167504]
2453.6H09167504n56945n30541n07057n32746n77093n63979m97222m54604n04315n75304
2474H03867698n76198n42283n28038n41091n43594n16534m81367m63367m88639n10156
2494.4G98676431m81129m58896m97341n34892m96745m36842m47751m88877m61519m17053
2514.8G93955386m34220m80771n17667n06401m62293m79639n46992n68986n30839m94658
2535.2G88932920n31793n96464n87284n42045n41806n60820n50390n31494n27740n52356
2555.6G83410728n89728n62072n03957n26965n90086n83708n15044m77910n38170o06895
2576G77916193n55634m85898n32448n92470n65052n22971n33164n76675n91576n73396
2596.4G72386909n58436n72861o14345Tn93602o24419p08401p68900p48098p36952
$$ y = [809167504, 808610559, 808080018, 807572961, 807040215, 806463122, 805899143, 805401921, 804947317, 804443002, 803867698, 803291500, 802749217, 802221179, 801680088, 801136494, 800619960, 800138593, 799675226, 799186587, 798676431, 798195302, 797736406, 797239065, 796704173, 796207428, 795770586, 795322835, 794833958, 794372439, 793955386, 793521166, 793040395, 792522728, 792016327, 791554034, 791074395, 790527403, 789958417, 789427578, 788932920, 788401127, 787804663, 787217379, 786675334, 786133528, 785572708, 785022318, 784490824, 783963084, 783410728, 782821000, 782258928, 781754971, 781228006, 780637920, 780054212, 779539168, 779061258, 778523088, 777916193, 777360559, 776874661, 776342213, 775749743, 775184691, 774661720, 774128556, 773551881, 772960305, 772386909, 771828473, 771255612, 770641267, 770026922, 769433320, 768808901, 768100500, 767331600, 766583502, 765846550]
2616.8G65846550p85470q41558q80479q53956q04484q90911j016378r58920q32676
2635.1G57981718q56102r61184r80854r08435q49366r05931j012385j010477q94845
2653.5G49602139q36015r26792j023412r60529q29697q55028r63092r40740q50439
2671.8G41416395q34883q76069r00328q59082p88629p97927q71718q95679q23498p57157
2692.2G33011425q08537r21429r44018q52108q40366r95517j092314j004517r34065
2710.6G24618554j006484j108646j101256j012623r97305j053512j052499r81569r33468
2728.9G15371192r51410r97484r87529q89838q27968q93414r61840r13978q22186q03411
2749.3G06322134q84295r46581q82268p93577q15153r13083r36389q38578p88093r14812
$$ y = [765846550, 765061080, 764219522, 763339043, 762485087, 761680603, 760789692, 759773314, 758814394, 757981718, 757125616, 756164432, 755183578, 754275143, 753425777, 752519846, 751507461, 750496984, 749602139, 748766124, 747839332, 746815920, 745855391, 745025694, 744170666, 743207574, 742266834, 741416395, 740581512, 739705443, 738805115, 737946033, 737157404, 736359477, 735487759, 734592080, 733768582, 733011425, 732202888, 731281459, 730337441, 729485333, 728644967, 727649450, 726557136, 725552619, 724618554, 723612070, 722503424, 721402168, 720389545, 719392240, 718338728, 717286229, 716304660, 715371192, 714419782, 713422298, 712434769, 711544931, 710716963, 709823549, 708861709, 707947731, 707125545, 706322134, 705437839, 704491258, 703608990, 702815413, 702000260, 701087177, 700150788, 699312210, 698524117, 697609305]
2769.7F97609305j040995r86576q94487r54032j092672j141369j114309j103282j162410
2788.1F88119173j285911j336813j270055j258672j382529j491607j467466j422763
2804.4F77203357j517713j656175j673936j624346j623154j736283j899719j942218
2820.7F63529813j914799j991272k144754k263546k324700k419830k649366k975166
2837F44846380l356099l855110m511118n259215n843044n923748n363047m287422l065526
2855.4F03382051k116323j709163j939416k607584l340006l832280l897250l551602
2871.7E80388427k951622k206445j463532r92299q80539r30786j014531j140952j313329
2890.1E67494392j537978j774907j969040k127528k326608k624988k959550l278792
$$ y = [697609305, 696568310, 695581734, 694687247, 693733215, 692640543, 691499174, 690384865, 689281583, 688119173, 686833262, 685496449, 684226394, 682967722, 681585193, 680093586, 678626120, 677203357, 675685644, 674029469, 672355533, 670731187, 669108033, 667371750, 665472031, 663529813, 661615014, 659623742, 657478988, 655215442, 652890742, 650470912, 647821546, 644846380, 641490281, 637635171, 633124053, 627864838, 622021794, 616098046, 610734999, 606447577, 603382051, 601265728, 599556565, 597617149, 595009565, 591669559, 587837279, 583940029, 580388427, 577436805, 575230360, 573766828, 572774529, 571893990, 570963204, 569948673, 568807721, 567494392, 565956414, 564181507, 562212467, 560084939, 557758331, 555133343, 552173793, 548895001]
2906.4E48895001l647983m156828m776597n307316n533874n408228m957795m167795
2922.7E10938585l103316j901805p14779L48389J370191K417505L330946L924191M173696
2941E20783603M098416L633797K839029J963853J215578O77645M53710O49274J230538
2959.4E37545443K043545K877295L618896M253626M745185N114496N343616N337417
2975.7E70879519N167842M967928M694044M304171L849983L364563K892316K430319
2992F02550685J882732J270473O83010J62840k42055n71549q47399r99749j029968
3010.4F02859020r93192r73105j049400j181781j332104j568258j846016j992762j966238
3028.7E89956164j878380j825989j869738j977265k035975k072752k168536k272963
$$ y = [548895001, 545247018, 541090190, 536313593, 531006277, 525472403, 520064175, 515106380, 510938585, 507835269, 505933464, 505218685, 505567074, 506937265, 509354770, 512685716, 516609907, 520783603, 524882019, 528515816, 531354845, 533318698, 534534276, 535211921, 535665631, 536314905, 537545443, 539588988, 542466283, 546085179, 550338805, 555083990, 560198486, 565542102, 570879519, 576047361, 581015289, 585709333, 590013504, 593863487, 597228050, 600120366, 602550685, 604433417, 605703890, 606386900, 606549740, 606307685, 605736136, 604888737, 603888988, 602859020, 601865828, 600892723, 599843323, 598661542, 597329438, 595761180, 593915164, 591922402, 589956164, 588077784, 586251795, 584382057, 582404792, 580368817, 578296065, 576127529, 573854566]
3045.1E73854566k317310k310753k290606k306521k349198k346754k276838k154231
3061.4E55502355k014756j893878j758456j617074j548350j528025j456082j339495
3077.7E42346239j292229j317501j305043j215756j086057r84489r71199r87768r79602
3096E32206595r93669j048446j113593j153171j170874j203835j267433j322747j355111
3114.4E21577716j384080j441776j595140j743078j744449j700521j734197j822591
3130.7E08411884j891672j900435j885116j916110k011419k066910k076685k134681
3147D92528856k128929k050787k084613k201200k244562k233088k240389k236545k218187
3165.4D72890556k232433k268403k278418k258986k228349k223671k258599k279460
$$ y = [573854566, 571537256, 569226503, 566935897, 564629376, 562280178, 559933424, 557656586, 555502355, 553487599, 551593721, 549835265, 548218191, 546669841, 545141816, 543685734, 542346239, 541054010, 539736509, 538431466, 537215710, 536129653, 535145164, 534173965, 533186197, 532206595, 531212926, 530164480, 529050887, 527897716, 526726842, 525523007, 524255574, 522932827, 521577716, 520193636, 518751860, 517156720, 515413642, 513669193, 511968672, 510234475, 508411884, 506520212, 504619777, 502734661, 500818551, 498807132, 496740222, 494663537, 492528856, 490399927, 488349140, 486264527, 484063327, 481818765, 479585677, 477345288, 475108743, 472890556, 470658123, 468389720, 466111302, 463852316, 461623967, 459400296, 457141697, 454862237]
3181.7D54862237k247751k206921k196700k171039k153546k159476k126426k098173
3198D37502205k090931k018779j936048j951039j964510j867622j794129j830489j880348
3216.4D20168310j879930j834869j816541j844883j851142j849174j877010j918406
3232.7D05296355k015262k159030k221375k199352k207667k277463k366990k427757
3249C87421459k454549k460152k439380k454489k514154k523005k457917k372116k306520
3267.4C65439177k225578k103865j969070j816570j660496j535684j422137j289010
3283.7C51416767j111985r21100p97540p41929o72608n50509m35412l70204l06905
3302C45508575k18808j76341j93685k05308j88589j30505n3167m1723r2358j08242
$$ y = [454862237, 452614486, 450407565, 448210865, 446039826, 443886280, 441726804, 439600378, 437502205, 435411274, 433392495, 431456447, 429505408, 427540898, 425673276, 423879147, 422048658, 420168310, 418288380, 416453511, 414636970, 412792087, 410940945, 409091771, 407214761, 405296355, 403281093, 401122063, 398900688, 396701336, 394493669, 392216206, 389849216, 387421459, 384966910, 382506758, 380067378, 377612889, 375098735, 372575730, 370117813, 367745697, 365439177, 363213599, 361109734, 359140664, 357324094, 355663598, 354127914, 352705777, 351416767, 350304782, 349383682, 348586142, 347844213, 347171605, 346621096, 346185684, 345815480, 345508575, 345289767, 345113426, 344919741, 344714433, 344525844, 344395339, 344342172, 344300449, 344208091, 344099849]
3322.4C44099849o3419n7012j21087j29073j05679j43111j95861k41190k94656l33994
3342.8C42414767l65466m06385m06712m20541n21540n95242n48750m64261m51863m96417
3363.2C37737590n23359n31971n36889n57035n81175n47350m96715m54306m04537l73274
3383.6C32730979l32833j92642n8412j34170k82705k51532n8353Q2284J967j66386
3404C31338197j28031O6817J87814K01166J87606J87456K15531K96741M42684O10143
3424.4C33606124P25984Q30561Q76338R23097J020670R32187P58916Q27998J060098
3442.8C41561973J210034J262486J292825J343727J394510J478374J594961J628995
3459.1C52767885J567781J607924J848221K001554J826584J552761J568377J800388
$$ y = [344099849, 344036430, 343979418, 343858331, 343729258, 343623579, 343480468, 343284607, 343043417, 342748761, 342414767, 342049301, 341642916, 341236204, 340815663, 340294123, 339698881, 339150131, 338685870, 338234007, 337737590, 337214231, 336682260, 336145371, 335588336, 335007161, 334459811, 333963096, 333508790, 333104253, 332730979, 332398146, 332205504, 332147092, 332012922, 331730217, 331478685, 331420332, 331502616, 331504583, 331338197, 331210166, 331276983, 331464797, 331665963, 331853569, 332041025, 332256556, 332553297, 332995981, 333606124, 334332108, 335162669, 336039007, 336962104, 337982774, 338914961, 339673877, 340501875, 341561973, 342772007, 344034493, 345327318, 346671045, 348065555, 349543929, 351138890, 352767885, 354335666, 355943590, 357791811, 359793365, 361619949, 363172710, 364741087, 366541475]
3475.4C66541475K014339K059758J947075J980126K132207K116084K066225K128869
3491.7C82986158K161294K210141K258390K236128K235770K185076K075553K148837
3508D00497347K376795K557248K544761K380430K363295K508461K637237K582997K423555
3526.4D22872126K474219K715975K867907K922773K908975K826244K892405K990633
3542.7D45471257K968699K933442K937556K983451L123670L255546L287852L331781
3559D70293254L298044L050297K948136L564924M230707M080773L766924L796816L924608
3577.4E02954483M035592M100025L918648L718078L984034M417240M298985M114032
3593.7E35541117M293263M458368M449666M462778M327595L963113L957629M239977
$$ y = [366541475, 368555814, 370615572, 372562647, 374542773, 376674980, 378791064, 380857289, 382986158, 385147452, 387357593, 389615983, 391852111, 394087881, 396272957, 398348510, 400497347, 402874142, 405431390, 407976151, 410356581, 412719876, 415228337, 417865574, 420448571, 422872126, 425346345, 428062320, 430930227, 433853000, 436761975, 439588219, 442480624, 445471257, 448439956, 451373398, 454310954, 457294405, 460418075, 463673621, 466961473, 470293254, 473591298, 476641595, 479589731, 483154655, 487385362, 491466135, 495233059, 499029875, 502954483, 506990075, 511090100, 515008748, 518726826, 522710860, 527128100, 531427085, 535541117, 539834380, 544292748, 548742414, 553205192, 557532787, 561495900, 565453529, 569693506]
3610E69693506M277408M223823L990531L886342M423857M629493M092157L464281L725470
3628.4F06406868M865944M883408M328490M050672L851175L740490L576874L092110
3644.7F38796031K528966K872109M081130M179716L420055L379703L645956L290833
3661F66194499K854049K614617K133906J866519K423644K319456J925647K665222K968013
3679.4F87965572K568245K189100J682460J223922J325249J917482K139807J866519
3695.7G02878356J539409J401663J567662J876294J776100J314222J068473J544953
3712G14967132K158939J905084J299322R35316Q21233Q44895J008749J125575P64727
3730.3G25830972K21372K41458J049161J675904J191318R1255p391J070916R28224
$$ y = [569693506, 573970914, 578194737, 582185268, 586071610, 590495467, 595124960, 599217117, 602681398, 606406868, 611272812, 616156220, 620484710, 624535382, 628386557, 632127047, 635703921, 638796031, 641324997, 644197106, 648278236, 652457952, 655878007, 659257710, 662903666, 666194499, 669048548, 671663165, 673797071, 675663590, 678087234, 680406690, 682332337, 684997559, 687965572, 690533817, 692722917, 694405377, 695629299, 696954548, 698872030, 701011837, 702878356, 704417765, 705819428, 707387090, 709263384, 711039484, 712353706, 713422179, 714967132, 717126071, 719031155, 720330477, 721265793, 722087026, 722931921, 723940670, 725066245, 725830972, 726052344, 726293802, 727342963, 729018867, 730210185, 730301440, 730294049, 731364965, 732293189]
3748.7G32293189M23610J120209J577199J122832P10488Q60929R24945O58631N10276
3767.1G40202308M98473P31290R72688Q02040M99606M22180N97477O45220N67198O14762
3787.5G46553242O39439N33461K59340L4154J19626K39Q8811P89046P71165O49750
3807.8G50438273R50634P37906M0352k97665K0742R4533N27084J102269P78317M29213
3828.2G54821658K91705J57118J22428p6115o3956N20647Q76903Q78573P40349K77221
3848.6G58546531o07967j244903Q9646J573443J187205K92003j60753O3479K14219
3867G59952903o2287J57297N93185P08878N55813K9982L5583L67404K62975L29972
3887.4G62931705K32398M4107M06623M64201j03831m79817k97606K04026P49886Q80003
$$ y = [732293189, 732716799, 733837008, 735414207, 736537039, 737247527, 738108456, 739033401, 739692032, 740202308, 740700781, 741432071, 742404759, 743206799, 743706405, 744128585, 744726062, 745371282, 745938480, 746553242, 747192681, 747726142, 747985482, 748019636, 748139262, 748139501, 748228312, 749017358, 749788523, 750438273, 751388907, 752126813, 752167165, 751869500, 751890242, 751984775, 752511859, 753614128, 754392445, 754821658, 755113363, 755270481, 755392909, 755316794, 755252838, 755773485, 756650388, 757528961, 758269310, 758546531, 757938564, 756693661, 756783307, 758356750, 759543955, 759835958, 759675205, 759738684, 759952903, 759890616, 760047913, 760641098, 761349976, 761905789, 761935771, 761971354, 762338758, 762601733, 762931705, 763164103, 763208210, 763614833, 764079034, 763975203, 763495386, 763197780, 763401806, 764151692, 765031695]
3907.8G65031695N40197J82629o7413k51532r7572K64108K78055J05799J64926K01463
3928.2G66352355M5538R1672L35694L52323J99735K8551o7354Q1838J74641R6798J48296
3950.6G67840087K53737K42591J64390Q3387r477m292J33634K02656J72615J50859
3971G69230187J66595J77801J35719N2035K3604J01208J42396Q4698P3373J31965J09911
3993.4G70429492N9426J02639
3997.5G70591557
$$ y = [765031695, 765571892, 765754521, 765687108, 765435576, 765338004, 765602112, 765880167, 765985966, 766150892, 766352355, 766397893, 766489565, 766825259, 767177582, 767377317, 767405868, 767338514, 767420352, 767594993, 767691791, 767840087, 768093824, 768336415, 768500805, 768584192, 768574715, 768570423, 768704057, 768906713, 769079328, 769230187, 769396782, 769574583, 769710302, 769762337, 769785941, 769887149, 770029545, 770114243, 770187616, 770319581, 770429492, 770488918, 770591557]
##END=$$ End of the data block
