##TITLE=G18-51-CE $$ Begin of the data block
##JCAMP-DX=5.00 $$ ACD/SpecManager v 10.08
##SPECTROMETER/DATA SYSTEM=Alpha
##DATE=23 Oct 2013 10:11:40
##DATA TYPE=INFRARED SPECTRUM
##DATA CLASS=XYDATA
##ORIGIN=
##OWNER=
##NPOINTS=1765
##FIRSTX=399.75695801
##LASTX=3997.56933594
##MAXX=3997.56933594
##MINX=399.75695801
##MAXY=0.83208239
##MINY=0.32180926
##XFACTOR=1.0000000000
##YFACTOR=1.000000000000000e-9
##FIRSTY=0.60410655
##DELTAX=2.03957629
##XUNITS=1/CM
##YUNITS=ARBITRARY UNITS
##XYDATA=(X++(Y..Y))
399.8 604106545 600670874 598313332 597029030 596056700 594866753 594354451 595271409 596007168 594753921
418.1 594753921 592539489 591384351 590547323 588796079 586582899 585070312 584285319 583048284 581195235
436.5 581195235 580443144 581656158 583531439 584234297 583717644 583591223 584052444 583434224 581176460
454.8 581176460 578666925 577272892 576138437 573642075 570294023 567728996 565997660 563807189
471.1 563807189 561224043 559811592 559810817 559866965 559066534 557969093 557596862 557720840 556993365 554939151
491.5 554939151 552764416 551417708 550040126 547585130 544423342 541818142 539970875 537588418
507.9 537588418 534136772 530853331 528716683 526739240 523777485 520698369 518925071 518339455 517717898
526.2 517717898 516750038 516443431 517253578 518427968 519441187 520859778 523070693 525318503 526543438
544.6 526543438 526618302 526421964 526548862 526506126 525598526 524215579 523292005 522648573 521315634 519129336
565 519129336 516873956 515283763 514310300 513565838 513298035 514132261 515989304 518195093 520397723
583.3 520397723 522661448 524960101 526833296 527863562 528268874 528632462 529133737 529370904 529198706
601.7 529198706 529158890 529510796 529913068 530160427 530215025 530347466 530989826 532091260 533409655 535098076
622.1 535098076 537412524 540145576 542831063 545183301 547279775 549384058 551424205 553035259
638.4 553035259 554249883 555374086 556507528 557541549 558273375 558731198 559209824 559720993 559941828
656.7 559941828 559916556 560120523 560740590 561350167 561459780 561648905 562869012 564473569 565984070
675.1 565984070 567204773 568403542 569918990 571419954 572394907 572901547 573328257 573740780 573686659
693.5 573686659 572901428 571902931 571575820 572273195 573574603 575004458 576821625 579479933 582619727
711.8 582619727 585531592 588267267 591518283 595565856 599770904 603503764 607097983 610919297
728.1 610919297 614538550 617308021 619212508 620894849 622626603 623840749 624073982 623881757 624095917
746.5 624095917 624573350 624492586 623711407 622837007 622245729 621720970 620965898 620307565 620577514 622157931
766.9 622157931 624499679 627151132 630431175 634609163 639125288 643073320 646288037 649330616
783.2 649330616 652442813 655104399 656889498 658242643 660019219 662357807 664669335 666796029
799.5 666796029 669396579 672771633 676024854 678239942 679708064 681213737 682746887 683594108 683463573
817.9 683463573 682973385 682610095 681920052 680258095 677889228 675775230 674205661 672459424 670069516
836.2 670069516 667605698 665685654 664088309 662289143 660423040 659190536 658776999 658538699 657942057
854.6 657942057 657370150 657607973 659010351 661486506 664867043 669151366 674134016 678860545 682318985
872.9 682318985 684489965 685857236 686259389 685003221 682035267 678273916 674564838 670819938 666558266
891.3 666558266 662006676 657898247 654287934 650395215 645659208 640395224 635089755 629558921
907.6 629558921 623393714 616821647 610646844 605436862 601083815 597365916 594577014 593055189
923.9 593055189 592416167 591863692 591136932 590694308 590825677 591062784 590860426 590329230 589720249 588454306
944.3 588454306 585304379 579730809 572467029 564533114 556234717 547341883 537897289 528394699
960.6 528394699 519044578 509504855 499590516 489719719 480488330 472098291 464421183 457521141
977 457521141 451770514 447351903 443935841 441041440 438509762 436447650 434834987 433364004 431857020
995.3 431857020 430536777 429698557 429355621 429146200 428631037 427731276 426613808 425273180 423626870
1013.7 423626870 421795249 420016110 418302089 416346103 413941294 411253899 408579767 406009883
1030 406009883 403447360 400878966 398445010 396228433 394135177 392084956 390221626 388718188 387600094
1048.3 387600094 386878133 386612564 386931986 387922227 389441729 391240984 393326223 395779520 398175508
1066.7 398175508 399618387 399505645 398277223 397144288 397025466 398105949 400300413 403555542 407679170
1085 407679170 412212551 416686535 420955718 425074667 428903490 432087898 434459955 436198086 437681407
1103.4 437681407 439238071 440989137 443023771 445469618 448277593 451164871 453848839 456240028
1119.7 456240028 458388835 460372180 462294430 464377731 466918677 469909340 472902507 475381196
1136 475381196 477075040 478006452 478325874 478159964 477642506 477017134 476565242 476402849 476555020 477197915
1156.4 477197915 478640050 481052905 484302968 488102108 492269754 496858507 502014756 507758200
1172.7 507758200 513955355 520452738 527143896 533838332 540209234 545963824 551038384 555489540
1189.1 555489540 559152544 561683595 563001752 563425422 563298047 562694371 561660469 560539782 559721887
1207.4 559721887 559272468 558972418 558590829 558108151 557616293 557021558 556094170 554781795 553274989
1225.8 553274989 551743507 550117970 548379421 546773434 545593262 544903696 544562161 544570148 545138776
1244.1 545138776 546363413 548044980 549905896 551847935 553960264 556247830 558498085 560551882
1260.4 560551882 562503695 564530551 566623390 568599403 570368886 572013676 573520899 574743927
1276.8 574743927 575638413 576413274 577332199 578426421 579516530 580419481 581105769 581517577 581448317
1295.1 581448317 580743790 579518437 578049958 576507092 574848354 573049843 571340501 569976151
1311.4 569976151 569034934 568466902 568241596 568380594 568759024 568992257 568675995 567647457 566023290
1329.8 566023290 564059615 561969519 559905767 558062494 556755126 556029677 555519283 554918468 554146528
1348.1 554146528 553201914 552045763 550595939 548855007 546870828 544520915 541666269 538342893
1364.5 538342893 534624696 530839622 527586818 524653614 521455050 517963767 514161646 509953320
1380.8 509953320 505596995 501713514 498917460 497463554 496767491 496098757 495460510 495256752 495627254
1399.1 495627254 496491760 497642100 499182016 501181841 503355145 505512834 507556021 509478092
1415.5 509478092 511615396 514529765 517624021 520317018 522773445 524763823 526031077 526487052
1431.8 526487052 526094496 525149047 524560153 524561703 524621785 524671316 524839878 525167763 525456727 525440276
1452.2 525440276 525427938 526553273 529778361 533407390 536366165 539340615 542905509 546877801 551702917
1470.5 551702917 558633029 566640973 573398113 578284860 581348717 582856417 582711518 580596566
1486.8 580596566 576587617 571630061 566646755 560731411 553286314 546020269 539735436 533471823
1503.2 533471823 525027275 513588488 504059374 496401519 488665581 481495768 475998968 472491741
1519.5 472491741 469820946 467288047 464628547 461746901 459146023 456644982 454178452 452262223
1535.8 452262223 450496137 448733300 448354959 449371427 451053679 453266531 456157804 459685206
1552.1 459685206 463492125 467165947 471887439 478628635 484000266 488017529 491705835 495211959
1568.4 495211959 498818427 501771450 503855646 505958021 508030891 509425402 510152340 510494649 510507762
1586.8 510507762 510097027 509062707 507342577 504993618 502128839 498606205 494160712 488816142
1603.1 488816142 482726365 475851506 467960954 459328502 450327456 440099090 428228796 417445272
1619.4 417445272 406863987 394461840 382159710 370799094 359998345 350472540 341525465 332519710
1635.7 332519710 326425701 323618740 322299808 321809262 322175235 323623121 325263292 327151418 330703169
1654.1 330703169 334756702 338567734 343028694 348755002 355446428 361889869 368827254 377058029
1670.4 377058029 385030836 393196821 402253509 410840362 418768436 427569896 439341813 451198637
1686.7 451198637 461732149 473157823 485064596 499120146 515542448 532244205 550844669
1701 550844669 566798449 579820693 592522800 603518963 612637699 620311201 627013206 633870900
1717.3 633870900 640612125 646044731 650461793 654374003 657686472 660504699 662859738 665433407
1733.6 665433407 668774843 671905220 674955726 678467035 682277679 686280668 690627337 695766509
1749.9 695766509 701700151 707296371 712457359 717546880 722294927 727021754 731586993 735501826
1766.3 735501826 738953054 742147505 745540500 749243617 752483189 755110502 757499099 759821355
1782.6 759821355 761997223 764012575 765696585 767022789 768645763 770619750 772333264 773718536
1798.9 773718536 775144577 776746631 778279722 779594123 780774713 782028139 783340573 784557879
1815.2 784557879 785679281 786786795 787762880 788529932 789309740 790170014 791080415 792231977 793402016
1833.6 793402016 794314086 795149982 795886695 796256125 796538472 797378302 798496723 799404323 800081015
1851.9 800081015 800649166 801224470 801773250 802266061 802726388 803137898 803375304 803587973 804170787 804973483
1872.3 804973483 805653632 806182325 806618392 807004273 807413816 807878554 808302164 808615863 809013128 809533477
1892.7 809533477 810008824 810447454 810858667 811226189 811570227 811894298 812156618 812379479 812678456 813010216
1913.1 813010216 813182831 813238561 813472450 813857198 814253807 814664781 814953089 815117419 815302074 815515816
1933.5 815515816 815711439 815864146 815920889 815927148 816086471 816383958 816618562 816795290 816986561 817178011
1953.9 817178011 817373991 817584872 817798376 817986488 818103373 818159878 818307042 818582416 818816900 818929970
1974.3 818929970 819000483 819115520 819271624 819419682 819499969 819533110 819584131 819657683 819751620 819864988 819982946
1996.7 819982946 820112765 820235014 820273459 820227802 820173681 820153654 820117891 820002496 819827914 819711208
2017.1 819711208 819700956 819650471 819472671 819261849 819127560 819027781 818878949 818697393 818565249 818488359
2037.5 818488359 818372667 818201661 818051219 817989111 817966938 817900896 817825258 817834556 817912400 817948401 817923605
2060 817923605 817925751 818001568 818116486 818202257 818227589 818263590 818352282 818448067 818492174 818514824 818592429 818724871
2084.4 818724871 818864107 818955421 819014728 819116592 819272041 819382131 819423437 819499671 819646060 819807827
2104.8 819807827 819939971 820048511 820166409 820300758 820409060 820461154 820505500 820628881 820789337 820877910
2125.2 820877910 820911109 820977926 821109295 821233392 821286798 821324348 821436226 821589112 821692646 821748078
2145.6 821748078 821818590 821947277 822112978 822239339 822318971 822448313 822672725 822917283 823087156 823226750
2166 823226750 823459387 823794484 824114203 824348748 824587345 824889600 825188339 825435877 825664937 825945020
2186.4 825945020 826280653 826573670 826783121 827004194 827306330 827595949 827770531 827928483 828196943 828499258
2206.8 828499258 828720987 828894138 829103649 829362690 829598308 829734743 829827249 830006897 830271304 830490053
2227.2 830490053 830606878 830689490 830818415 830974221 831062794 831083119 831141114 831274152 831386805 831414759
2247.6 831414759 831430078 831507504 831597149 831622541 831620336 831641614 831700206 831791401 831843972 831823230 831836760 831932366
2272.1 831932366 831988573 831970453 831971109 832026958 832082391 832044184 831891119 831730843 831627548 831492543 831277251
2294.5 831277251 831072748 830935240 830774486 830509603 830166340 829819798 829491854 829135180 828747749 828359783
2314.9 828359783 827925861 827388287 826814294 826299012 825854301 825470984 825138450 824795008 824436128 824126542
2335.3 824126542 823809922 823412955 823072970 823063731 823519230 824028313 823961198 823138475 821911156 820870519
2355.7 820870519 820143461 819610715 819397449 819555581 819923639 820298016 820718825 821313143 821984887 822586417
2376.1 822586417 823075473 823505402 823909402 824217200 824305534 824155152 823891759 823630273 823361218 823035657
2396.5 823035657 822678506 822351396 822043836 821686208 821262419 820817351 820418179 820063055 819667637 819198489
2416.9 819198489 818718433 818286896 817844629 817323804 816756785 816196501 815692484 815239012 814751506 814219594
2437.3 814219594 813699663 813183427 812627792 812027812 811456084 810969114 810490072 809940398 809352517 808799088
2457.7 808799088 808295429 807775676 807214737 806655943 806141853 805680811 805183232 804596901 804013133 803498089
2478.1 803498089 802999020 802455783 801889360 801356792 800880969 800409257 799891472 799373031 798898220 798444927
2498.5 798444927 797966719 797453642 796966970 796534240 796084762 795588553 795130670 794742107 794321179 793804586
2518.9 793804586 793245196 792737663 792293131 791820526 791289687 790755689 790248990 789739907 789174795 788565695
2539.2 788565695 787980199 787437856 786887586 786298752 785721004 785198987 784700930 784147501 783539534 782986164
2559.6 782986164 782510281 782007813 781436265 780871212 780359209 779846549 779279709 778698325 778177083 777685285
2580 777685285 777136385 776546717 775995612 775478959 774933994 774333417 773719490 773144662 772598863 772020817
2600.4 772020817 771382987 770757139 770181060 769583702 768884242 768096507 767314374 766568244 765803039 764965534
2620.8 764965534 764089346 763271213 762507319 761653364 760668755 759704828 758830845 757936954 756954789 755952597
2641.2 755952597 755025923 754177988 753282249 752275646 751266003 750345170 749476850 748569489 747596025
2659.6 747596025 746669292 745851099 744992018 744019151 743071496 742230475 741418064 740567148 739696383 738854945
2680 738854945 738072932 737282038 736394763 735473573 734649360 733900964 733087003 732162952 731234193 730376720
2700.4 730376720 729499578 728485525 727400124 726386011 725429535 724421918 723325491 722210467 721171379
2718.7 721171379 720193684 719173729 718104541 717106760 716210306 715300620 714313984 713339925 712459266
2737.1 712459266 711629152 710760355 709817111 708877504 708022654 707215428 706359029 705439746 704576015 703789651
2757.5 703789651 702935636 701982915 701049626 700205326 699403524 698517501 697510481 696518302 695604801
2775.8 695604801 694635034 693521857 692369878 691283405 690211535 689041734 687743604 686409235
2792.2 686409235 685129285 683869839 682528853 681074321 679592311 678116024 676579058 674970388
2808.5 674970388 673334658 671696007 670025229 668257535 666371524 664459705 662587941 660633445
2824.8 660633445 658492804 656216502 653859437 651411235 648776770 645822704 642460167 638577342
2841.1 638577342 634029090 628754854 622913599 616989732 611613274 607283294 604195774 602102757
2857.4 602102757 600413561 598487139 595880687 592513561 588673353 584792256 581236422 578258574
2873.7 578258574 576008797 574512541 573535085 572688460 571763992 570736110 569588125 568262875 566704452
2892.1 566704452 564931095 562975287 560835302 558490813 555872858 552932799 549663067 545999944
2908.4 545999944 541834950 537082553 531786859 526244462 520841002 515875995 511678278 508570552
2924.7 508570552 506707728 506030023 506377101 507724702 510113418 513406992 517344594 521591842 525711179
2943.1 525711179 529323816 532198668 534220517 535435081 536085546 536557734 537261367 538523018 540547371
2961.4 540547371 543407321 547018349 551230907 555956304 561114430 566516399 571889997 577086449
2977.8 577086449 582084239 586790264 591102362 594979405 598357856 601225078 603622377 605504513
2994.1 605504513 606826961 607589424 607789636 607528448 606944501 606100440 605114520 604137361 603193879
3012.4 603193879 602238894 601213217 600040913 598673105 597106636 595337570 593390882 591416717
3028.7 591416717 589567721 587789297 585902572 583891213 581848979 579752445 577569067 575341523
3045.1 575341523 573061466 570740938 568442822 566124022 563771546 561459124 559214711 557048798
3061.4 557048798 554998994 553132772 551433802 549791038 548181772 546659529 545243740 543907940
3077.7 543907940 542571485 541226387 539961755 538782895 537669361 536641598 535650551 534643173
3094 534643173 533636332 532627583 531589448 530508101 529387236 528243959 527056456 525766730 524399281
3112.4 524399281 523042202 521696866 520276964 518700123 516993880 515232861 513437390 511635542
3128.7 511635542 509820402 507958949 506073236 504182220 502235413 500175834 498076349 496018887
3145 496018887 493964612 491890252 489818633 487707019 485502928 483264506 481027752 478771150 476535201
3163.4 476535201 474323153 472074121 469802737 467546284 465296507 463054776 460804641 458553314
3179.7 458553314 456321687 454083920 451834768 449598849 447393596 445211262 443052441 440935791
3196 440935791 438855171 436803848 434798688 432836264 430882007 428924173 427022487 425192982 423339427
3214.3 423339427 421435833 419550061 417713076 415916622 414098799 412203282 410270005 408353269
3230.7 408353269 406435758 404420644 402274460 400071800 397849470 395602793 393308312 390939951
3247 390939951 388504505 386025429 383539885 381060004 378548801 376013905 373505771 371055931 368673354
3265.3 368673354 366357535 364154279 362069219 360067546 358194590 356495261 354954481 353562295
3281.6 353562295 352330446 351257026 350318044 349488854 348737568 348089099 347593158 347176433 346761644
3300 346761644 346392661 346127301 345927596 345728397 345539212 345374227 345242649 345153391 345071048 344977617
3320.4 344977617 344890624 344814599 344714344 344577193 344454110 344327629 344128400 343895167 343682110 343428224
3340.8 343428224 343093663 342721403 342341781 341949493 341506451 340973645 340384662 339820027 339285433 338761955
3361.2 338761955 338269055 337815166 337380171 336882859 336242259 335551471 334961265 334475517 334062070 333664596
3381.6 333664596 333285630 333018333 332877576 332793593 332643837 332372010 332118183 332062989 332139134 332096457
3402 332096457 331899792 331789792 331858575 332005143 332182735 332369506 332572997 332866818 333240747 333660632
3422.4 333660632 334232718 334981680 335812747 336668491 337619513 338688403 339647442 340402305 341217786
3440.7 341217786 342277735 343472809 344723076 346042991 347414285 348823816 350300223 351861358
3457 351861358 353477508 355062902 356685966 358557194 360585690 362392008 363873273 365403712 367225826
3475.4 367225826 369255632 371326238 373320073 375325173 377434701 379526258 381560802 383684963
3491.7 383684963 385903478 388160944 390407175 392626792 394888818 397133589 399272561 401435167
3508 401435167 403780192 406326979 408895791 411296070 413655400 416177124 418871611 421495289 423943073
3526.4 423943073 426488519 429258764 432102501 434980124 437891155 440777302 443727136 446761101
3542.7 446761101 449784309 452746570 455696076 458719462 461869925 465113997 468407005 471766561
3559 471766561 475107700 478246301 481285006 484849304 488973945 492946506 496690750 500551403 504573047
3577.4 504573047 508648753 512754261 516777158 520625532 524608970 529001892 533349812 537520409
3593.7 537520409 541883349 546423316 550904214 555364847 559708476 563679278 567586362 571779132
3610 571779132 576094747 580415010 584493756 588425875 592850924 597471952 601613998 605184734 608982205
3628.4 608982205 613798678 618548453 622770846 626785874 630634367 634395003 638022661 641170442
3644.7 641170442 643731833 646640182 650759101 654914558 658284009 661598265 665180266 668466926
3661 668466926 671315551 673874080 675994575 677896202 680318773 682673335 684612691 687175632 690086842
3679.4 690086842 692676604 694929600 696694672 697946846 699214041 701035023 703108132 704937160
3695.7 704937160 706439316 707810879 709349275 711232960 713105440 714546204 715641022 717040062
3712 717040062 719028473 720877588 722188830 723152876 724025667 724923193 725936949 727057636 727832079
3730.3 727832079 728099763 728481591 729611516 731214583 732359886 732495487 732506275 733551323 734485805
3748.7 734485805 734891295 735932827 737435758 738527000 739218175 740056336 740969360 741616547 742146552
3767.1 742146552 742688596 743432939 744393766 745167494 745591879 745903671 746446609 747124374 747747123 748367667
3787.5 748367667 748985469 749531925 749839365 749933779 750101745 750133932 750219822 750999570 751777470 752383471
3807.8 752383471 753283501 754035890 754137576 753922701 754019439 754095972 754467726 755448222 756215334 756668091
3828.2 756668091 756966233 757125318 757322311 757354558 757260025 757644117 758448184 759286761 759984672 760310769
3848.6 760310769 759850979 758711100 758766055 760272384 761422873 761741757 761641741 761690915 761890769
3867 761890769 761866748 761990547 762494981 763126612 763649166 763726115 763808668 764188111 764488101 764878392
3887.4 764878392 765148461 765126586 765377581 765771747 765743315 765358448 765038431 765139043 765860140 766792178
3907.8 766792178 767380714 767623246 767638981 767436862 767323136 767530262 767741323 767782509 767899215 768086553
3928.2 768086553 768118620 768178999 768545449 769017041 769288957 769273937 769178331 769255400 769366503 769410312 769572735
3950.6 769572735 769868791 770089746 770169497 770258009 770375848 770461380 770578504 770723045 770844162 770979047
3971 770979047 771148860 771310508 771417677 771464109 771542668 771698475 771799386 771822572 771930397 772147059
3991.4 772147059 772304237 772349775 772404015
3997.5 772404015
##END=$$ End of the data block
