##TITLE=G17-52-SE $$ Begin of the data block
##JCAMP-DX=5.00 $$ ACD/SpecManager v 10.08
##SPECTROMETER/DATA SYSTEM=Alpha
##DATE=21 Oct 2013 11:04:12
##DATA TYPE=INFRARED SPECTRUM
##DATA CLASS=XYDATA
##ORIGIN=
##OWNER=
##NPOINTS=1765
##FIRSTX=399.75695801
##LASTX=3997.56933594
##MAXX=3997.56933594
##MINX=399.75695801
##MAXY=0.78774649
##MINY=0.14435722
##XFACTOR=1.0000000000
##YFACTOR=1.000000000000000e-9
##FIRSTY=0.40974548
##DELTAX=2.03957629
##XUNITS=1/CM
##YUNITS=ARBITRARY UNITS
##XYDATA=(X++(Y..Y))
$$ plain form
399.8 409745485 407444209 406012952 404073715 402503222 402438015 402964085 403109908 403252870 403252840 401992530
420.2 401992530 399954408 398468077 397447258 395666748 393300712 391830623 390920430 389539689 388923556
438.5 388923556 390250057 392048895 392944485 393771410 394889712 394965231 393626839 392512470 391863704
456.9 391863704 389958829 387110591 384973466 383273482 380616426 377369404 374906987 372940928
473.2 372940928 370634824 368568033 367460549 366611809 365215659 364105403 363878369 363158762 361220390
491.5 361220390 359302074 357802361 355694622 353029937 350659043 348285973 345146269 341715187
507.9 341715187 338907450 336283952 333084404 329882473 327522010 325570226 323454320 321858913
524.2 321858913 321328521 321198016 321048468 321593642 323320240 325524241 327582210 329912961 332430273
$$ packed form
399.8D09745485k301276j431257j939237j570493o5207N26070J45823J42962l0j260310
420.2D01992530k038122j486331j020819j780510k366036j470089r10193j380741o16133
438.5C88923556J326501J798838Q95590Q26925J118302P5519j338392j114369o48766
456.9C91863704j904875k848238k137125j699984k657056l247022k462417j966059
473.2C72940928k306104k066791j107484q48740j396150j110256k27034p19607j938372
491.5C61220390j918316j499713k107739k664685k370894k373070l139704l431082
507.9C41715187k807737k623498l199548l201931k360463j951784k115906j595407
524.2C21858913n30392j30505j49548N45174J726598K204001K057969K330751K517312
$$ plain form
542.5 332430273 333824366 333660066 333059222 332594186 331576943 329871804 328305393 326895952 324877501
560.9 324877501 322313011 319953650 317743182 315222949 313058466 312240183 312528998 313283801 314804494
579.2 314804494 317457110 320618749 323467076 326017529 328350455 329835683 330200285 330338001 330867887
597.6 330867887 331076890 330651581 330541372 331037283 331317157 331290811 331672609 332466930 333010375 333441764
618 333441764 334840536 337349623 340017200 342572093 345532000 348664612 351207763 353327155 355688035
636.3 355688035 357990891 359573901 360849351 362562895 364271194 365181863 365650237 366365403 366974264
654.7 366974264 366943538 366925538 367540926 368170351 368616968 369845152 371745884 372555196 373101652 374459952
675.1 374459952 376619577 378625244 380028248 381392747 382840484 383695871 383868009 383984745 383871734
$$ packed form
542.5C32430273J394093j64300o00844m65036j017243j705139j566411j409441k018451
560.9C24877501k564490k359361k210468k520233k164483q18283K88815P54803J520693
579.2C14804494K652616L161639K848327K550453K332926J485228L64602J37716N29886
597.6C30867887K09003m25309j10209M95911K79874k6346L81798P94321N43445M31389
618C33441764J398772K509087K667577K554893K959907L132612K543151K119392K360880
636.3C55688035K302856J583010J275450J713544J708299R10669M68374P15166O08861
654.7C66974264l0726j8000O15388O29425M46617J228184J900732Q09312N46456J358300
675.1C74459952K159625K005667J403004J364499J447737Q55387J72138J16736j13011
$$ plain form
693.5 383871734 382814348 381243765 380461842 380784154 381560326 382797033 385076195 388047963 390905321
711.8 390905321 393972278 398040324 402742237 407204092 411781371 417216003 422824383 427477986
728.1 427477986 431565195 435849160 439513355 441722065 443359047 445244402 446496606 446512610 446291924
746.5 446291924 446504056 446270823 445081264 443859845 442989796 441721112 440187335 439657509 440530300
764.8 440530300 442176282 444713145 449057907 454903245 460764378 466325581 472321779 478237689
781.2 478237689 482765764 486227661 489791751 493149310 495420873 497323513 500118673 503538311
797.5 503538311 506756246 510237575 514550090 518662930 521502018 523687243 526014686 527683079
813.8 527683079 528039277 528076172 528336227 527698338 525574803 522927880 520392597 517467916 514035821
$$ packed form
693.5C83871734j057386j570583p81923L22312P76172J236707K279162K971768K857358
711.8C90905321L066957M068046M701913M461855M577279N434632N608380M653603
728.1D27477986M087209M283965L664195K208710J636982J885355J252204J6004k20686
746.5D46291924K12132k33233j189559j221419q70049j268684j533777n29826Q72791
764.8D40530300J645982K536863M344762N845338N861133N561203N996198N915910
781.2D78237689M528075L461897L564090L357559K271563J902640K795160L419638
797.5E03538311L217935L481329M312515M112840K839088K185225K327443J668393
813.8E27683079L56198L6895K60055o37889k123535k646923k535283k924681l432095
$$ plain form
832.1 514035821 510940909 508242726 505066156 501509607 498575181 496396601 494279563 492332220
848.5 492332220 491231829 490665078 489785999 488838315 488896698 490508527 493699044 498736709 505635142
866.8 505635142 513188422 519870698 525351763 529660463 531894684 531375587 528797030 525042474 520016193
885.2 520016193 513738930 507309258 501525640 495950103 490221351 484844416 479906648 474416852
901.5 474416852 467780918 460594207 453243852 445264041 436703324 428522974 421296328 414890528
917.8 414890528 409536839 405882865 403797865 402325749 400997728 400127381 399679184 399090737 398297966
936.2 398297966 397715181 397194773 395934522 393210679 388489962 381336957 371950835 361379117 350587368
954.5 350587368 339704245 328539014 317328572 306417078 295672923 284950018 274631292
$$ packed form
832.1E14035821l094912k698183l176570l556549k934426k178580k117038j947343
848.5D92332220j100391n66751q79079r47684N8383J611829L190517N037665O898433
866.8E05635142P553280O682276N481065M308700K234221n19097k578557l754556n026281
885.2E20016193o277263o429672n783618n575537n728752n376935m937768n489796
901.5D74416852o635934p186711p350355p979811q560717q180350p226646o405800
917.8D14890528n353689l653974k085000j472116j328021q70347m48197n88447p92771
936.2C98297966n82785n20408j260251k723843m720717p153005r386122j0571718j0791749
954.5C50587368j0883123j1165231j1210442j0911494j0744155j0722905j0318726
$$ plain form
968.8 274631292 265191942 256716073 249178112 242787331 237698689 233732209 230611011 228173807
985.1 228173807 226272881 224653661 223124117 221735150 220633239 219835848 219324932 219187841 219321564
1003.5 219321564 219257265 218626529 217522234 216159225 214549810 212758422 211031720 209398478 207654372
1021.8 207654372 205741897 203742847 201721966 199691609 197698593 195807621 193926334 191923693
1038.1 191923693 189895719 188028812 186347529 184758663 183337450 182373196 181998760 182121649 182698786
1056.5 182698786 183769315 185254112 187025145 189004838 190918207 192096144 191956684 190843120
1072.8 190843120 189859509 189836353 190943629 193149224 196372882 200279057 204428226 208618402 212767705
1091.2 212767705 216622189 219945565 222729862 225017428 226749241 228022471 229278505 230945587
$$ packed form
968.8B74631292r439350q475869p537961o390781n088642l966480l121198k437204
985.1B28173807j900926j619220j529544j388967j101911p97391n10916j37091J33723
1003.5B19321564o4299o30736j104295j363009j609415j791388j726702j633242j744106
1021.8B07654372j912475j999050k020881k030357j993016j890972j881287k002641
1038.1A91923693k027974j866907j681283j588866j421213r64254l74436J22889N77137
1056.5A82698786J070529J484797J771033J979693J913369J177937j39460j113564
1072.8A90843120r83611k3156J107276K205595L223658L906175M149169M190176M149303
1091.2B12767705L854484L323376K784297K287566J731813J273230J256034J667082
$$ plain form
1107.5 230945587 233055338 235463992 238155395 241048709 243868142 246370658 248544395 250541687
1123.8 250541687 252522439 254656821 257187337 260085255 262845993 265020996 266516179 267301500
1140.1 267301500 267349333 266881645 266265810 265694052 265200198 264903039 265076548 265931338 267533153 269980013
1160.5 269980013 273342043 277495742 282207429 287366211 293114722 299597323 306718349 314293772
1176.8 314293772 322177529 330151737 337911278 345239282 352007866 357911646 362550080 365801334
1193.1 365801334 367767781 368530124 368277371 367436618 366380692 365259081 364217073 363507032 363149107
1211.5 363149107 362832546 362338811 361672431 360806197 359578282 357908189 355944276 353836834 351576030
1229.9 351576030 349280864 347256511 345645458 344417721 343690544 343661249 344318479 345522046 347198218
$$ packed form
1107.5B30945587K109751K408654K691403K893314K819433K502516K173737J997292
1123.8B50541687J980752K134382K530516K897918K760738K175003J495183P85321
1140.1B67301500M7833m67688o15835n71758m93854k97159J73509Q54790J601815K446860
1160.5B69980013L362030M153699M711687N158782N748511O482601P121026P575423
1176.8C14293772P883757P974208P759541P328004O768584N903780M638434L251254
1193.1C65801334J966447P62343k52753q40753j055926j121611j042008p10041l57925
1211.5C63149107l16561m93735o66380q66234j227915j670093j963913k107442k260804
1229.9C51576030k295166k024353j611053j227737p27177k9295O57230J203567J676172
$$ plain form
1248.2 347198218 349324465 351763427 354330450 356962413 359644651 362279147 364760101 367142856
1264.5 367142856 369560629 372012496 374357879 376488060 378334761 379850000 381090641 382267386
1280.8 382267386 383563817 384957045 386344075 387673348 388816118 389442176 389336586 388565928 387270629
1299.2 387270629 385561913 383596331 381535023 379457742 377456814 375686496 374339670 373533875
1315.5 373533875 373232663 373325288 373621404 373711854 373175055 371849209 369843632 367436588 364942163
1333.9 364942163 362677634 360818148 359376222 358325362 357598990 356993467 356215119 355068654 353585720
1352.2 353585720 351869613 349947453 347811133 345284611 342055142 338186860 334078819 330058485
1368.5 330058485 326626867 323603898 320332468 316827238 313166559 309197843 305180281 301724166
$$ packed form
1248.2C47198218K126247K438962K567023K631963K682238K634496K480954K382755
1264.5C67142856K417773K451867K345383K130181J846701J515239J240641J176745
1280.8C82267386J296431J393228J387030J329273J142770O26058j05590p70658j295299
1299.2C87270629j708716j965582k061308k077281k000928j770318j346826q05795
1315.5C73533875l01212R2625K96116R0450n36799j325846k005577k407044k494425
1333.9C64942163k264529j859486j441926j050860p26372o05523p78348j146465j482934
1352.2C53585720j716107j922160k136320k526522l229469l868282m108041m020334
1368.5C30058485l431618l022969l271430l505230l660679l968716m017562l456115
$$ plain form
1384.9 301724166 299173295 297662109 297015607 296701372 296405464 296247154 296325803 296823442 297853380
1403.2 297853380 299291015 300969094 302783549 304702133 306677669 308767527 311094731 313724875
1419.5 313724875 316369444 318932950 321382970 323381722 324628770 325149834 325174987 324544191 323628962
1437.9 323628962 323426366 323855191 324491113 325173199 325822145 326405257 326946139 327768385 329539597
1456.2 329539597 332587332 336020023 339466423 343210936 347508937 352769285 359872371 369554639
1472.6 369554639 379783481 388322532 395065933 400040597 403260767 404603451 403914899 400930971
1488.9 400930971 396078974 390802085 384738654 376965642 368967265 361974031 355569899 347342014
1505.2 347342014 334991306 323720872 314723015 306131631 298624247 293100387 289690107 286917180
$$ packed form
1384.9C01724166k550871j511186o46502l14235k95908j58310P8649M97639J029938
1403.2B97853380J437635J678079J814455J918584J975536K089858K327204K630144
1419.5C13724875K644569K563506K450020J998752J247048N21064K5153o30796r15229
1437.9C23628962k02596M28825O35922O82086O48946N83112N40882Q22246J771212
1456.2C29539597L047735L432691L446400L744513M298001N260348P103086R682268
1472.6C69554639J0228842Q539051O743401M974664L220170J342684o88552k983928
1488.9D00930971m851997n276889o063431p773012p998377o993234o404132q227885
1505.2C47342014j2350708j1270434q997857q591384p507384n523860l410280k772927
$$ plain form
1521.5 286917180 284027874 281122088 277997464 275248230 272801667 270241886 268366754 267267346
1537.8 267267346 266049266 265193462 265523911 266813725 268916070 271845311 275518447 279750079 284252435
1556.2 284252435 289488822 295244187 299610704 303373545 307057977 310453236 313585997 316169679
1572.5 316169679 318225712 319854856 321029067 321803361 322101712 322052062 321714431 320981771 319664180
1590.9 319664180 317741364 315183431 312020510 308204114 303593606 298209757 292120546 285273761
1607.2 285273761 277471244 269106895 260745019 251388043 240177020 230079263 220575988 209388450
1623.5 209388450 198239893 188051403 178386375 170051277 162503242 154647306 148909926 146085352
1639.8 146085352 144760549 144357219 144692704 145783752 147246867 149159729 152001783 155032709 158217624
$$ packed form
1521.5B86917180k889306k905786l124624k749234k446563k559781j875132j099408
1537.8B67267346j218080q55804L30449J289814K102345K929241L673136M231632M502356
1556.2B84252435N236387N755365M366517L762841L684432L395259L132761K583682
1572.5C16169679K056033J629144J174211P74294K98351m9650l37631p32660j317591
1590.9C19664180j922816k557933l162921l816396m610508n383849o089211o846785
1607.2B85273761p802517q364349q361876r356976j1211023j0097757r503275j1187538
1623.5B09388450j1148557j0188490r665028q335098p548035p855936n737380k824574
1639.8A46085352j324803m03330L35485J091048J463115J912862K842054L030926L184915
$$ plain form
1658.2 158217624 162238300 167401299 173432603 179528177 186427966 194537714 202362180 210588187
1674.5 210588187 219746977 228653878 237425059 247549534 260625482 273412466 285199851 298593760
1690.8 298593760 313099623 330622137 351065159 371657997 393909156 412480950 427711397
1705.1 427711397 442489028 455134779 465755820 475020766 483369619 491251737 498012900 503396511
1721.4 503396511 508035302 512149751 515591085 518622994 521321118 523616016 525887132 528508365
1737.7 528508365 531621099 535403073 540002823 545705855 552645445 560707510 569472492 578098595
1754 578098595 586735129 595333934 603354931 611279190 618849397 625702798 632140815 638251364 644132197
1772.4 644132197 649451971 654022753 658324122 662435651 666031480 669195712 672340095 675449789
$$ packed form
1658.2A58217624M020676N162999O031304O095574O899789Q109748P824466Q226007
1674.5B10588187R158790Q906901Q771181J0124475J3075948J2786984J1787385J3393909
1690.8B98593760J4505863J7522514K0443022K0592838K2251159J8571794J5230447
1705.1D27711397J4777631J2645751J0621041R264946Q348853P882118O761163N383611
1721.4E03396511M638791M114449L441334L031909K698124K294898K271116K621233
1737.7E28508365L112734L781974M599750N703032O939590Q062065Q764982Q626103
1754E78098595Q636534Q598805Q020997P924259P570207O853401O438017O110549N880833
1772.4F44132197N319774M570782M301369M111529L595829L164232L144383L109694
$$ plain form
1788.7 675449789 678106964 680477083 683000922 685510993 687692821 689745247 691938281 694075644
1805 694075644 695977569 697776973 699670851 701520979 703201532 704856455 706630111 708324969 709789336
1823.4 709789336 711258471 712829292 714198589 715400815 716758907 718140662 719338953 720448196
1839.7 720448196 721609235 722654223 723545551 724462867 725473940 726512909 727384269 728160441 729023576
1858 729023576 729931116 730710030 731435537 732205868 732847691 733367562 734028220 734872580 735689223 736339331
1878.4 736339331 736955345 737724960 738553703 739274859 739883125 740535557 741243839 741806507 742326140 742965579
1898.8 742965579 743556499 743962526 744397104 744974434 745458722 745773315 746175945 746728361 747126520 747367442
1919.2 747367442 747733593 748208046 748587370 748827219 749124229 749528289 749792755 749899149 750155032 750555933
$$ packed form
1788.7F75449789K657175K370119K523839K510071K181828K052426K193034K137363
1805F94075644J901925J799404J893878J850128J680553J654923J773656J694858J464367
1823.4G09789336J469135J570821J369297J202226J358092J381755J198291J109243
1839.7G20448196J161039J044988Q91328R17316J011073J038969Q71360P76172Q63135
1858G29023576R07540P78914P25507P70331O41823N19871O60658Q44360Q16643O50108
1878.4G36339331O16014P69615Q28743P21156O08266O52432P08282N62668N19633O39439
1898.8G42965579N90920M06027M34578N77330M84288L14593M02630N52416L98159K40922
1919.2G47367442L66151M74453L79324K39849K97010M04060K64466J06394K55883M00901
$$ plain form
1939.6 750555933 750756979 750784576 751018107 751401126 751644969 751818955 752124965 752484500 752688527 752831578
1960 752831578 753135622 753500044 753688812 753833175 754136503 754430294 754565775 754696846 754951537 755175769
1980.4 755175769 755255997 755343080 755576193 755782783 755786180 755771756 755931318 756093204 756100416 756113231 756209850
2002.8 756209850 756217241 756059051 755928755 755901873 755789816 755506217 755231977 755053401 754774451 754379272
2023.2 754379272 754076183 753875196 753571510 753176451 752884924 752684951 752392828 752008140 751742601 751610696
2043.6 751610696 751430869 751197040 751091599 751110792 751078486 751011789 751073539 751205623 751236558 751233220 751355886
2066.1 751355886 751567304 751682103 751727939 751872361 752046585 752083123 752073884 752201200 752388656 752461612
2086.5 752461612 752505898 752708375 752942681 753047764 753148377 753364325 753577769 753711045 753888667 754148662
$$ packed form
1939.6G50555933K01046K7597K33531L83019K43843J73986L06010L59535K04027J43051
1960G52831578L04044L64422J88768J44363L03328K93791J35481J31071K54691K24232
1980.4G55175769Q0228Q7083K33113K06590L397j4424J59562J61886P212J2815R6619
2002.8G56209850P391j58190j30296k6882j12057k83599k74240j78576k78950l95179
2023.2G54379272l03089k00987l03686l95059k91527j99973k92123l84688k65539j31905
2043.6G51610696j79827k33829j05441J9193l2306o6697O1750J32084L0935l338J22666
2066.1G51355886K11418J14799M5836J44422J74224L6538r239J27316J87456P2956
2086.5G52461612M4286K02477K34306J05083J00613K15948K13444J33276J77622K59995
$$ plain form
2106.9 754148662 754340351 754400313 754506648 754730821 754909575 754973173 755064726 755240321 755350411 755364954
2127.3 755364954 755468488 755713105 755891263 755967677 756124735 756345212 756468236 756523967 756659210 756863952
2147.7 756863952 757021606 757158756 757404029 757704675 757920563 758124471 758478463 758913636 759281278 759666860
2168 759666860 760198712 760772288 761231482 761654317 762186468 762747347 763208866 763660729 764203072 764736056
2188.4 764736056 765165746 765590429 766103208 766600072 766997516 767390132 767854989 768311143 768689692 769082487
2208.8 769082487 769565701 770026326 770372450 770736098 771194935 771586061 771820486 772077620 772470057 772824824
2229.2 772824824 773027539 773225904 773522794 773792803 773950398 774105370 774346411 774576068 774710596 774867773
2249.6 774867773 775130510 775359333 775455892 775588453 775835097 776008308 776055932 776135385 776321590 776530921
$$ packed form
2106.9G54148662J91689N9962J06335K24173J78754O3598R1553J75595J10090J4543
2127.3G55364954J03534K44617J78158P6414J57058K20477J23024N5731J35243K04742
2147.7G56863952J57654J37150K45273L00646K15888K03908L53992M35173L67642L85582
2168G59666860N31852N73576M59194M22835N32151N60879M61519M51863N42343N32984
2188.4G64736056M29690M24683N12779M96864L97444L92616M64857M56154L78549L92795
2208.8G69082487M83214M60625L46124L63648M58837L91126K34425K57134L92437L54767
2229.2G72824824K02715J98365K96890K70009J57595J54972K41041K29657J34528J57177
2249.6G74867773K62737K28823R6559J32561K46644J73211M7624P9453J86205K09331
$$ plain form
2270 776530921 776656568 776730716 776839435 776876450 776784241 776788414 776986957 777152359 777214348 777382135 777670979
2292.5 777670979 777871192 777976692 778188646 778493106 778738320 779039264 779593647 780262947 780744255 781014502
2312.9 781014502 781389177 782086134 782898724 783573031 784103513 784566283 785017073 785467565 785773814 785793960
2333.3 785793960 785627127 785496473 785545707 785431683 784354389 782193899 780643463 780897796 782537222
2351.6 782537222 784631491 786471903 787627995 787746489 786983371 785626054 783672333 781202018 778651237
2370 778651237 776301026 774068177 771952093 770108998 768538058 767122388 765930712 765120447 764581978
2388.3 764581978 764045179 763473809 762992203 762563288 762028396 761393130 760790288 760218740 759570539 758834302
2408.7 758834302 758141160 757513523 756800711 755997479 755240321 754489183 753630102 752750158 751944423 751125693
$$ packed form
2270G76530921J25647P4148J08719L7015r2209M173J98543J65402O1989J67787K88844
2292.5G77670979K00213J05500K11954L04460K45214L00944N54383O69300M81308K70247
2312.9G81014502L74675O96957Q12590O74307N30482M62770M50790M50492L06249K0146
2333.3G85793960j66833j30654M9234j14024j077294k160490j550436K54333J639426
2351.6G82537222K094269J840412J156092J18494p63118j357317j953721k470315k550781
2370G78651237k350211k232849k116084j843095j570940j415670j191676q10265n38469
2388.3G64581978n36799n71370m81606m28915n34892o35266o02842n71548o48201p36237
2408.7G58834302o93142o27637p12812q03232p57158p51138q59081q79944q05735q18730
$$ plain form
2429.1 751125693 750211239 749286532 748465478 747652888 746701419 745714903 744832695 743957996 742984176 742016017
2449.5 742016017 741155267 740286231 739311218 738346040 737491965 736656964 735758483 734863818 734022141 733171761
2469.9 733171761 732258976 731348753 730496526 729633570 728718638 727824807 726995111 726162076 725291133 724446654
2490.3 724446654 723673820 722903013 722055674 721224129 720517397 719837189 719071746 718290925 717555881 716791093
2510.7 716791093 715968907 715175927 714449048 713702142 712880492 712085128 711363435 710571289 709650695 708746970
2531.1 708746970 707907379 707010031 706034243 705093265 704202235 703279495 702345908 701475918 700633407 699735403
2551.5 699735403 698817134 697972357 697149813 696229279 695275068 694439411 693667352 692801058 691873908 691016912
2571.9 691016912 690191388 689297557 688387394 687543929 686722875 685827434 684899867 684045613 683207452 682301700
$$ packed form
2429.1G51125693r14454r24707q21054q12590r51469r86516q82208q74699r73820r68159
2449.5G42016017q60750q69036r75013r65178q54075q35001q98481q94665q41677q50380
2469.9G33171761r12785r10223q52227q62956r14932q93831q29696q33035q70943q44479
2490.3G24446654p72834p70807q47339q31545p06732o80208p65443p80821p35044p64788
2510.7G16791093q22186p92980p26879p46906q21650p95364p21693p92146r20594r03725
2531.1G08746970q39591q97348r75788r40978q91030r22740r33587q69990q42511q98004
2551.5F99735403r18269q44777q22544r20534r54211q35657p72059q66294r27150q56996
2571.9F91016912q25524q93831r10163q43465q21054q95441r27567q54254q38161r05752
$$ plain form
2592.3 682301700 681396604 680544972 679664433 678690672 677698731 676762998 675777435 674667895 673557103
2610.6 673557103 672475457 671284795 669962049 668664038 667424917 666091502 664651632 663225651
2626.9 663225651 661801100 660291195 658726633 657217383 655751646 654222846 652657807 651159346
2643.3 651159346 649715424 648228109 646683097 645164847 643684864 642179251 640652835 639166117
2659.6 639166117 637712061 636234641 634756804 633344471 631962240 630532742 629090190 627725661
2675.9 627725661 626424193 625101924 623761714 622482181 621255159 619992971 618712068 617462695
2692.2 617462695 616171837 614765167 613312304 611909688 610507369 609029353 607531548 606053174
2708.5 606053174 604514003 602901757 601311386 599774361 598211288 596582115 595007122 593564510
$$ packed form
2592.3F82301700r05096q51632q80539r73761r91941r35733r85563j109540j110792
2610.6F73557103j081646j190662j322746j298011j239121j333415j439870j425981
2626.9F63225651j424551j509905j564562j509250j465737j528800j565039j498461
2643.3F51159346j443922j487315j545012j518250j479983j505613j526416j486718
2659.6F39166117j454056j477420j477837j412333j382231j429498j442552j364529
2675.9F27725661j301468j322269j340210j279533j227022j262188j280903j249373
2692.2F17462695j290858j406670j452863j402616j402319j478016j497805j478374
2708.5F06053174j539171j612246j590371j537025j563073j629173j574993j442612
$$ plain form
2724.8 593564510 592159688 590722978 589315712 587977588 586639941 585282385 583984375 582732677
2741.2 582732677 581437230 580117404 578858316 577665567 576447964 575184345 573968887 572781980
2757.5 572781980 571515441 570226133 569008648 567784488 566476285 565130591 563797057 562446237
2773.8 562446237 561023355 559531271 558012068 556456506 554816008 553101063 551343322 549541950
2790.1 549541950 547679305 545738041 543746829 541730642 539659441 537528336 535350621 533088207
2806.4 533088207 530731559 528344095 525913894 523362875 520689189 517939746 515143991 512272298
2822.7 512272298 509266078 506131470 502866924 499391466 495632976 491584837 487215668 482339472
2839.1 482339472 476669818 470023751 462385029 453947634 445295751 437363565 431056947 426761001
$$ packed form
2724.8E93564510j404822j436710j407266j338124j337647j357556j298010j251698
2741.2E82732677j295447j319826j259088j192749j217603j263619j215458j186907
2757.5E72781980j266539j289308j217485j224160j308203j345694j333534j350820
2773.8E62446237j422882j492084j519203j555562j640498j714945j757741j801372
2790.1E49541950j862645j941264j991212k016187k071201k131105k177715k262414
2806.4E33088207k356648k387464k430201k551019k673686k749443k795755k871693
2822.7E12272298l006220l134608l264546l475458l758490m048139m369169m876196
2839.1D82339472n669654o646067p638722q437395q651883p932186o306618m295946
$$ plain form
2855.4 426761001 424078882 422157645 420122325 417260438 413308650 408563167 403584242 398918390
2871.7 398918390 395018399 392127365 390099555 388532877 387134671 385784358 384348154 382694840
2888 382694840 380804390 378720045 376442403 373923987 371166945 368206978 364977539 361344963 357255042
2906.4 357255042 352683902 347530782 341699779 335271716 328537554 321902573 315838635 310809493
2922.7 310809493 307146341 304990977 304326415 305064708 307113558 310383171 314697862 319750249 325171947
2941 325171947 330483764 335170984 338963419 341826409 343830913 345155448 346176088 347455442 349457681
2959.4 349457681 352387130 356275350 361081958 366703629 372968167 379703194 386710703 393738061
2975.7 393738061 400618851 407264829 413518608 419212133 424279362 428734481 432581067 435766309
$$ packed form
2855.4D26761001k682119j921237k035320k861887l951788m745483m978925m665852
2871.7C98918390l899991k891034k027810j566678j398206j350313j436204j653314
2888C82694840j890450k084345k277642k518416k757042k959967l229439l632576m089921
2906.4C57255042m571140n153120n831003o428063o734162o634981o063938n029142
2922.7C10809493l663152k155364o64562P38293K048850L269613M314691N052387N421698
2941C25171947N311817M687220L792435K862990K004504J324535J020640J279354K002239
2959.4C49457681K929449L888220M806608N621671O264538O735027P007509P027358
2975.7C93738061O880790O645978O253779N693525N067229M455119L846586L185242
$$ plain form
2992 435766309 438209146 439902902 440886676 441146731 440743089 439831495 438573390 437124431 435632348
3010.4 435632348 434243172 433022648 431867093 430608243 429140121 427390069 425303310 422955215
3026.7 422955215 420543969 418156147 415731132 413228959 410666317 408025920 405277133 402453154
3043 402453154 399587780 396668136 393705785 390782118 387911826 384995699 382010698 379088283 376357466
3061.4 376357466 373798668 371341974 369030178 366926551 364964366 363036066 361125767 359299779
3077.7 359299779 357577473 355892718 354228914 352661401 351227283 349879473 348568231 347253025
3094 347253025 345900804 344521075 343115360 341656804 340157986 338621706 337028652 335398644 333727092
3112.4 333727092 331986636 330202520 328393042 326496542 324467152 322387248 320346743 318293691
$$ packed form
2992D35766309K442837J693756R83774K60055m03642r11594j258105j448959j492083
3010.4D35632348j389176j220524j155555j258850j468122j750052k086759k348095
3026.7D22955215k411246k387822k425015k502173k562642k640397k748787k823979
3043D02453154k865374k919644k962351k923667k870292k916127k985001k922415k730817
3061.4C76357466k558798k456694k311796k103627j962185j928300j910299j825988
3077.7C59299779j722306j684755j663804j567513j434118j347810j311242j315206
3094C47253025j352221j379729j405715j458556j498818j536280j593054j630008j671552
3112.4C33727092j740456j784116j809478j896500k029390k079904k040505k053052
$$ plain form
3128.7 318293691 316149324 313934058 311699033 309431374 307122767 304815680 302511662 300173134
3145 300173134 297799021 295417845 293035835 290628523 288194329 285782784 283382565 280960590 278552294
3163.4 278552294 276157051 273728073 271267116 268849164 266491681 264114380 261709213 259348661
3179.7 259348661 257009923 254645109 252289236 249980778 247752294 245589510 243433982 241287842
3196 241287842 239181086 237118945 235114619 233161449 231238231 229346976 227476001 225614205 223796710
3214.3 223796710 222029462 220273197 218528107 216802761 215067506 213293612 211518228 209741473
3230.7 209741473 207906142 206009984 204072475 202126265 200165749 198144659 196065992 193981230
3247 193981230 191911831 189807251 187653229 185490146 183320269 181135580 178967297 176857710 174828514
$$ packed form
3128.7C18293691k144367k215266k235025k267659k308607k307087k304018k338528
3145C00173134k374113k381176k382010k407312k434194k411545k400219k421975k408296
3163.4B78552294k395243k428978k460957k417952k357483k377301k405167k360552
3179.7B59348661k338738k364814k355873k308458k228484k162784k155528k146140
3196B41287842k106756k062141k004326j953170j923218j891255j870975j861796j817495
3214.3B23796710j767248j756265j745090j725346j735255j773894j775384j776755
3230.7B09741473j835331j896158j937509j946210j960516k021090k078667k084762
3247A93981230k069399k104580k154022k163083k169877k184689k168283k109587k029196
$$ plain form
3265.3 174828514 172886804 171045274 169324487 167720392 166216224 164819241 163531348 162355453
3281.6 162355453 161306977 160392106 159613520 158957332 158365369 157799676 157305717 156907097 156570539
3300 156570539 156315282 156131566 155933872 155757070 155655131 155552357 155421779 155315325 155250937 155223861
3320.4 155223861 155213058 155182213 155107439 154970512 154843420 154796883 154739231 154611066 154436275 154191822
3340.8 154191822 153920189 153669685 153411418 153149262 152862161 152512744 152115852 151734889 151429042 151173666
3361.2 151173666 150884137 150532141 150154456 149757788 149319053 148893148 148557663 148264021 147966057 147672042
3381.6 147672042 147399962 147196919 147126943 147140145 147052541 146818548 146574125 146462053 146509156 146553069
3402 146553069 146478176 146423846 146468893 146563932 146705896 146910161 147154674 147388533 147632211 147964597 148442298
$$ packed form
3265.3A74828514j941710j841530j720787j604095j504168j396983j287893j175895
3281.6A62355453j048476r14871p78586o56188n91963n65693m93959l98620l36558
3300A56570539k55257j83716j97694j76802j01939j02774j30578j06454o4388k7076
3320.4A55223861j0803l0845p4774j36927j27092m6537n7652j28165j74791k44453
3340.8A54191822k71633k50504k58267k62156k87101l49417l96892l80963l05847k55376
3361.2A51173666k89529l51996l77685l96668m38735m25905l35485k93642k97964k94015
3381.6A47672042k72080k03043o9976J3202q7604k33993k44423j12072M7103M3913
3402A46553069p4893n4330M5047R5039J41964K04265K44513K33859K43678L32386M77701
$$ plain form
3424.4 148442298 149073824 149825796 150565326 151295736 152108356 152880907 153560013 154287964 155139238 156074598
3444.8 156074598 157072350 158113420 159210950 160391316 161638483 162925914 164231777 165527850
3461.1 165527850 166883588 168428168 170114413 171688110 172989070 174265981 175790295 177563012
3477.4 177563012 179398075 181115806 182808399 184630364 186521277 188413486 190356120 192344829
3493.8 192344829 194355994 196349919 198363170 200420022 202415705 204371199 206407532 208543360
3510.1 208543360 210800260 213123813 215355366 217564553 219939947 222527355 225098953 227492139
3526.4 227492139 229891345 232470289 235222116 238103002 240974396 243737862 246597618 249668032
3542.7 249668032 252801925 255850583 258908957 262055188 265278190 268627286 272072315 275597632
$$ packed form
3424.4A48442298O31526P51972P39530P30410Q12620P72551O79106P27951Q51274R35360
3444.8A56074598R97752J041070J097530J180366J247167J287431J305863J296073
3461.1A65527850J355738J544580J686245J573697J300960J276911J524314J772717
3477.4A77563012J835063J717731J692593J821965J890913J892209J942634J988709
3493.8A92344829K011165J993925K013251K056852J995683J955494K036333K135828
3510.1B08543360K256900K323553K231553K209187K375394K587408K571598K393186
3526.4B27492139K399206K578944K751827K880886K871394K763466K859756L070414
3542.7B49668032L133893L048658L058374L146231L223002L349096L445029L525317
$$ plain form
3559 275597632 279257357 282993078 286671221 290504664 294653147 298863173 303048134 307358563 311837196
3577.4 311837196 316449970 321208745 326047421 330797464 335477591 340415329 345501959 350545019
3593.7 350545019 355684578 361001670 366348594 371658534 377015203 382318795 387579232 392963529
3610 392963529 398469418 404099196 409744650 415269971 420960397 426822454 432591766 438021719 443097472
3628.4 443097472 448496521 454159826 459695637 465107679 470427722 475783139 481272846 486692131
3644.7 486692131 491700858 496366858 501277924 506402731 511188090 515870035 520764351 525492847
3661 525492847 529972851 534495711 538799345 542529702 546403885 550382733 553618729 556864500 560574889
3679.4 560574889 564244270 567919374 571504116 574490309 576801538 579288721 582218587 585097671
$$ packed form
3559B75597632L659725L735721L678143L833443M148483M210026M184961M310429M478633
3577.4C11837196M612774M758775M838676M750043M680127M937738N086630N043060
3593.7C50545019N139559N317092N346924N309940N356669N303592N260437N384297
3610C92963529N505889N629778N645454N525321N690426N862057N769312N429953N075753
3628.4D43097472N399049N663305N535811N412042N320043N355417N489707N419285
3644.7D86692131N008727M666000M911066N124807M785359M681945M894316M728496
3661E25492847M480004M522860M303634L730357L874183L978848L235996L245771L710389
3679.4E60574889L669381L675104L584742K986193K311229K487183K929866K879084
$$ plain form
3695.7 585097671 587714314 590012014 591947317 593980789 596381307 598662138 600240946 601284266
3712 601284266 602885306 605043769 607103467 608911395 610524654 611921668 613241315 614898682 616672873
3730.3 616672873 618060410 618915796 619627059 621067584 623069704 624200284 624311566 625488877 627064466
3748.7 627064466 627489626 628082037 629744351 631393790 632378757 633279562 634510398 635683835 636677682
3767.1 636677682 637455225 638179898 639224887 640461266 641553581 642327189 643055141 643846333 644592762
3785.4 644592762 645484567 646522760 647551537 648454428 649198174 650066972 650676370 650795162 651535749
3803.8 651535749 652337134 652634740 653561771 655069590 656046569 656279445 656742096 657033503 657084525 657957137
3824.2 657957137 659040511 659847736 660481215 661081195 661901951 662396967 662266552 662417710 663001120
$$ packed form
3695.7E85097671K616643K297700J935303K033472K400518K280831J578808J043320
3712F01284266J601040K158463K059698J807928J613259J397014J319647J657367J774191
3730.3F16672873J387537Q55386P11263J440525K002120J130580J11282J177311J575589
3748.7F27064466M25160N92411J662314J649439R84967R00805J230836J173437R93847
3767.1F36677682P77543P24673J044989J236379J092315P73608P27952P91192P46429
3785.4F44592762Q91805J038193J028777R02891P43746Q68798O09398J18792P40587
3803.8F51535749Q01385K97606R27031J507819R76979K32876M62651K91407N1022Q72612
3824.2F57957137J083374Q07225O33479N99980Q20756M95016j30415J51158N83410
$$ plain form
3842.5 663001120 663713515 664776206 666193604 667089224 666158319 664996147 665938616 667425275 668300211
3860.9 668300211 668586254 668866515 669412076 669513702 669398427 669756413 670425355 671259880 671723604 671972930
3881.3 671972930 672386944 672440469 672654510 673205197 673344791 673548639 674279869 674905419 675020754 674821317
3901.7 674821317 674557507 674678206 675297022 675873995 676255167 676583290 676684797 676613033 676752269 677026808
3922.1 677026808 677156985 677307904 677591681 677748144 677831352 678103209 678433180 678699732 678921402 679052591
3942.5 679052591 679218709 679425776 679538786 679661155 679823697 679979742 680180013 680415809 680639088 680852056
3962.9 680852056 681046605 681188524 681313694 681497753 681719303 681886971 682007611 682152510 682355165 682598054
3983.2 682598054 682786703 682880461 682990551 683172584 683349133 683515608 683731675
$$ packed form
3842.5F63001120P12395J062691J417398Q95620r30905j162172R42469J486659Q74936
3860.9F68300211K86043K80261N45561J01626j15275L57986O68942Q34525M63724K49326
3881.3F71972930M14014N3525K14041N50687J39594K03848P31230O25550J15335j99437
3901.7F74821317k63810J20699O18816N76973L81172L28123J01507p1764J39236K74539
3922.1F77026808J30177J50919K83777J56463Q3208K71857L29971K66552K21670J31189
3942.5F79052591J66118K07067J13010J22369J62542J56045K00271K35796K23279K12968
3962.9F80852056J94549J41919J25170J84059K21550J67668J20640J44899K02655K42889
3983.2F82598054J88649R3758J10090J82033J76549J66475K16067
$$ plain form
3997.5 683731675
$$ packed form
3997.5F83731675
##END=$$ End of the data block
