##TITLE=G17-52-SE $$ Begin of the data block
##JCAMP-DX=5.00 $$ ACD/SpecManager v 10.08
##SPECTROMETER/DATA SYSTEM=Alpha
##DATE=21 Oct 2013 11:04:12
##DATA TYPE=INFRARED SPECTRUM
##DATA CLASS=XYDATA
##ORIGIN=
##OWNER=
##NPOINTS=1765
##FIRSTX=399.75695801
##LASTX=3997.56933594
##MAXX=3997.56933594
##MINX=399.75695801
##MAXY=0.78786302
##MINY=0.14461043
##XFACTOR=1.0000000000
##YFACTOR=1.000000000000000e-9
##FIRSTY=0.41296896
##DELTAX=2.03957629
##XUNITS=1/CM
##YUNITS=ARBITRARY UNITS
##XYDATA=(X++(Y..Y))
$$ plain form
399.8 412968963 410124987 408256501 406167388 404650807 404480428 404805213 404833436 404744238 404350340
418.1 404350340 402596384 400309324 399008662 398267835 396843940 394996852 393791825 392671496 391022861
436.5 391022861 390404284 391744643 393428415 394158393 394807994 395832807 395990103 394838989 393815815
454.8 393815815 393096834 391037762 387955159 385532349 383642554 381050020 378028959 375641912 373580694
473.2 373580694 371277273 369453937 368657231 367958933 366604716 365425259 364909500 363952994 362078786
491.5 362078786 360250473 358659416 356377572 353604406 351256549 349037945 346087158 342652380
507.9 342652380 339757532 337209314 334144622 330978066 328487277 326289713 323984325 322297603
524.2 322297603 321865916 321987092 321879029 322319895 324059725 326364815 328583300 330972403 333320498
$$ packed form
399.8D12968963k843976j868486k089113j516581j70379L24785K8223q9198l93898
418.1D04350340j753956k287060j300662p40827j423895j847088j205027j120329j648635
436.5C91022861o18577J340359J683772P29978O49601J024813J57296j151114j023174
454.8C93815815p18981k059072l082603k422810j889795k592534l021061k387047k061218
473.2C73580694k303421j823336p96706o98298j354217j179457n15759r56506j874208
491.5C62078786j828313j591057k281844k773166k347857k218604k950787l434778
507.9C42652380k894848k548218l064692l166556k490789k197564k305388j686722
524.2C22297603m31687J21176j08063M40866J739830K305090K218485K389103K348095
$$ plain form
542.5 333320498 334559441 334386408 333797187 333247811 332121044 330444902 328951269 327538997 325515568
560.9 325515568 323035151 320741057 318390965 315651357 313438445 312748641 313122451 313799500 315278232
579.2 315278232 318079472 321348071 324120700 326623887 329034239 330652207 331161618 331341654 331751525
597.6 331751525 331900030 331568450 331485182 331920683 332226276 332237542 332566321 333351165 334021121 334597796
618 334597796 335950077 338282675 340869606 343441010 346470296 349750727 352407813 354453295 356670976
636.3 356670976 358966231 360658228 362045825 363785833 365404963 366181433 366629243 367471933 368159235
654.7 368159235 368103802 368033588 368599415 369297683 369891912 371188164 373035967 373787612 374312013 375681221
675.1 375681221 377824366 379670352 380961686 382474363 384126008 385029376 385089576 385101259 385037273
$$ packed form
542.5C33320498J238943j73033n89221n49376j126767j676142j493633j412272k023429
560.9C25515568k480417k294094k350092k739608k212912o89804L73810O77049J478732
579.2C15278232K801240L268599K772629K503187K410352J617968N09411J80036M09871
597.6C31751525J48505l31580q3268M35501L05593J1266L28779P84844O69956N76675
618C34597796J352281K332598K586931K571404L029286L280431K657086K045482K217681
636.3C56670976K295255J691997J387597J740008J619130P76470M47810Q42690O87302
654.7C68159235n5433p0214N65827O98268N94229J296252J847803P51645N24401J369208
675.1C75681221K143145J845986J291334J512677J651645R03368O0200J1683o3986
$$ plain form
693.5 385037273 384097040 382598311 381837159 382176429 382953048 384096712 386249274 389219820 392183244
711.8 392183244 395330101 399382234 404001057 408441573 413077027 418540031 424138874 428792864
728.1 428792864 432865649 437093735 440714896 442949593 444626510 446489304 447700381 447712094 447522581
746.5 447522581 447751373 447495461 446272165 445004076 444080889 442778796 441249996 440723270 441558242
764.8 441558242 443165779 445737988 450204283 456174940 462068796 467579782 473565966 479519427
781.2 479519427 484039336 487431347 490948021 494317234 496592224 498507440 501312673 504659414
797.5 504659414 507810414 511350393 515738070 519787133 522507489 524708629 527129829 528807878
813.8 528807878 529129922 529134452 529312611 528553545 526379347 523822665 521372736 518404603 514924228
$$ packed form
693.5C85037273r40233j498729p61152L39270P76619J143664K152562K970546K963424
711.8C92183244L146857M052133M618823M440516M635454N463004N598843M653990
728.1D28792864M072785M228086L621161K234697J676917J862794J211077J1713j89513
746.5D47522581K28792k55912j223296j268089r23187j302093j528800n26726Q34972
764.8D41558242J607537K572209M466295N970657N893856N510986N986184N953461
781.2D79519427M519909L392011L516674L369213K274990J915216K805233L346741
797.5E04659414L151000L539979M387677M049063K720356K201140K421200J678049
813.8E28807878L22044M530J78159p59066k174198k556682k449929k968133l480375
$$ plain form
832.1 514924228 511811316 509059429 505809784 502168059 499195784 497058123 494999200 493047148
848.5 493047148 491853297 491212010 490335196 489410073 489493310 491127282 494326651 499375463 506267011
866.8 506267011 513770461 520401359 525871634 530192077 532448411 531923771 529249549 525373936 520270705
885.2 520270705 513932467 507492363 501760066 496199220 490435839 485028803 480060369 474517345
901.5 474517345 467833549 460652202 453321397 445326000 436738580 428567439 421395898 415024221
917.8 415024221 409652054 406000793 403961033 402508020 401156545 400262207 399806201 399193823 398365915
936.2 398365915 397783846 397280723 396006793 393253505 388540328 381407619 372019678 361465573 350694031
954.5 350694031 339783937 328582346 317367584 306468874 295746714 285049766 274756342
$$ packed form
832.1E14924228l112912k751887l249645l641725k972275k137661k058923j952052
848.5D93047148j193851o41287q76814r25123Q3237J633972L199369N048812O891548
866.8E06267011P503450O630898N470275M320443K256334n24640k674222l875613n103231
885.2E20270705o338238o440104n732297n560846n763381n407036m968434n543024
901.5D74517345o683796p181347p330805p995397q587420q171141p171541o371677
917.8D15024221n372167l651261k039760j453013j351475q94338m56006o12378q27908
936.2C98365915n82069n03123j273930k753288m713177p132709r387941j0554105j0771542
954.5C50694031j0910094j1201591j1214762j0898710j0722160j0696948j0293424
$$ plain form
968.8 274756342 265349597 256890506 249337226 242939889 237889409 233948424 230795771 228352189
985.1 228352189 226500124 224887908 223304406 221905559 220846176 220048964 219495147 219309419 219382107
1003.5 219382107 219301522 218741521 217678428 216258630 214604631 212835684 211129352 209492385 207749099
1021.8 207749099 205849007 203888297 201899081 199832484 197790429 195907831 194054887 192065701
1038.1 192065701 190050364 188184932 186456472 184836358 183474302 182565212 182191163 182323426 182923928
1056.5 182923928 184009060 185489923 187230766 189190298 191102892 192244515 192066669 190985560
1072.8 190985560 190057084 190039694 191133708 193326399 196495697 200342879 204494178 208708987 212839961
1091.2 212839961 216683850 220057040 222888783 225180641 226913691 228207633 229477584 231145889
$$ packed form
968.8B74756342r406745q459091p553280o397337n050480l940985l152653k443582
985.1B28352189j852065j612216j583502j398847j059383p97212n53817j85728P2688
1003.5B19382107q0585n60001j063093j419798j653999j768947j706332j636967j743286
1021.8B07749099j900092j960710j989216k066597k042055j882598j852944j989186
1038.1A92065701k015337j865432j728460j620114j362056r09090l74049J32263O00502
1056.5A82923928J085132J480863J740843J959532J912594J141623j77846j081109
1072.8A90985560r28476j7390J094014K192691L169298L847182M151299M214809M130974
1091.2B12839961L843889L373190K831743K291858J733050J293942J269951J668305
$$ plain form
1107.5 231145889 233254552 235658750 238338098 241213173 244024172 246534005 248736620 250762463
1123.8 250762463 252723366 254815072 257332802 260250807 263047516 265246630 266736776 267515510
1140.1 267515510 267593920 267150193 266505539 265908957 265423805 265134633 265293717 266142279 267764568 270217896
1160.5 270217896 273569852 277707309 282391846 287540376 293295979 299772590 306866407 314388126
1176.8 314388126 322230190 330215871 337994605 345325857 352090240 357958168 362547457 365790099
1193.1 365790099 367772341 368537962 368269086 367391944 366324008 365233004 364216805 363502234 363127261
1211.5 363127261 362804800 362311453 361647040 360789448 359574825 357919008 355956674 353836656 351567447
1229.9 351567447 349261552 347216696 345616639 344450861 343765348 343733579 344398826 345602810 347249180
$$ packed form
1107.5B31145889K108663K404198K679348K875075K810999K509833K202615K025843
1123.8B50762463J960903K091706K517730K918005K796709K199114J490146P78734
1140.1B67515510P8410m43727o44654n96582m85152k89172J59084Q48562J622289K453328
1160.5B70217896L351956M137457M684537N148530N755603O476611P093817P521719
1176.8C14388126P842064P985681P778734P331252O764383N867928M589289L242642
1193.1C65790099J982242P65621k68876q77142j067936j091004j016199p14571l74973
1211.5C63127261l22461m93347o64413q57592j214623j655817j962334k120018k269209
1229.9C51567447k305895k044856j600057j165778o85513l1769O65247J203984J646370
$$ plain form
1248.2 347249180 349367857 351848960 354471475 357118219 359753460 362323016 364789814 367207408
1264.5 367207408 369665980 372159719 374538869 376667649 378497899 380011827 381233126 382371306
1280.8 382371306 383669257 385100633 386518657 387849003 388958067 389563859 389486969 388752311 387471110
1299.2 387471110 385769576 383810163 381746769 379652739 377634019 375882089 374573499 373762816
1315.5 373762816 373431236 373508543 373791784 373874992 373335600 372000664 370001763 367606968 365099281
1333.9 365099281 362813324 360939234 359503746 358498901 357801586 357154459 356319249 355165571 353707910
1352.2 353707910 352009624 350084633 347938985 345413148 342186809 338302851 334158242 330108017
1368.5 330108017 326680809 323680162 320409864 316880822 313195974 309226602 305231035 301780850
$$ packed form
1248.2C47249180K118677K481103K622515K646744K635241K569556K466798K417594
1264.5C67207408K458572K493739K379150K128780J830250J513928J221299J138180
1280.8C82371306J297951J431376J418024J330346J109064O05792p6890p34658j281201
1299.2C87471110j701534j959413k063394k094030k018720j751930j308590q10683
1315.5C73762816l31580P7307K83241Q3208n39392j334936j998901k394795k507687
1333.9C65099281k285957j874090j435488j004845o97315o47127q35210j153678j457661
1352.2C53707910j698286j924991k145648k525837l226339l883958m144609m050225
1368.5C30108017l427208l000647l270298l529042l684848l969372l995567l450185
$$ plain form
1384.9 301780850 299214482 297703326 297068834 296759844 296462268 296314567 296443194 297010601 298088133
1403.2 298088133 299539268 301211894 303030640 304965556 306938320 308990091 311263651 313894182
1419.5 313894182 316598952 319187403 321619272 323604167 324849069 325360775 325361103 324720204 323828727
1437.9 323828727 323633552 324044824 324672788 325346917 325967222 326517344 327038795 327842921 329582393
1456.2 329582393 332651734 336141229 339574605 343274564 347578794 352842093 359895289 369515002
1472.6 369515002 379709721 388234019 394968122 399925470 403117210 404422492 403673530 400623471
1488.9 400623471 395744056 390450776 384347498 376542896 368560225 361600459 355186373 346898377
1505.2 346898377 334550589 323390126 314491659 305946529 298456401 292964935 289579600 286802590
$$ packed form
1384.9C01780850k566368j511156o34492l08990k97576j47701J28627N67407J077532
1403.2B98088133J451135J672626J818746J934916J972764K051771K273560K630531
1419.5C13894182K704770K588451K431869J984895J244902N11706L28o40899q91477
1437.9C23828727j95175M11272O27964O74129O20305N50122N21451Q04126J739472
1456.2C29582393L069341L489495L433376L699959M304230N263299P053196R619713
1472.6C69515002J0194719Q524298O734103M957348L191740J305282p48962l050059
1488.9D00623471m879415n293280o103278p804602p982671o959766o414086q287996
1505.2C46898377j2347788j1160463q898467q545130p490128n491466l385335k777010
$$ plain form
1521.5 286802590 283930302 281063765 277984828 275296181 272916615 270421416 268562138 267402947
1537.8 267402947 266165882 265428066 265855998 267190844 269334137 272287726 275953829 280169547 284639001
1556.2 284639001 289836645 295640737 300067216 303833812 307489276 310851932 313994437 316609770
1572.5 316609770 318646133 320232153 321402967 322173148 322449148 322379202 322028726 321273774 319916815
1590.9 319916815 317962348 315393597 312237561 308445513 303854018 298483014 292423636 285588592
1607.2 285588592 277784199 269451499 261112690 251723319 240449876 230320647 220816225 209636733
1623.5 209636733 198481515 188267887 178621039 170335591 162782595 154866204 149099231 146289349
1639.8 146289349 144989654 144610435 144964561 146063372 147523120 149433181 152328610 155415356 158601522
$$ packed form
1521.5B86802590k872288k866537l078937k688647k379566k495199j859278j159191
1537.8B67402947j237065p37816M27932J334846K143293K953589L666103M215718M469454
1556.2B84639001N197644N804092M426479L766596L655464L362656L142505K615333
1572.5C16609770K036363J586020J170814P70181K76000o9946l50476p54952j356959
1590.9C19916815j954467k568751l156036l792048m591495n371004o059378o835044
1607.2B85588592p804393q332700q338809r389371j1273443j0129229r504422j1179492
1623.5B09636733j1155218j0213628r646848q285448p552996p916391n766973k809882
1639.8A46289349j299695l79219L54126J098811J459748J910061K895429L086746L186166
$$ plain form
1658.2 158601522 162626609 167819753 173850492 179908499 186769411 194866508 202689335 210898191
1674.5 210898191 220072493 229010746 237767562 247852370 260903239 273702502 285502374 298863322
1690.8 298863322 313301504 330761194 351155221 371681869 393920869 412562907 427853793
1705.1 427853793 442700237 455421746 466069013 475340664 483720303 491654038 498485178 503918290
1721.4 503918290 508584201 512717068 516149104 519150555 521797180 524032831 526330411 529014409
1737.7 529014409 532143593 535951018 540608168 546322048 553208590 561239362 570043743 578699768
1754 578699768 587310135 595875800 603893399 611851275 619465649 626314282 632701337 638765097 644644320
1772.4 644644320 650004566 654604852 658891261 662968636 666573048 669788778 672963679 676032901
$$ packed form
1658.2A58601522M025087N193144O030739O058007O860912Q097097P822827Q208856
1674.5B10898191R174302Q938253Q756816J0084808J3050869J2799263J1799872J3360948
1690.8B98863322J4438182J7459690K0394027K0526648K2239000J8642038J5290886
1705.1D27853793J4846444J2721509J0647267R271651Q379639P933735O831140N433112
1721.4E03918290M665911M132867L432036L001451K646625K235651K297580K683998
1737.7E29014409L129184L807425M657150N713880O886542Q030772Q804381Q656025
1754E78699768Q610367Q565665Q017599P957876P614374O848633O387055O063760N879223
1772.4F44644320N360246M600286M286409M077375L604412L215730L174901L069222
$$ plain form
1788.7 676032901 678612888 680976033 683567405 686113477 688269198 690293014 692503572 694673598
1805 694673598 696603179 698429346 700327396 702164531 703849792 705515385 707285523 708974302 710428596
1823.4 710428596 711876929 713409603 714727819 715927899 717342794 718772173 719983637 721088409
1839.7 721088409 722221434 723215342 724097490 725054979 726082802 727109849 727990031 728804111 729696751
1858 729696751 730601668 731361151 732060075 732794106 733412623 733938277 734608233 735462308 736299992 736971438
1878.4 736971438 737601817 738373876 739177763 739844680 740415514 741087317 741837859 742426157 742960870 743618667
1898.8 743618667 744239211 744672477 745098233 745637834 746103883 746432900 746828496 747338653 747714460 747967005
1919.2 747967005 748334825 748798907 749189019 749441922 749727488 750126541 750407338 750518978 750780225 751196206
$$ packed form
1788.7F76032901K579987K363145K591372K546072K155721K023816K210558K170026
1805F94673598J929581J826167J898050J837135J685261J665593J770138J688779J454294
1823.4G10428596J448333J532674J318216J200080J414895J429379J211464J104772
1839.7G21088409J133025R93908Q82148R57489J027823J027047Q80182Q14080Q92640
1858G29696751R04917P59483O98924P34031O18517N25654O69956Q54075Q37684O71446
1878.4G36971438O30379P72059Q03887O66917N70834O71803P50542N88298N34713O57797
1898.8G43618667O20544M33266M25756N39601M66049L29017L95596N10157L75807K52545
1919.2G47967005L67820M64082L90112K52903K85566L99053K80797J11640K61247M15981
$$ plain form
1939.6 751196206 751390696 751411438 751655519 752044320 752287447 752458036 752769053 753157675 753398478 753567815
1960 753567815 753884137 754237711 754398704 754520953 754817009 755118787 755271196 755406439 755652726 755870759
1980.4 755870759 755958080 756056488 756277204 756465375 756461501 756447971 756612301 756769061 756788611 756841004 756955862
2002.8 756955862 756957054 756800175 756677270 756646156 756514192 756221056 755951703 755779922 755528808 755181015
2023.2 755181015 754902661 754684806 754350662 753927588 753618062 753426254 753156841 752780855 752495050 752332985
2043.6 752332985 752149045 751941562 751860797 751868606 751818538 751783550 751890540 752039671 752077043 752074003 752186954
2066.1 752186954 752364337 752430081 752468586 752644956 752838373 752889156 752919436 753083706 753249526 753278732
2086.5 753278732 753320873 753532231 753762364 753857315 753959775 754202902 754421651 754522324 754673839 754933000
$$ packed form
1939.6G51196206J94490K0742K44081L88801K43127J70589L11017L88622K40803J69337
1960G53567815L16322L53574J60993J22249K96056L01778J52409J35243K46287K18033
1980.4G55870759Q7321R8408K20716J88171l874j3530J64330J56760J9550N2393J14858
2002.8G56955862J192j56879j22905l1114j31964k93136k69353j71781k51114l47793
2023.2G55181015k78354k17855l34144m23074l09526j91808k69413l75986k85805j62065
2043.6G52332985j83940k07483q0765P809n0068l4988J06990J49131L7372l040J12951
2066.1G52186954J77383O5744L8505J76370J93417N0783L0280J64270J65820K9206
2086.5G53278732M2141K11358K30133R4951J02460K43127K18749J00673J51515K59161
$$ plain form
2106.9 754933000 755144238 755237460 755367696 755588651 755747378 755823612 755960584 756151378 756250322 756266713
2127.3 756266713 756395340 756651044 756805301 756869674 757036030 757263124 757379055 757433295 757600486 757831931
2147.7 757831931 757968307 758064389 758291006 758601665 758844316 759078026 759446919 759880245 760238349 760605156
2168 760605156 761126518 761703789 762168884 762604475 763140500 763697982 764174402 764642537 765176058 765686750
2188.4 765686750 766105175 766531467 767063022 767588973 767990351 768370807 768834770 769295633 769671202 770045400
2208.8 770045400 770516038 771007538 771405697 771769941 772176683 772531748 772771716 773053348 773461580 773822606
2229.2 773822606 774028659 774212539 774472356 774700165 774848759 775032103 775293767 775519490 775650859 775808632
2249.6 775808632 776057303 776266217 776370347 776529729 776785493 776966035 777042747 777152240 777338386 777510762
$$ packed form
2106.9G54933000K11238R3222J30236K20955J58727P6234J36972J90794R8944J6391
2127.3G56266713J28627K55704J54257O4373J66356K27094J15931N4240J67191K31445
2147.7G57831931J36376R6082K26617L10659K42651K33710L68893M33326L58104L66807
2168G60605156N21362N77271M65095M35591N36025N57482M76420M68135N33521N10692
2188.4G65686750M18425M26292N31555N25951M01378L80456M63963M60863L75569L74198
2208.8G70045400M70638M91500L98159L64244M06742L55065K39968K81632M08232L61026
2229.2G73822606K06053J83880K59817K27809J48594J83344K61664K25723J31369J57773
2249.6G75808632K48671K08914J04130J59382K55764J80542P6712J09493J86146J72376
$$ plain form
2270 777510762 777602553 777676463 777777970 777781785 777689278 777718782 777908027 778060794 778155088 778355181 778617680
2292.5 778617680 778757989 778836429 779060006 779360712 779599369 779917657 780447602 781024098 781446397 781758666
2312.9 781758666 782150507 782760382 783490241 784145951 784681201 785140812 785588920 786018670 786231756 786140859
2333.3 786140859 785955667 785908520 786027491 785877883 784742713 782630682 781204820 781519294 783110023
2351.6 783110023 785105824 786833167 787863016 787854552 787005544 785680354 783821166 781433880 778994381
2370 778994381 776777387 774673939 772684753 770938456 769422531 768054962 766918302 766124904 765555441
2388.3 765555441 764982164 764381647 763883114 763452947 762909651 762271821 761705458 761164248 760518551 759804130
2408.7 759804130 759128511 758477211 757745266 756966472 756247938 755520165 754658163 753742993 752903938 752084196
$$ packed form
2270G77510762R1791P3910J01507L815r2507K9504J89245J52767R4294K00093K62499
2292.5G78617680J40309P8440K23577L00706K38657L18288N29945N76496M22299L12269
2312.9G81758666L91841O09875P29859O55710N35250M59611M48108M29750K13086r0897
2333.3G86140859j85192m7147J18971j49608j135170k112031j425862L14474J590729
2351.6G83110023J995801J727343J029849q464q49008j325190j859188k387286k439499
2370G78994381k216994k103448j989186j746297j515925j367569j136660p93398n69463
2388.3G65555441n73277o00517m98533m30167n43296o37830n66363n41210o45697p14421
2408.7G59804130o75619o51300p31945p78794p18534p27773q62002r15170q39055q19742
$$ plain form
2429.1 752084196 751176178 750228703 749365807 748552620 747641385 746686220 745840013 744989872 743993580 743003309
2449.5 743003309 742160320 741315186 740343869 739388525 738553405 737706244 736755371 735823035 734982550 734120727
2469.9 734120727 733196795 732332349 731539309 730670154 729704559 728803098 728027344 727232575 726338387 725463927
2490.3 725463927 724681973 723892748 723059475 722298324 721628964 720911503 720100760 719300866 718571305 717837512
2510.7 717837512 717036784 716243982 715507567 714732230 713877857 713069677 712350428 711570621 710671902 709770679
2531.1 709770679 708911479 708016813 707064748 706130028 705230236 704306483 703389764 702542305 701708138 700816095
2551.5 700816095 699911058 699057460 698202789 697262764 696305811 695468247 694688797 693826675 692938924 692136049
2571.9 692136049 691342890 690451145 689534605 688664138 687784374 686864614 685957432 685116112 684275270 683363497
$$ packed form
2429.1G52084196r08018r47475q62896q13187r11235r55165q46207q50141r96292r90271
2449.5G43003309q42989q45134r71317r55344q35120q47161r50873r32336q40485q61823
2469.9G34120727r23932q64446p93040q69155r65595r01461p75754p94769q94188q74460
2490.3G25463927p81954p89225q33273p61151o69360p17461q10743p99894p29561p33793
2510.7G17837512q00728p92802p36415p75337q54373q08180p19249p79807q98719r01223
2531.1G09770679q59200q94666r52065r34720q99792r23753r16719q47459q34167q92043
2551.5G00816095r05037q53598q54671r40025r56953q37564p79450q62122q87751q02875
2571.9F92136049p93159q91745r16540q70467q79764r19760r07182q41320q40842r11773
$$ plain form
2592.3 683363497 682454526 681604564 680733681 679768741 678787351 677872241 676904976 675799370 674667299
2610.6 674667299 673561394 672391474 671103060 669794440 668530166 667202652 665773869 664333284
2626.9 664333284 662904561 661420405 659881532 658385932 656927109 655404449 653840005 652353227
2643.3 652353227 650929034 649425566 647848368 646326661 644852340 643335581 641793013 640293837
2659.6 640293837 638845563 637391269 635920167 634502470 633129954 631720364 630296886 628954232
2675.9 628954232 627662957 626330972 624993563 623724043 622468770 621170223 619892061 618657887
2692.2 618657887 617379487 615994930 614565611 613161027 611732423 610234380 608720243 607216537
2708.5 607216537 605667889 604075313 602506876 600975394 599407017 597777307 596205294 594753385
$$ packed form
2592.3F83363497r08971q49962q70883r64940r81390r15110r67265j105606j132071
2610.6F74667299j105905j169920j288414j308620j264274j327514j428783j440585
2626.9F64333284j428723j484156j538873j495600j458823j522660j564444j486778
2643.3F52353227j424193j503468j577198j521707j474321j516759j542568j499176
2659.6F40293837j448274j454294j471102j417697j372516j409590j423478j342654
2675.9F28954232j291275j331985j337409j269520j255273j298547j278162j234174
2692.2F18657887j278400j384557j429319j404584j428604j498043j514137j503706
2708.5F07216537j548648j592576j568437j531482j568377j629710j572013j451909
$$ plain form
2724.8 594753385 593325853 591874123 590472519 589143157 587807178 586451113 585156858 583926797
2741.2 583926797 582662821 581339419 580043137 578815699 577591062 576337457 575111568 573917031
2757.5 573917031 572688103 571442544 570227087 568989575 567671180 566308558 564957440 563595891
2773.8 563595891 562180758 560720682 559228539 557662904 556001365 554281890 552538276 550767243
2790.1 550767243 548909962 546952367 544971824 542974472 540893316 538743198 536572337 534336805
2806.4 534336805 531981170 529556751 527109087 524569988 521910787 519195557 516422570 513538361
2822.7 513538361 510530770 507382393 504061103 500550151 496833771 492858022 488488168 483522832
2839.1 483522832 477759182 471067816 463421285 454975218 446291596 438341528 432043016 427742541
$$ packed form
2724.8E94753385j427532j451730j401604j329362j335979j356065j294255j230061
2741.2E83926797j263976j323402j296282j227438j224637j253605j225889j194537
2757.5E73917031j228928j245559j215457j237512j318395j362622j351118j361549
2773.8E63595891j415133j460076j492143j565635j661539j719475j743614j771033
2790.1E50767243j857281j957595j980543j997352k081156k150118k170861k235532
2806.4E34336805k355635k424419k447664k539099k659201k715230k772987k884209
2822.7E13538361l007591l148377l321290l510952l716380l975749m369854m965336
2839.1D83522832n763650o691366p646531q446067q683622p950068o298512m300475
$$ plain form
2855.4 427742541 425063372 423161268 421098858 418172538 414178044 409408182 404409885 399745375
2871.7 399745375 395854950 392931163 390839100 389245421 387879997 386580318 385148287 383457839
2888 383457839 381552637 379479408 377194405 374641180 371850312 368879616 365664154 362066686 358005166
2906.4 358005166 353412211 348207295 342354178 335927039 329181403 322534055 316463262 311423689
2922.7 311423689 307748914 305566937 304867208 305589110 307653219 310954481 315284580 320354670 325803012
2941 325803012 331125289 335819274 339617670 342482924 344499588 345853478 346915305 348232150 350249141
2959.4 350249141 353160739 357034862 361878335 367574841 373905778 380676985 387712121 394775420
2975.7 394775420 401665747 408306926 414588243 420327038 425460696 430011332 433913112 437074006
$$ packed form
2855.4D27742541k679169j902104k062410k926320l994494m769862m998297m664510
2871.7C99745375l890425k923787k092063j593679j365424j299679j432031j690448
2888C83457839j905202k073229k285003k553225k790868k970696l215462l597468m061520
2906.4C58005166m592955n204916n853117o427139o745636o647348o070793n039573
2922.7C11423689l674775k181977o99729P21902K064109L301262M330099N070090N448342
2941C25803012N322277M693985L798396K865254K016664J353890J061827J316845K016991
2959.4C50249141K911598L874123M843473N696506O330937O771207P035136P063299
2975.7C94775420O890327O641179O281317N738795N133658M550636L901780L160894
$$ plain form
2992 437074006 439500362 441255808 442329347 442640066 442228347 441287458 440014184 438559830 437088817
3010.4 437088817 435751021 434577614 433445692 432198822 430748940 428995371 426874518 424509943
3026.7 424509943 422121435 419774234 417380661 414911717 412366122 409709185 406942368 404098511
3043 404098511 401208907 398266613 395283997 392331749 389407933 386455089 383505583 380660832 377967924
3061.4 377967924 375395298 372920543 370608330 368504107 366509527 364522845 362594247 360815734
3077.7 360815734 359129429 357419074 355720580 354159385 352747887 351382703 349995404 348608881
3094 348608881 347255975 345909983 344525218 343094498 341601461 340012968 338398814 336805373 335148513
3112.4 335148513 333398730 331606597 329776317 327847272 325813591 323759288 321723878 319646895
$$ packed form
2992D37074006K426356J755446J073539L10719m11719r40889j273274j454354j471013
3010.4D37088817j337796j173407j131922j246870j449882j753569k120853k364575
3026.7D24509943k388508k347201k393573k468944k545595k656937k766817k843857
3043D04098511k889604k942294k982616k952248k923816k952844k949506k844751k692908
3061.4C77967924k572626k474755k312213k104223j994580j986682j928598j778513
3077.7C60815734j686305j710355j698494j561195j411498j365184j387299j386523
3094C48608881j352906j345992j384765j430720j493037j588493j614154j593441j656860
3112.4C35148513j749783j792133j830280j929045k033681k054303k035410k076983
$$ plain form
3128.7 319646895 317475736 315232694 312956363 310670793 308399320 306130439 303819567 301450044
3145 301450044 299064428 296710432 294351041 291923791 289449602 287002027 284577161 282125920 279683590
3163.4 279683590 277280897 274867684 272419393 269973993 267551064 265126079 262703687 260341763
3179.7 260341763 258033007 255726397 253413856 251105666 248836532 246614888 244415507 242258698
3196 242258698 240161493 238096431 236055791 234058246 232133657 230262309 228384539 226500914 224663913
3214.3 224663913 222899899 221152499 219381690 217621610 215858430 214048088 212241530 210468322
3230.7 210468322 208655417 206756949 204786122 202794552 200831860 198857903 196807042 194699958
3247 194699958 192577213 190426335 188238353 186062440 183913305 181750461 179588169 177491471 175473034
$$ packed form
3128.7C19646895k171159k243042k276331k285570k271473k268881k310872k369523
3145C01450044k385616k353996k359391k427250k474189k447575k424866k451241k442330
3163.4B79683590k402693k413213k448291k445400k422929k424985k422392k361924
3179.7B60341763k308756k306610k312541k308190k269134k221644k199381k156809
3196B42258698k097205k065062k040640j997545j924589j871348j877770j883625j837001
3214.3B24663913j764014j747400j770809j760080j763180j810342j806558j773208
3230.7B10468322j812905j898468j970827j991570j962692j973957k050861k107084
3247A94699958k122745k150878k187982k175913k149135k162844k162292k096698k018437
$$ plain form
3265.3 175473034 173479348 171557739 169803098 168184012 166664466 165256783 163973644 162833750
3281.6 162833750 161799297 160862967 160081342 159417957 158806518 158271536 157829002 157433271 157072037
3300 157072037 156772405 156548873 156364173 156175166 156024382 155942068 155860022 155745894 155650184 155599669 155560046
3322.4 155560046 155499786 155393466 155246526 155156985 155129448 155064464 154922798 154719859 154492438 154237598
3342.8 154237598 153925419 153587565 153294697 153033793 152721271 152333021 151941627 151596636 151280314 150948808
3363.2 150948808 150579154 150208801 149834931 149404705 148981497 148679689 148440689 148159489 147837237 147538111
3383.6 147538111 147305831 147171468 147128209 147055462 146889299 146708339 146651313 146732181 146723777 146543518 146437123
3406.1 146437123 146502867 146641701 146809697 146990344 147181749 147416160 147720218 148085549 148537293 149102271
$$ packed form
3265.3A75473034j993686j921609j754641j619086j519546j407683j283139j139894
3281.6A62833750j034453r36330p81625o63385o11439n34982m42534l95731l61234
3300A57072037k99632k23532j84700j89007j50784q2314q2046j14128r5710n0515l9623
3322.4A55560046o0260j06320j46940q9541k7537o4984j41666k02939k27421k54840
3342.8A54237598l12179l37854k92868k60904l12522l88250l91394l44991l16322l31506
3363.2A50948808l69654l70353l73870m30226m23208l01808k39000k81200l22252k99126
3383.6A47538111k32280j34363m3259p2747j66163j80960n7026Q0868q404j80259j06395
3406.1A46437123O5744J38834J67996J80647J91405K34411L04058L65331M51744N64978
$$ plain form
3426.5 149102271 149772614 150510028 151331186 152217746 153006092 153656557 154336244 155159488 156113565 157150507
3446.8 157150507 158195749 159258768 160392046 161598191 162893012 164271504 165629715 166995049
3463.2 166995049 168508142 170122772 171671718 173053190 174414203 175934836 177672565 179530472
3479.5 179530472 181302622 183018193 184834301 186719075 188601315 190507174 192444041 194439232
3495.8 194439232 196480095 198552117 200631455 202613220 204543233 206599668 208794698 211081222
3512.1 211081222 213437065 215760008 218042493 220424876 222990587 225499928 227822229 230234593
3528.4 230234593 232908860 235718384 238562867 241409436 244233921 247188330 250325799 253480673
3544.7 253480673 256515682 259561002 262716681 265941769 269284338 272784650 276442200 280204386
$$ packed form
3426.5A49102271O70343P37414Q21158Q86560P88346O50465O79687Q23244R54077J036942
3446.8A57150507J045242J063019J133278J206145J294821J378492J358211J365334
3463.2A66995049J513093J614630J548946J381472J361013J520633J737729J857907
3479.5A79530472J772150J715571J816108J884774J882240J905859J936867J995191
3495.8A94439232K040863K072022K079338J981765J930013K056435K195030K286524
3512.1B11081222K355843K322943K282485K382383K565711K509341K322301K412364
3528.4B30234593K674267K809524K844483K846569K824485K954409L137469L154874
3544.7B53480673L035009L045320L155679L225088L342569L500312L657550L762186
$$ plain form
3561.1 280204386 283953875 287625402 291461408 295599371 299788028 303978592 308348507 312876701
3577.4 312876701 317500621 322295368 327197760 331989080 336711675 341716439 346855313 351937085
3593.7 351937085 357114315 362447441 367805600 373183757 378600061 383885592 389128804 394539714
3610 394539714 400119156 405831695 411486894 416985959 422713459 428655326 434457421 439855635 444938421
3628.4 444938421 450458050 456213981 461773247 467205673 472546935 477883875 483303785 488637418
3644.7 488637418 493543357 498115569 503077328 508364260 513249576 517946720 522851288 527574360
3661 527574360 532035947 536557734 540822625 544430137 548169851 552077293 555305779 558596134 562341690
3679.4 562341690 566039979 569741368 573288202 576213181 578553259 581113219 584068775 586956322
$$ packed form
3561.1B80204386L749489L671527L836006M137963M188657M190564M369915M528194
3577.4C12876701M623920M794747M902392M791320M722595N004764N138874N081772
3593.7C51937085N177230N333126N358159N378157N416304N285531N243212N410910
3610C94539714N579442N712539N655199N499065N727500N941867N802095N398214N082786
3628.4D44938421N519629N755931N559266N432426N341262N336940N419910N333633
3644.7D88637418M905939M572212M961759N286932M885316M697144M904568M723072
3661E27574360M461587M521787M264891L607512L739714L907442L228486L290355L745556
3679.4E62341690L698289L701389L546834K924979K340078K559960K955556K887547
$$ plain form
3695.7 586956322 589576662 591866553 593829095 595885098 598227561 600401878 601875126 602887928
3712 602887928 604583919 606858790 608959138 610727429 612279534 613665521 614991367 616641581 618397713
3730.3 618397713 619678020 620395243 621106625 622622728 624647677 625768721 625913322 627102017 628606081
3748.7 628606081 628982604 629640400 631408155 633084297 634038270 634995878 636307597 637426913 638291895
3767.1 638291895 639002979 639749408 640883505 642237723 643408716 644193470 644905865 645677269 646409094
3785.4 646409094 647325993 648399055 649409831 650245607 650911510 651727259 652296901 652378917 653123319
3803.8 653123319 653963864 654329419 655320525 656840265 657763541 657923877 658416450 658772707 658763349 659541667
3824.2 659541667 660639822 661526740 662197590 662804067 663652003 664176404 664051950 664209723 664819598
$$ packed form
3695.7E86956322K620340K289891J962542K056003K342463K174317J473248J012802
3712F02887928J695991K274871K100348J768291J552105J385987J325846J650214J756132
3730.3F18397713J280307P17223P11382J516103K024949J121044J44601J188695J504064
3748.7F28606081L76523O57796J767755J676142R53973R57608J311719J119316Q64982
3767.1F38291895P11084P46429J134097J354218J170993P84754P12395P71404P31825
3785.4F46409094R16899J073062J010776Q35776O65903Q15749N69642Q2016P44402
3803.8F53123319Q40545L65555R91106J519740R23276J60336M92573L56257r358P78318
3824.2F59541667J098155Q86918O70850O06477Q47936N24401j24454J57773O09875
$$ plain form
3842.5 664819598 665549338 666592300 667973876 668829501 667798758 666533470 667491078 669056356 669990659
3860.9 669990659 670280099 670559227 671115637 671215892 671113670 671476007 672104061 672900498 673363566 673645437
3881.3 673645437 674121201 674263895 674562752 675087988 675149262 675415516 676216960 676756263 676739216 676461220
3901.7 676461220 676215112 676414907 677084029 677698374 678114295 678456068 678526819 678381801 678481638 678761959
3922.1 678761959 678899944 679071724 679384768 679548085 679592490 679809391 680145442 680443227 680651665 680772662
3942.5 680772662 680947065 681168318 681326807 681490183 681709945 681939006 682115674 682251036 682409704 682633340
3962.9 682633340 682862997 683011234 683123171 683289230 683522463 683758676 683943987 684079349 684216022 684414327
3983.2 684414327 684632361 684778392 684883714 685045719 685241640 685404122 685568750
$$ packed form
3842.5F64819598P29740J042962J381576Q55625j030743j265288R57608J565278R34303
3860.9F69990659K89440K79128N56410J00255j02222L62337O28054P96437M63068K81871
3881.3F73645437M75764J42694K98857N25236O1274K66254Q01444N39303j7047k77996
3901.7F76461220k46108J99795O69122O14345M15921L41773P0751j45018R9837K80321
3922.1F78761959J37985J71780L13044J63317M4405K16901L36051K97785K08438J20997
3942.5F80772662J74403K21253J58489J63376K19762K29061J76668J35362J58668K23636
3962.9F82633340K29657J48237J11937J66059K33233K36213J85311J35362J36673J98305
3983.2F84414327K18034J46031J05322J62005J95921J62482J64628
$$ plain form
3997.5 685568750
$$ packed form
3997.5F85568750
##END=$$ End of the data block
