##TITLE=G17-52-SE $$ Begin of the data block
##JCAMP-DX=5.00 $$ ACD/SpecManager v 10.08
##SPECTROMETER/DATA SYSTEM=Alpha
##DATE=21 Oct 2013 11:04:12
##DATA TYPE=INFRARED SPECTRUM
##DATA CLASS=XYDATA
##ORIGIN=
##OWNER=
##NPOINTS=1765
##FIRSTX=399.75695801
##LASTX=3997.56933594
##MAXX=3997.56933594
##MINX=399.75695801
##MAXY=0.78771722
##MINY=0.14464423
##XFACTOR=1.0000000000
##YFACTOR=1.000000000000000e-9
##FIRSTY=0.40905449
##DELTAX=2.03957629
##XUNITS=1/CM
##YUNITS=ARBITRARY UNITS
##XYDATA=(X++(Y..Y))
399.8 409054488 407176882 405683517 403544873 402259350 402590901 403072983 402853996 402841359 403226852
418.1 403226852 402273476 400082380 398546636 397640407 395827919 393222809 391498029 390342355 388862520
436.5 388862520 388460219 390016824 392000377 393133283 394058645 395011514 394973189 393807650 392898470
454.8 392898470 392428964 390487701 387284249 384930611 383099377 380249023 377090782 374918848 373019457
473.2 373019457 370637804 368652254 367731869 367034972 365810692 364795476 364307553 363155007 361048043
491.5 361048043 359218419 357883662 355886370 353048384 350378364 348017007 345130295 341856986
507.9 341856986 339119732 336637586 333540231 330259204 327685148 325568080 323420703 321875662
524.2 321875662 321533203 321559459 321402788 321940452 323588967 325676680 327835768 330301881 332712710
542.5 332712710 333984762 333879083 333377123 332944840 331899822 330127925 328487307 327038348 325062096
560.9 325062096 322675258 320468128 318152100 315406024 313201368 312539965 312936813 313670933 315255463
579.2 315255463 318123102 321356863 324009299 326381713 328743339 330340773 330809712 331041634 331582636
597.6 331582636 331786811 331416816 331294149 331814200 332261890 332270354 332518756 333262235 333915412 334481359
618 334481359 335878730 338349968 341047525 343690664 346799284 350047201 352599412 354628593 356846988
636.3 356846988 359075904 360713989 362062573 363797963 365561128 366501391 366936505 367705703 368358701
654.7 368358701 368289232 368232220 368775398 369433433 370058864 371373981 373162687 373963535 374609143 376040518
675.1 376040518 378188103 380120039 381509721 382976174 384539396 385441005 385619283 385748208 385671854
693.5 385671854 384651840 383051813 382208288 382528663 383318454 384525269 386746645 389651269 392500043
711.8 392500043 395640910 399736047 404376984 408818722 413453788 418941885 424553990 429225355
728.1 429225355 433365434 437656671 441338331 443636745 445323825 447103292 448182404 448124617 447911352
746.5 447911352 448123842 447858244 446620524 445309043 444298476 442941546 441391170 440862030 441732734
764.8 441732734 443358034 445942193 450436026 456389219 462270439 467856318 473902792 479770780
781.2 479770780 484156817 487570316 491183519 494535804 496720910 498593122 501449585 504890323
797.5 504890323 508109033 511665642 516052246 520127952 522889376 525088787 527416229 528963625
813.8 528963625 529250383 529342771 529584765 528790772 526573539 523987830 521497011 518477619 514919877
832.1 514919877 511743903 508982301 505763113 502168953 499197602 497004122 494885117 492925465
848.5 492925465 491757691 491096765 490248591 489432335 489549935 491153151 494326562 499366671 506284833
866.8 506284833 513812840 520428956 525829077 530082643 532311678 531738162 529051542 525237799 520170569
885.2 520170569 513833821 507364631 501537681 495889157 490108669 484715730 479730278 474170387
901.5 474170387 467537940 460386872 453014344 445030570 436521202 428366482 421119243 414678782
917.8 414678782 409339905 405772418 403748244 402269572 400918126 400013268 399512231 398865908 398029894
936.2 398029894 397459716 396981776 395703256 392923772 388214231 381126493 371782988 361245066 350487292
954.5 350487292 339582741 328368723 317137897 306210250 295457512 284764886 274485260
968.8 274485260 265042335 256541371 249017581 242685527 237671688 233736187 230574742 228113219
985.1 228113219 226252437 224644899 223057777 221639663 220556915 219777822 219276190 219127119 219244540
1003.5 219244540 219181746 218555182 217416480 215970561 214322403 212569013 210871384 209257036 207534805
1021.8 207534805 205613121 203623205 201639012 199612781 197603732 195700675 193813384 191825613
1038.1 191825613 189818546 187949717 186236426 184626415 183241993 182318941 181950420 182081059 182654783
1056.5 182654783 183694661 185175851 186980501 188960865 190814510 191925317 191779464 190724149
1072.8 190724149 189782158 189731970 190792680 192970246 196172670 200072676 204243317 208470613 212638110
1091.2 212638110 216481254 219789907 222581312 224885061 226640314 227973118 229273215 230937973
1107.5 230937973 233054072 235480815 238189295 241099358 243914917 246403664 248562068 250519514
1123.8 250519514 252457917 254600495 257171810 260091066 262870014 265070289 266556144 267299235
1140.1 267299235 267329454 266881824 266284466 265714049 265203655 264887929 265062988 265950710 267593443 270037532
1160.5 270037532 273374438 277505994 282184243 287333488 293083191 299509317 306539804 314065874
1176.8 314065874 321968436 329976767 337722540 345009416 351740897 357609898 362212092 365423381
1193.1 365423381 367378414 368160963 367902160 367040664 365992159 364883840 363834798 363109291 362761348
1211.5 362761348 362468392 361960918 361259550 360379219 359162718 357535452 355610967 353509247 351272434
1229.9 351272434 349016488 346995831 345391601 344226778 343574107 343583673 344257295 345463693 347133756
1248.2 347133756 349267036 351730406 354292303 356881976 359523356 362126917 364609510 367029935
1264.5 367029935 369478643 371937335 374286503 376432091 378299952 379836559 381082922 382246256
1280.8 382246256 383533090 384939313 386362255 387705654 388805538 389393419 389310688 388595849 387349039
1299.2 387349039 385654628 383670330 381598979 379535884 377547115 375787318 374465764 373683602
1315.5 373683602 373372287 373427123 373711795 373824567 373294115 371956587 369952291 367546260 365037203
1333.9 365037203 362752527 360864311 359406829 358375430 357650012 357010931 356217742 355083376 353624076
1352.2 353624076 351933211 350013077 347857535 345305741 342047781 338145286 333996713 329950750
1368.5 329950750 326517373 323497146 320223391 316713363 313056678 309098423 305094987 301657051
1384.9 301657051 299097031 297569484 296941280 296645612 296342820 296182007 296320796 296921968 297995657
1403.2 297995657 299424678 301129669 302998811 304947704 306923658 308976322 311228901 313832074
1419.5 313832074 316511959 319088161 321526200 323506445 324724853 325214624 325208127 324553937 323652685
1437.9 323652685 323468596 323888570 324504316 325164407 325814545 326427132 326964229 327708960 329383940
1456.2 329383940 332478613 336030036 339485973 343173057 347455561 352690995 359693468 369260103
1472.6 369260103 379442096 387974054 394702822 399641126 402808487 404071927 403281808 400216669
1488.9 400216669 395330876 390043497 383940369 376100779 368076622 361106783 354698747 346401334
1505.2 346401334 334054232 322931826 314074516 305570841 298126400 292678386 289320260 286567628
1521.5 286567628 283754021 280951262 277920067 275264144 272883832 270396024 268602520 267511100
1537.8 267511100 266262084 265480280 265945613 267348975 269541323 272524685 276199996 280410528 284856617
1556.2 284856617 289993018 295790404 300287306 304102808 307774186 311133206 314256191 316827118
1572.5 316827118 318793654 320349127 321550757 322341025 322614878 322525322 322125524 321309298 319928557
1590.9 319928557 318016857 315516591 312391549 308598191 303997606 298615873 292558253 285739034
1607.2 285739034 277947605 269609123 261250019 251833856 240565613 230477571 220998660 209815517
1623.5 209815517 198635459 188421533 178790614 170497060 162926450 154985577 149208918 146403566
1639.8 146403566 145078808 144644231 144973516 146112531 147610962 149506077 152341351 155419692 158637941
1658.2 158637941 162688226 167898402 173963368 180037126 186855912 194911361 202739313 210966647
1674.5 210966647 220139802 229059890 237810373 247881368 260899246 273678690 285453975 298798263
1690.8 298798263 313228190 330643117 350980073 371482253 393744290 412444323 427768677
1705.1 427768677 442615241 455338448 466011316 475298941 483649343 491584539 498501986 504028082
1721.4 504028082 508748412 512883604 516292572 519282639 521921813 524150312 526465237 529188931
1737.7 529188931 532373548 536221266 540887475 546619475 553524971 561531484 570297241 578948915
1754 578948915 587561488 596115470 604101419 612007797 619600296 626449525 632834315 638891757 644762814
1772.4 644762814 650153160 654805422 659123600 663211882 666823685 670050025 673237383 676301956
1788.7 676301956 678842843 681173444 683766842 686314702 688477278 690531194 692775667 694954395
1805 694954395 696853220 698645592 700547218 702396214 704076171 705754101 707558393 709260106 710706711
1823.4 710706711 712137699 713640392 714942753 716156840 717585981 719004869 720207930 721336544
1839.7 721336544 722476244 723442495 724331796 725335062 726397097 727421582 728271723 729059398 729951620
1858 729951620 730863929 731618524 732324839 733066559 733661354 734189272 734914958 735794485 736600101 737241983
1878.4 737241983 737875104 738655627 739461839 740138173 740716398 741389692 742134988 742712855 743253410 743925810
1898.8 743925810 744537354 744957864 745400667 745954275 746414423 746745169 747159183 747664332 747991621 748224318
1919.2 748224318 748627901 749106526 749459922 749710023 750060737 750489652 750737667 750838578 751114309 751521766
1939.6 751521766 751693726 751705885 751947403 752326071 752568007 752756834 753087580 753462791 753659427 753797412
1960 753797412 754108250 754467845 754653156 754815102 755128443 755420566 755577326 755734324 755985081 756183803
1980.4 756183803 756250739 756354511 756594777 756786227 756791174 756795347 756957889 757112026 757142067 757198691 757305562
2002.8 757305562 757290006 757129967 757026374 757008612 756886125 756598234 756320179 756139338 755874932 755508065
2023.2 755508065 755219579 755007744 754703581 754331231 754049122 753832400 753531158 753156841 752886593 752725065
2043.6 752725065 752528727 752315819 752240419 752262712 752222598 752174377 752263963 752400935 752438843 752478302 752645731
2066.1 752645731 752821743 752846420 752861083 753031254 753222287 753272712 753303289 753475785 753668666 753735662
2086.5 753735662 753807306 754029691 754243493 754321277 754425228 754670143 754904628 755028546 755190611 755462289
2106.9 755462289 755672812 755751193 755885422 756111860 756245792 756286263 756429374 756657898 756761968 756760776
2127.3 756760776 756882727 757130265 757281065 757361591 757544518 757759511 757844985 757887959 758069515 758317769
2147.7 758317769 758455992 758545995 758780539 759103477 759348631 759593189 759985149 760427713 760763228 761109591
2168 761109591 761638463 762223125 762692928 763150990 763710499 764250517 764689267 765157938 765706182 766205072
2188.4 766205072 766608477 767043054 767582774 768084764 768459022 768854439 769360662 769841790 770206630 770580888
2208.8 770580888 771062315 771523476 771872938 772249758 772711694 773088455 773321867 773598611 773992419 774334431
2229.2 774334431 774549365 774778187 775072396 775290966 775417447 775604486 775871634 776072323 776187241 776376724
2249.6 776376724 776666522 776869297 776938319 777092636 777355790 777495384 777526379 777654469 777873099 778045475
2270 778045475 778117597 778170586 778275549 778297901 778216541 778253794 778452396 778615832 778711498 778895259 779123902
2292.5 779123902 779246092 779359996 779615879 779902101 780119717 780426383 780946672 781495750 781856596 782118797
2312.9 782118797 782511711 783123195 783823907 784463942 784972906 785351455 785722136 786129355 786364257 786319733
2333.3 786319733 786155760 786034048 786040962 785869241 784816206 782836258 781508029 781836927 783334374
2351.6 783334374 785137415 786712945 787717223 787703693 786830366 785526514 783778667 781568766 779239595
2370 779239595 777019739 774897993 772969306 771337569 769896805 768543303 767392635 766604185 766065001
2388.3 766065001 765511453 764928818 764452577 764017940 763457477 762816608 762252867 761708498 761039913 760300457
2408.7 760300457 759626031 758982122 758248091 757468104 756748855 756002724 755122781 754233062 753438532 752632558
2429.1 752632558 751714110 750767291 749918461 749099195 748182237 747251213 746411026 745542467 744536221
2447.5 744536221 743533671 742672443 741816819 740859568 739929557 739099264 738242686 737285614 736355364
2465.8 736355364 735512078 734651446 733747959 732890010 732080996 731212676 730266750 729370475 728563130 727713108
2486.2 727713108 726799667 725959361 725216269 724466622 723674476 722914636 722204566 721442997 720614672 719831109
2506.6 719831109 719106019 718348026 717544317 716783822 716082215 715323329 714474916 713657975 712911069 712111771
2527 712111771 711219311 710343897 709508538 708616614 707666516 706744373 705840886 704896152 703957677 703112245
2547.4 703112245 702299237 701398373 700465620 699606359 698751330 697817147 696898639 696088850 695304930 694438756
2567.8 694438756 693533123 692699432 691885531 690971315 690056682 689245045 688405871 687458575 686533988 685714483
2588.2 685714483 684892714 683994770 683107972 682279706 681407988 680423558 679424524 678478181 677464962
2606.6 677464962 676340699 675238609 674177766 673015475 671725690 670440137 669177890 667827547
2622.9 667827547 666390896 664976060 663585305 662112474 660542130 658994675 657518029 656024694
2639.2 656024694 654492557 652986050 651512980 650011301 648472965 646963298 645486772 643976152
2655.5 643976152 642438889 640964210 639538288 638078630 636620760 635210693 633799732 632368565
2671.8 632368565 630955577 629613996 628322959 626988292 625643075 624379396 623133421 621830881
2688.1 621830881 620549619 619325697 618050277 616663098 615243495 613868177 612475038 610973477
2704.5 610973477 609424889 607924998 606413841 604812503 603210151 601697028 600164056 598527551
2720.8 598527551 596923351 595455766 594058096 592643678 591234207 589879870 588532150 587170303
2737.1 587170303 585864246 584613204 583352625 582062602 580784082 579565465 578363717 577119946
2753.4 577119946 575869083 574638844 573404491 572165430 570928097 569659352 568330169 566983283
2769.7 566983283 565679252 564374745 562988460 561519802 559995532 558415771 556779802 555091143
2786 555091143 553354383 551566780 549703777 547774673 545818448 543806970 541695833 539532304 537358999
2804.4 537358999 535112381 532746673 530323625 527880549 525363386 522727489 519992471 517191052
2820.7 517191052 514300168 511279702 508127630 504833877 501342058 497596890 493573070 489187479
2837 489187479 484242678 478501439 471817702 464180917 455752492 447070181 439090610 432747841 428401828
2855.4 428401828 425692171 423773259 421697825 418776214 414797455 410039544 405013502 400287777
2871.7 400287777 396376312 393469185 391377270 389766276 388370633 387008816 385540068 383878231
2888 383878231 382011145 379965693 377683640 375093579 372262090 369282514 366084278 362473190 358358324
2906.4 358358324 353753090 348579109 342724025 336269647 329519451 322870493 316782415 311734885
2922.7 311734885 308056295 305861562 305159867 305908620 307996690 311280042 315580875 320644051 326098323
2941 326098323 331436396 336181223 340049326 342944175 344923079 346213818 347265065 348620325 350685418
2959.4 350685418 353644878 357552379 362407267 368093908 374426693 381225348 388274133 395341128
2975.7 395341128 402279407 409001440 415336072 421098500 426229000 430754751 434674442 437906027
2992 437906027 440399110 442180067 443229139 443507344 443118542 442249298 441017091 439558327 438104719
3010.4 438104719 436812937 435664088 434527695 433281004 431853592 430123508 428009331 425651073
3026.7 425651073 423248172 420847416 418417960 415963620 413465023 410830706 408044994 405219674
3043 405219674 402402550 399498045 396492422 393531233 390632272 387690037 384705991 381802350 379084349
3061.4 379084349 376515239 374041528 371751994 369685471 367710650 365752220 363854647 362052888
3077.7 362052888 360305458 358567089 356884360 355323911 353887498 352524638 351181865 349835932
3094 349835932 348491967 347142041 345741093 344261825 342714101 341121703 339525700 337924719 336253315
3112.4 336253315 334474921 332638234 330793649 328887343 326887757 324869961 322833121 320714533
3128.7 320714533 318533003 316320419 314075261 311778128 309441626 307116419 304792374 302419424
3145 302419424 300005466 297605246 295242190 292877406 290453017 288002223 285570383 283116370 280646235
3163.4 280646235 278210551 275790364 273345828 270897567 268480599 266056508 263598800 261195481
3179.7 261195481 258858830 256527901 254213542 251927376 249669373 247432798 245217994 243039012
3196 243039012 240902767 238812774 236760437 234772131 232888043 231045693 229181215 227311149 225465864
3214.3 225465864 223665759 221879780 220083892 218279526 216481537 214709058 212931022 211113155
3230.7 211113155 209256008 207346886 205382034 203413069 201443225 199411899 197321296 195224270
3247 195224270 193129942 191004291 188817143 186597317 184401199 182232156 180089146 177986860 175918058
3265.3 175918058 173906282 172038481 170339674 168730706 167180270 165739208 164446086 163287625
3281.6 163287625 162245661 161337852 160549119 159832105 159186706 158642724 158186942 157800317 157482117
3300 157482117 157200247 156946778 156709626 156477958 156292528 156164438 156083077 156036660 155995145 155947164 155881390
3322.4 155881390 155793548 155698702 155590057 155479535 155379251 155268416 155113146 154919848 154724896 154505834
3342.8 154505834 154228747 153921232 153650880 153386101 153024808 152592734 152195469 151872724 151584417 151248917
3363.2 151248917 150864050 150503024 150144577 149702564 149219096 148825645 148521364 148227140 147923738 147646114
3383.6 147646114 147450149 147388995 147395313 147271797 146970212 146699071 146668464 146810219 146854326 146732017
3404 146732017 146658257 146721646 146847010 146985650 147120044 147290811 147557095 147893995 148244679 148668721
3424.4 148668721 149246320 149943113 150664449 151476294 152402624 153210670 153829113 154498026 155357927 156322911
3444.8 156322911 157327026 158350974 159430563 160607710 161869109 163179532 164502352 165783450
3461.1 165783450 167110816 168681607 170423999 172027171 173343226 174631700 176150978 177925497
3477.4 177925497 179793790 181525171 183189139 185014844 186957136 188849464 190738112 192722380
3493.8 192722380 194779322 196817607 198879451 200988695 203011706 204963192 206982777 209097013
3510.1 209097013 211353123 213747591 216106087 218430266 220867380 223454371 225990996 228354573
3526.4 228354573 230774105 233417392 236182898 239028230 241923720 244788185 247769758 250916094
3542.7 250916094 254050434 257100344 260204732 263418943 266708493 270088136 273555130 277154058
3559 277154058 280906171 284695148 288408637 292290986 296516329 300792754 304982334 309268743 313767433
3577.4 313767433 318472713 323338658 328246504 333030283 337739557 342757523 347968131 353135318
3593.7 353135318 358374596 363750815 369123489 374491185 379920363 385238498 390534401 395986646
3610 395986646 401522845 407187879 412852079 418364972 424088836 430057853 435956627 441445529 446531892
3628.4 446531892 452001125 457708687 463253319 468718797 474094212 479419380 484807163 490136117
3644.7 490136117 495053083 499626249 504591823 509888649 514796734 519515634 524399936 529085219
3661 529085219 533497512 537948012 542187452 545821130 549571335 553462744 556651890 559921622 563695729
3679.4 563695729 567385435 571001947 574508786 577477872 579841554 582386732 585293412 588123620
3695.7 588123620 590760529 593079329 594998360 597089231 599588752 601836562 603205621 604093373
3712 604093373 605780005 608084083 610184550 611954212 613533258 614927292 616263568 617947817 619676948
3730.3 619676948 620906830 621654987 622435689 623965502 625933528 626975417 627070069 628281236 629838407
3748.7 629838407 630250096 630912364 632643700 634310126 635286629 636217773 637486100 638613343 639525235
3767.1 639525235 640263081 640994787 642114043 643461943 644596934 645338655 646058023 646856785 647602022
3785.4 647602022 648517489 649557769 650534630 651394069 652101040 652902722 653436661 653530359 654342115 655236304
3805.8 655236304 655590951 656524122 657968163 658851087 659055591 659582436 659894288 659891903 660744309 661852539
3826.2 661852539 662733555 663439631 664035916 664791822 665229142 665116489 665315866 665891528 666568041 667624533
3846.6 667624533 669082403 670004845 668933988 667603433 668578982 670154333 671112061 671450317 671696067
3865 671696067 672174931 672250509 672132850 672500908 673197865 674031854 674446106 674683630 675181150 675318837
3885.4 675318837 675558746 676067293 676139176 676411629 677278340 677897751 677902818 677624166 677341938 677507699
3905.7 677507699 678209066 678864837 679295301 679651082 679751515 679628849 679706037 679938853 680062532 680248678
3926.1 680248678 680575013 680757284 680820227 681070864 681461155 681773543 681950271 682056665 682251453 682460368
3946.5 682460368 682560682 682701051 682912469 683117092 683320403 683525205 683708608 683866620 684024632 684197843
3966.9 684197843 684377968 684550285 684717715 684876680 685032785 685189128 685330689 685496688 685724974 685952663
3987.3 685952663 686119616 686262190 686442375 686649024 686805785
3997.5 686805785
##END=$$ End of the data block
