##TITLE=G17-52-CE $$ Begin of the data block
##JCAMP-DX=5.00 $$ ACD/SpecManager v 10.08
##SPECTROMETER/DATA SYSTEM=Alpha
##DATE=21 Oct 2013 11:04:12
##DATA TYPE=INFRARED SPECTRUM
##DATA CLASS=XYDATA
##ORIGIN=
##OWNER=
##NPOINTS=1765
##FIRSTX=399.75695801
##LASTX=3997.56933594
##MAXX=3997.56933594
##MINX=399.75695801
##MAXY=0.75799501
##MINY=0.13834549
##XFACTOR=1.0000000000
##YFACTOR=1.000000000000000e-9
##FIRSTY=0.43372884
##DELTAX=2.03957629
##XUNITS=1/CM
##YUNITS=ARBITRARY UNITS
##XYDATA=(X++(Y..Y))
$$ plain form
399.8 433728844 430031747 427234709 425724536 425253808 424939364 424501926 424486309 425013930 424968898 423422754
420.2 423422754 421418160 419752091 418326914 416859686 415176600 413381338 411737323 410534233
436.5 410534233 409978807 410155863 411058187 412254483 413058788 413362294 413240790 412617117 411698431 410435647
456.9 410435647 408432394 405888051 403364956 401199460 399030209 396403491 393712103 391448408
473.2 391448408 389554232 387781739 385997772 384434938 383502126 382939905 382014006 380537391 378779382
491.5 378779382 376903087 374935180 372827202 370415896 367549211 364405811 361274302 358184457
507.9 358184457 355127633 352143139 349301130 346628487 344145358 341867208 339874834 338502079
524.2 338502079 337922484 337808132 337845594 338252783 339389622 341290802 343714863 346150637 347958207
$$ packed form
399.8D33728844l697097k797038j510173m70728l14444m37438j5617N27621m5032j546144
420.2D23422754k004594j666069j425177j467228j683086j795262j644015j203090
436.5D10534233n55426J77056R02324J196296Q04305L03506j21504o23673r18686j262784
456.9D10435647k003253k544343k523095k165496k169251k626718k691388k263695
473.2C91448408j894176j772493j783967j562834r32812n62221r25899j476615j758009
491.5C78779382j876295j967907k107978k411306k866685l143400l131509l089845
507.9C58184457l056824k984494k842009k672643k483129k278150j992374j372755
524.2C38502079n79595j14352L7462M07189J136839J901180K424061K435774J807570
$$ plain form
542.5 347958207 348855704 349083334 348881960 348316759 347490132 346513838 345362276 343822539 341984034
560.9 341984034 340049177 337953091 335682184 333330393 331313282 330297768 330494404 331564188 333185166
579.2 333185166 335290760 337840736 340528876 342922628 344761133 345960557 346588433 346888810 347074717
597.6 347074717 347202063 347255021 347217798 347165316 347205818 347361773 347517252 347675771 348016858 348674864
618 348674864 349851340 351684570 354024410 356654763 359469324 362273902 364841700 367067188 369072855
636.3 369072855 371006608 372687131 374017537 375233829 376413345 377413511 378050297 378348470 378542155
654.7 378542155 378707439 378856003 378999352 379131556 379450351 380357623 381740808 382731676 383828580
673.1 383828580 385382593 387123734 388869822 390526563 391991854 393210590 394086570 394530982 394526750
$$ packed form
542.5C47958207Q97497K27630k01374n65201q26627r76294j151562j539737j838505
560.9C41984034j934857k096086k270907k351791k017111j015514J96636J069784J620978
579.2C33185166K105594K549976K688140K393752J838505J199424O27876L00377J85907
597.6C47074717J27346N2958l7223n2482M0502J55955J55479J58519L41087O58006
618C48674864J176476J833230K339840K630353K814561K804578K567798K225488K005667
636.3C69072855J933753J680523J330406J216292J179516J000166O36786K98173J93685
654.7C78542155J65284J48564J43349J32204L18795R07272J383185R90868J096904
673.1C83828580J554013J741141J746088J656741J465291J218736Q75980M44412m232
$$ plain form
691.4 394526750 393957615 392855614 391700774 391131550 391532540 392872125 394839019 397214621 399922639
709.8 399922639 402968198 406412572 410173655 414228708 418763757 423701435 428718269 433631122
726.1 433631122 438307822 442662925 446502417 449612468 452020049 453849882 455206543 456113905 456648022
744.4 456648022 456914425 457051218 457084477 456882656 456337810 455385655 454164088 453088105 452520043 452643722
764.8 452643722 453731328 456064641 459814399 464789718 470375627 475959569 481214911 486074418
781.2 486074418 490453511 494153708 497072995 499443620 501629531 503777325 505887628 508264303
797.5 508264303 511333585 515078008 519040644 522640884 525575519 527969420 530032337 531570375
813.8 531570375 532312870 532418728 532183826 531508863 530056655 527820587 525220275 522703290 520378172
$$ packed form
691.4C94526750n69135j102001j154840n69224M00990J339585J966894K375602K708018
709.8C99922639L045559L444374L761083M055053M535049M937678N016834M912853
726.1D33631122M676700M355103L839492L110051K407581J829833J356661R07362N34117
744.4D56648022K66403J36793L3259k01821n44846r52155j221567j075983n68062J23679
764.8D52643722J087606K333313L749758M975319N585909N583942N255342M859507
781.2D86074418M379093L700197K919287K370625K185911K147794K110303K376675
797.5E08264303L069282L744423L962636L600240K934635K393901K062917J538038
813.8E31570375P42495J05858k34902o74963j452208k236068k600312k516985k325118
$$ plain form
832.1 520378172 518119335 515744567 513228595 510776579 508566558 506577671 504824221 503521621
848.5 503521621 502707243 502162874 501716614 501334608 501302063 502438664 505540550 510464609 516350329
866.8 516350329 522497594 528401971 533415496 536922574 538610220 538451672 536553621 533135533 528605580
885.2 528605580 523466468 518150032 512872875 507704318 502721369 497851342 492856681 487489402
901.5 487489402 481501043 474794507 467500716 459818482 451998055 444383502 437316179 431137323
917.8 431137323 426190376 422614068 420221835 418576449 417231143 415999860 414952159 414164275 413491994
936.2 413491994 412706286 411699414 410257250 407724023 403221011 396381319 387681574 377947062 367732674
954.5 367732674 357276469 346682698 335982442 325221777 314484119 303861201 293506891
$$ packed form
832.1E20378172k258837k374768k515972k452016k210021j988887j753450j302600
848.5E03521621q14378n44369m46260l82006l2545J136601L101886M924059N885720
866.8E16350329O147265N904377N013525L507078J687646j58548j898051l418088m529953
885.2E28605580n139112n316436n277157n168557m982949m870027m994661n367279
901.5D87489402n988359o706536p293791p682234p820427p614553p067323o178856
917.8D31137323m946947l576308k392233j645386j345306j231283j047701p87884o72281
936.2D13491994p85708j006872j442164k533227m503012o839692q699745r734512j0214388
954.5C67732674j0456205j0593771j0700256j0760665j0737658j0622918j0354310
$$ plain form
968.8 293506891 283674806 274622291 266519725 259495080 253618598 248853624 245118454 242262125
985.1 242262125 240006655 238083661 236377954 234869152 233590946 232608601 231937945 231540576 231273711
1003.5 231273711 230843827 229972750 228601515 226848677 224859178 222764730 220690981 218655109 216560543
1021.8 216560543 214365557 212109655 209836528 207589462 205388263 203200355 201000437 198819101
1038.1 198819101 196724325 194734991 192867771 191183671 189785585 188832521 188402712 188509494 189132452
1056.5 189132452 190164894 191507921 193142056 194969252 196623459 197523773 197309926 196310177 195398882
1074.8 195398882 195390046 196584076 198897198 202134579 205983788 210126117 214413047 218701020 222738266
1093.2 222738266 226348534 229459554 232005402 233956710 235455856 236879602 238648921 240941599
$$ packed form
968.8B93506891r832085r052515q102566p024645n876482m764974l735170k856329
985.1B42262125k255470j922994j705707j508802j278206r82345o70656l97369k66865
1003.5B31273711m29884q71077j371235j752838j989499k094448k073749k035872k094566
1021.8B16560543k194986k255902k273127k247066k201199k187908k199918k181336
1038.1A98819101k094776j989334j867220j684100j398086r53064m29809J06782O22958
1056.5A89132452J032442J343027J634135J827196J654207R00314k13847r99749r11295
1074.8A95398882q836J194030K313122L237381L849209M142329M286930M287973M037246
1093.2B22738266L610268L111020K545848J951308J499146J423746J769319K292678
$$ plain form
1109.5 240941599 243678361 246664837 249697194 252629817 255366504 257832855 260035634 262154222
1125.8 262154222 264476359 267230153 270297110 273207158 275558203 277181804 278015971 278108478 277657300
1144.2 277657300 276945978 276237518 275678426 275429249 275710225 276691377 278539479 281358480 285073906
1162.6 285073906 289498717 294470698 299953938 306064755 312919140 320412666 328245252 336162448
1178.9 336162448 343989015 351487517 358362138 364362448 369347662 373205841 375751168 376900375
1195.2 376900375 376862764 376018465 374709129 373160541 371559650 370089203 368890822 367967069 367108017
1213.5 367108017 366038412 364688337 363169521 361510783 359627903 357458293 355082870 352693945
1229.9 352693945 350460202 348479182 346840978 345659971 345062077 345139623 345892012 347245902 349081665
$$ packed form
1109.5B40941599K736762K986476L032357K932623K736687K466351K202779K118588
1125.8B62154222K322137K753794L066957K910048K351045J623601Q34167R2507m51178
1144.2B77657300p11322p08460n59092k49177K80976R81152J848102K819001L715426
1162.6B85073906M424811M971981N483240O110817O854385P493526P832586P917196
1178.9C36162448P826567P498502O874621O000310M985214L858179K545327J149207
1195.2C76900375l7611q44299j309336j548588j600891j470447j198381r23753q59052
1213.5C67108017j069605j350075j518816j658738j882880k169610k375423k388925
1229.9C52693945k233743j981020j638204j181007n97894P7546P52389J353890J835763
$$ plain form
1248.2 349081665 351307631 353842884 356539249 359233558 361862212 364429682 366934419 369387925
1264.5 369387925 371805161 374177784 376435429 378456652 380122870 381437480 382526070 383573562
1280.8 383573562 384717077 385964036 387281120 388559908 389581501 390110135 389982790 389133394 387672067
1299.2 387672067 385794222 383628070 381268889 378892869 376746535 374964446 373628289 372859627
1315.5 372859627 372720718 373099655 373687059 374025762 373713464 372589201 370752066 368465990 366048962
1333.9 366048962 363845259 362059265 360715955 359744936 359005660 358319849 357534796 356490046 355081737
1352.2 355081737 353333294 351341844 349192888 346683472 343377501 339259654 334830195 330556571
1368.5 330556571 326948255 323792160 320347011 316534907 312532961 308338881 304177463 300529003
$$ packed form
1248.2C49081665K225966K535253K696365K694309K628654K567470K504737K453506
1264.5C69387925K417236K372623K257645K021223J666218J314610J088590J047492
1280.8C83573562J143515J246959J317084J278788J021593N28634j27345q49396j461327
1299.2C87672067j877845k166152k359181k376020k146334j782089j336157p68662
1315.5C72859627j38909L78937N87404L38703l12298j124263j837135k286076k417028
1333.9C66048962k203703j785994j343310r71019p39276o85811p85053j044750j408309
1352.2C55081737j748443j991450k148956k509416l305971m117847m429459m273624
1368.5C30556571l608316l156095l445149l812104m001946m194080m161418l648460
$$ plain form
1384.9 300529003 297769636 296118975 295396268 295075834 294782609 294640571 294897139 295662105 296980858
1403.2 296980858 298811764 300917476 303163588 305568129 308040261 310582459 313403696 316608071
1419.5 316608071 319682389 322506398 325041533 326980710 328187376 328564644 328268856 327344894 326128185
1437.9 326128185 325523615 325629115 326077074 326657474 327281207 327870220 328447759 329470009 331860304
1456.2 331860304 335621655 339253068 342785001 346769273 351151496 356213570 363237709 373098165
1472.6 373098165 383250833 391255528 397258192 401410282 403712362 404089838 402464896 398470670
1488.9 398470670 392405719 385937989 378911823 370302230 361425668 353573978 346477807 337803632
1505.2 337803632 325002342 313032389 303479940 294607103 286979228 281362444 277823001 274933934
$$ packed form
1384.9C00529003k759367j650661p22707l20434k93225j42038K56568P64966J318753
1403.2B96980858J830906K105712K246112K404541K472132K542198K821237L204375
1419.5C16608071L074318K824009K535135J939177J206666L77268k95788r23962j216709
1437.9C26128185o04570J05500M47959N80400O23733N89013N77539J022250K390295
1456.2C31860304L761351L631413L531933L984272M382223N062074P024139R860456
1472.6C73098165J0152668Q004695O002664M152090K302080L77476j624942l994226
1488.9C98470670o064951o467730p026166q609593q876562p851690p096171q674175
1505.2C37803632j2801290j1969953r552449q872837p627875n616784l539443k889067
$$ plain form
1521.5 274933934 271870524 268743455 265419543 262480974 259948134 257412463 255469948 254306942
1537.8 254306942 253255278 252577394 252899230 254098862 256143540 259107232 262856662 267196178 271863133
1556.2 271863133 277527183 283630371 287818313 291427165 295145094 298644125 301786363 304191738
1572.5 304191738 306155056 307792187 308695853 309056103 309034437 308685660 307999820 306937486 305357635
1590.9 305357635 303234905 300556660 297383428 293681234 289265692 284120828 278353959 271894604
1607.2 271894604 264479339 256456733 248426229 239512444 228769720 218875527 209521353 198681325
1623.5 198681325 187966645 178313270 169358432 161727771 154827133 147612870 142300099 139706090
1639.8 139706090 138572574 138345495 138881221 140051678 141393021 143173814 145848319 148555771 151393801
$$ packed form
1521.5B74933934l063410l127069l323912k938569k532840k535671j942515j163006
1537.8B54306942j051664o77884L21836J199632K044678K963692L749430M339516M666955
1556.2B71863133N664050O103188M187942L608852L717929L499031L142238K405375
1572.5C04191738J963318J637131R03666L60250k1666l48777o85840j062334j579851
1590.9C05357635k122730k678245l173232l702194m415542n144864n766869o459355
1607.2B71894604p415265q022606q030504q913785j0742724r894193r354174j0840028
1623.5A98681325j0714680r653375q954838p630661o900638p214263n312771k594009
1639.8A39706090j133516k27079N35726J170457J341343J780793K674505K707452K838030
$$ plain form
1658.2 151393801 155092865 159937024 165567681 171174929 177553430 185077041 192254484 199774966
1674.5 199774966 208141401 216198772 224114835 233403698 245507747 257145166 267780244 279913276
1690.8 279913276 293093622 309392393 328671396 348248184 369649351 387444109 402217478
1705.1 402217478 416808695 429271936 439780831 449055523 457544535 465737432 472572148 477660149
1721.4 477660149 482060879 486090779 489570141 492744952 495724738 498855919 501870930 504596114
1737.7 504596114 507933795 512110353 516948998 522672057 529485524 537634611 546548307 554965317
1754 554965317 563338816 571867406 580029011 588263154 595869541 602651179 609256208 615630269 621888816
1772.4 621888816 627451181 631939173 636095822 640268445 644222438 647820175 651063144 654063582
$$ packed form
1658.2A51393801L699064M844159N630657N607248O378501P523611P177443P520482
1674.5A99774966Q366435Q057371P916063R288863J2104049J1637419J0635078J2133032
1690.8B79913276J3180346J6298771J9279003J9576788K1401167J7794758J4773369
1705.1D02217478J4591217J2463241J0508895R274692Q489012Q192897O834716N088001
1721.4D77660149M400730M029900L479362L174811K979786L131181L015011K725184
1737.7E04596114L337681M176558M838645N723059O813467Q149087Q913696Q417010
1754E54965317Q373499Q528590Q161605Q234143P606387O781638O605029O374061O258547
1772.4F21888816N562365M487992M156649M172623L953993L597737L242969L000438
$$ plain form
1788.7 654063582 657123923 660282016 663004756 665341496 667668998 670108795 672497511 674664736
1805 674664736 676699877 678751171 680884898 682914436 684756398 686506510 688276231 690079331 691917777
1823.4 691917777 693706989 695276678 696783662 698327184 699793041 701125205 702326059 703487456
1839.7 703487456 704783976 706201911 707396507 708268881 709152818 710220039 711345077 712372720 713254750
1858 713254750 714122891 715066135 716046095 716975570 717785954 718480170 719171345 719954491 720717192 721387863
1878.4 721387863 722088218 722946584 723878980 724698067 725383461 726053894 726801217 727567255 728200436 728709698
1898.8 728709698 729280710 729949117 730605304 731154203 731603384 732040226 732518017 733037174 733530939 733949423
1919.2 733949423 734357059 734831154 735260606 735562205 735837400 736184895 736585319 736911893 737150192 737395227
$$ packed form
1788.7F54063582L060341L158093K722740K336740K327502K439797K388716K167225
1805F74664736K035141K051294K133727K029538J841962J750112J769721J803100J838446
1823.4F91917777J789212J569689J506984J543522J465857J332164J200854J161397
1839.7G03487456J296520J417935J194596Q72374Q83937J067221J125038J027643Q82030
1858G13254750Q68141R43244R79960R29475Q10384O94216O91175P83146P62701O70671
1878.4G21387863P00355Q58366R32396Q19087O85394O70433P47323P66038O33181N09262
1898.8G28709698N71012O68407O56187N48899M49181M36842M77791N19157M93765M18484
1919.2G33949423M07636M74095M29452L01599K75195L47495M00424L26574K38299K45035
$$ plain form
1939.6 737395227 737707913 738038838 738314271 738523185 738708138 738965690 739323616 739664376 739883721 740099490
1960 740099490 740433872 740813613 741112113 741312742 741498053 741751015 742051363 742303789 742477238 742611945
1980.4 742611945 742792070 742999136 743158102 743275940 743402183 743526399 743625283 743731499 743834555 743923664
2000.8 743923664 744002104 744043410 743999422 743895173 743797064 743707836 743564308 743339777 743097365 742890358
2021.2 742890358 742716610 742510378 742245674 741969824 741747916 741554618 741302729 741003394 740752399 740595281
2041.6 740595281 740463674 740289927 740092993 739964128 739938617 739970326 739974499 739934981 739943922 740055859 740204692
2064 740204692 740275204 740281999 740355253 740532339 740680456 740703464 740675986 740742743 740900815 740990877 740979075
2086.5 740979075 741001844 741156578 741352558 741463959 741493225 741553068 741731465 741968274 742100239 742098987
$$ packed form
1939.6G37395227L12686L30925K75433K08914J84953K57552L57926L40760K19345K15769
1960G40099490L34382L79741K98500K00629J85311K52962L00348K52426J73449J34707
1980.4G42611945J80125K07066J58966J17838J26243J24216R8884J06216J03056Q9109
2000.8G43923664P8440M1306m3988j04249r8109q9228j43528k24531k42412k07007
2021.2G42890358j73748k06232k64704k75850k21908j93298k51889k99335k50995j57118
2041.6G40595281j31607j73747j96934j28865k5511L1709M173l9518Q941J11937J48833
2064G40204692P0512O795P3254J77086J48117K3008k7478O6757J58072R0062j1802
2086.5G40979075K2769J54734J95980J11401K9266N9843J78397K36809J31965j252
$$ plain form
2106.9 742098987 742146432 742345273 742575288 742688715 742705286 742735088 742846370 742997110 743100584 743136227
2127.3 743136227 743190169 743356168 743549883 743646145 743662834 743708551 743834972 743989468 744088769 744147480 744271398
2149.7 744271398 744469583 744666874 744822025 744968593 745177865 745460510 745776176 746100843 746422291 746776462
2170.1 746776462 747212172 747673869 748073876 748406231 748750269 749172032 749638081 750052929 750388861 750728190
2190.5 750728190 751115680 751505375 751859725 752174616 752483487 752833724 753194690 753518343 753817499 754113674
2210.9 754113674 754432261 754786015 755127728 755408645 755639851 755858839 756082475 756276011 756428361 756573975
2231.3 756573975 756736755 756928384 757105649 757206202 757244289 757316530 757435977 757503688 757511616 757549047 757632494
2253.7 757632494 757694840 757712662 757713020 757750571 757855356 757948160 757964671 757948220 757934272 757946730 757995009 757981122
$$ packed form
2106.9G42098987M7445J98841K30015J13427J6571K9802J11282J50740J03474L5643
2127.3G43136227N3942J65999J93715R6262J6689M5717J26421J54496R9301N8711J23918
2149.7G44271398J98185J97291J55151J46568K09272K82645L15666L24667L21448L54171
2170.1G46776462M35710M61697M00007L32355L44038M21763M66049M14848L35932L39329
2190.5G50728190L87490L89695L54350L14891L08871L50237L60966L23653K99156K96175
2210.9G54113674L18587L53754L41713K80917K31206K18988K23636J93536J52350J45614
2231.3G56573975J62780J91629J77265J00553L8087P2241J19447O7711P928L7431Q3447
2253.7G57632494O2346J7822L58L7551J04785R2804J6511j6451j3948J2458M8279j3887
$$ plain form
2278.2 757981122 757844210 757677138 757593155 757575750 757539809 757460713 757375181 757333457 757347167 757351279 757276893
2300.6 757276893 757184505 757154763 757186294 757233381 757240474 757177532 757082522 757088661 757251740 757423997 757447124
2323.1 757447124 757432580 757514000 757612169 757548749 757247925 756908894 756688893 756536007 756277800 755750418
2343.5 755750418 754851758 753821313 753188848 753235817 753804326 754459858 754884660 754788756 754217923 753507197
2363.8 753507197 752663314 751512051 750208259 748970926 747816265 746716559 745679140 744681835 743714750
2382.2 743714750 742852509 742145121 741587520 741106749 740586042 740006268 739428639 738868296 738277853 737611115
2402.6 737611115 736886263 736193001 735557735 734901071 734160423 733364701 732564390 731767297 730952859 730108261
2423 730108261 729257464 728416800 727599978 726784885 725905955 724964261 724026263 723121762 722237051 721353471
$$ packed form
2278.2G57981122j36912j67072q3983j7405l5941p9096q5532m1724J3710M112p4386
2300.6G57276893r2388k9742L1531M7087P093o2942r5010O139J63079J72257K3127
2323.1G57447124j4544Q1420R8169o3420l00824l39031k20001j52886k58207n27382
2343.5G55750418q98660j030445o32465M6969N68509O55532M24802r5904n70833p10726
2363.8G53507197q43883j151263j303792j237333j154661j099706j037419r97305r67085
2382.2G43714750q62241p07388n57601m80771n20707n79774n77629n60343n90443o66738
2402.6G37611115p24852o93262o35266o56664p40648p95722q00311p97093q14438q44598
2423G30108261q50797q40664q16822q15093q78930r41694r37998r04501q84711q83580
$$ plain form
2443.4 721353471 720450878 719546556 718668342 717783511 716851830 715909064 714996576 714107275 713238060 712381423
2463.8 712381423 711511612 710630238 709762752 708893061 707989812 707076848 706188202 705298483 704385102 703489900
2484.2 703489900 702639878 701794505 700936139 700101852 699290454 698461473 697612762 696789205 695996881 695207417
2504.6 695207417 694422483 693637490 692840457 692031860 691223979 690418959 689608335 688796878 687977016 687164128
2525 687164128 686357439 685489476 684552193 683625519 682737648 681847751 680958033 680079103 679204643 678364575
2545.4 678364575 677524924 676615119 675688386 674824655 673985362 673108280 672223449 671377361 670555413 669725597
2565.8 669725597 668883681 668039620 667191744 666342974 665516734 664711177 663869143 662954986 662032485 661179841
2586.2 661179841 660344601 659446597 658540487 657681286 656806648 655887544 654963195 654032826 653094769 652117252
$$ packed form
2443.4G21353471r02593r04322q78214q84831r31681r42766r12488q89301q69215q56637
2463.8G12381423q69811q81374q67486q69691r03249r12964q88646q89719r13381q95202
2484.2G03489900q50022q45373q58366q34287q11398q28981q48711q23557p92324p89464
2504.6F95207417p84934p84993p97033q08597q07881q05020q10624q11457q19862q12888
2525F87164128q06689q67963r37283r26674q87871q89897q89718q78930q74460q40068
2545.4F78364575q39651r09805r26733q63731q39293q77082q84831q46088q21948q29816
2565.8F69725597q41916q44061q47876q48770q26240q05557q42034r14157r22501q52644
2586.2F61179841q35240q98004r06110q59201q74638r19104r24349r30369r38057r77517
$$ plain form
2606.6 652117252 651039481 649902880 648750246 647579014 646414518 645228267 643964708 642640352
2622.9 642640352 641310632 639994144 638637841 637206852 635756850 634353459 632973909 631574035
2639.2 631574035 630156815 628720701 627272666 625845909 624448895 623030722 621586144 620186090
2655.5 620186090 618829846 617450118 616028845 614618838 613271832 611972213 610672891 609340727
2671.8 609340727 607968688 606616259 605351329 604137361 602905273 601660967 600450575 599273443
2688.1 599273443 598087728 596845388 595550179 594250679 592959464 591646194 590261340 588811159
2704.5 588811159 587370038 585961282 584518969 582991183 581417382 579878926 578386307 576878071
2720.8 576878071 575350940 573855340 572424829 571065187 569737077 568394899 567051828 565758467
$$ packed form
2606.6F52117252j077771j136601j152634j171232j164496j186251j263559j324356
2622.9F42640352j329720j316488j356303j430989j450002j403391j379550j399874
2639.2F31574035j417220j436114j448035j426757j397014j418173j444578j400054
2655.5F20186090j356244j379728j421273j410007j347006j299619j299322j332164
2671.8F09340727j372039j352429j264930j213968j232088j244306j210392j177132
2688.1E99273443j185715j242340j295209j299500j291215j313270j384854j450181
2704.5E88811159j441121j408756j442313j527786j573801j538456j492619j508236
2720.8E76878071j527131j495600j430511j359642j328110j342178j343071j293361
$$ plain form
2737.1 565758467 564527869 563321054 562084258 560802042 559532642 558345973 557204425 556025088
2753.4 556025088 554817140 553616285 552421033 551221788 550006211 548782349 547564626 546320260
2769.7 546320260 544992983 543584526 542182982 540823936 539424539 537932217 536351442 534716308
2786 534716308 533070326 531392932 529649615 527824342 525926113 524011850 522087991 520096123 518018603
2804.4 518018603 515882492 513706326 511480927 509188116 506825328 504407108 501942635 499406397
2820.7 499406397 496752858 493968159 491060883 488016993 484798402 481355935 477648377 473596871
2837 473596871 469040215 463790476 457684636 450653493 442875504 434916347 427611828 421740115 417648703
2855.4 417648703 415007919 413018525 410842985 407898486 404055893 399570405 394890159 390575230
$$ packed form
2737.1E65758467j230598j206815j236796j282216j269400j186669j141548j179337
2753.4E56025088j207948j200855j195252j199245j215577j223862j217723j244366
2769.7E46320260j327277j408457j401544j359046j399397j492322j580775j635134
2786E34716308j645982j677394j743317j825273j898229j914263j923859j991868k077520
2804.4E18018603k136111k176166k225399k292811k362788k418220k464473k536238
2820.7D99406397k653539k784699k907276l043890l218591l442467l707558m051506
2837D73596871m556656n249739o105840p031143p777989p959157p304519n871713m091412
2855.4D17648703k640784j989394k175540k944499l842593m485488m680246m314929
$$ plain form
2871.7 390575230 387048215 384430021 382623136 381366372 380347461 379294604 378019720 376484722
2888 376484722 374718457 372707605 370465487 368031204 365371585 362441361 359242171 355733007 351823539
2906.4 351823539 347435087 342502236 337021977 331068456 324804187 318569183 312838525 308028579
2922.7 308028579 304423571 302197844 301344275 301753461 303387880 306225240 310118079 314746946 319671392
2941 319671392 324446708 328675538 332066208 334522188 336094648 336973429 337572545 338428915 339960366
2959.4 339960366 342371881 345715970 349968076 355030209 360744476 366935343 373400897 379956692
2975.7 379956692 386453599 392738074 398637533 404032558 408910602 413244903 416949332 419964641
2992 419964641 422296584 423968941 424949884 425237507 424935937 424168468 423090726 421862513 420574605
$$ packed form
2871.7C90575230l527015k618194j806885j256764j018911j052857j274884j534998
2888C76484722j766265k010852k242118k434283k659619k930224l199190l509164l909468
2906.4C51823539m388452m932851n480259n953521o264269o235004n730658m809946
2922.7C08028579l605008k225727q53569M09186J634419K837360L892839M628867M924446
2941C19671392M775316M228830L390670K455980J572460Q78781N99116Q56370J531451
2959.4C39960366K411515L344089M252106N062133N714267O190867O465554O555795
2975.7C79956692O496907O284475N899459N395025M878044M334301L704429L015309
2992D19964641K331943J672357R80943K87623l01570p67469j077742j228213j287908
$$ plain form
3010.4 420574605 419326037 418179899 417054892 415796995 414309531 412542373 410479546 408252925
3026.7 408252925 406052768 403898746 401705801 399456561 397147954 394726217 392195553 389619201
3043 389619201 387005866 384337753 381641805 378954291 376255870 373544306 370872080 368285447 365822941
3061.4 365822941 363499969 361327529 359335870 357506901 355757147 354045868 352411091 350879252
3077.7 350879252 349419773 347974420 346539944 345195055 344002277 342932254 341884434 340800941
3094 340800941 339721859 338657230 337541044 336332232 335037917 333705544 332376212 331018955 329595625
3112.4 329595625 328101486 326531231 324896812 323204279 321431130 319605768 317758799 315853387
3128.7 315853387 313883632 311875701 309833109 307753772 305655330 303533316 301353663 299134076
$$ packed form
3010.4D20574605j248568j146138j125007j257897j487464j767158k062827k226621
3026.7D08252925k200157k154022k192945k249240k308607k421737k530664k576352
3043C89619201k613335k668113k695948k687514k698421k711564k672226k586633k462506
3061.4C65822941k322972k172440j991659j828969j749754j711279j634777j531839
3077.7C50879252j459479j445353j434476j344889j192778j070023j047820j083493
3094C40800941j079082j064629j116186j208812j294315j332373j329332j357257j423330
3112.4C29595625j494139j570255j634419j692533j773149j825362j846969j905412
3128.7C15853387j969755k007931k042592k079337k098442k122014k179653k219587
$$ plain form
3145 299134076 296923786 294726819 292513758 290267646 287998438 285721809 283435374 281139910 278827548
3163.4 278827548 276502281 274196982 271908760 269621134 267331034 265028059 262731135 260480434
3179.7 260480434 258252919 256020248 253804415 251630843 249506161 247397766 245275587 243190140
3196 243190140 241195962 239260346 237347305 235446259 233570114 231746614 229981065 228246227 226500332
3214.3 226500332 224772424 223103970 221432492 219695866 217925742 216160342 214417338 212692559
3230.7 212692559 210938573 209084213 207124472 205174148 203258544 201274797 199200764 197091088
3247 197091088 194977850 192847475 190670192 188437343 186146572 183829635 181567356 179419294 177367836
3265.3 177367836 175368518 173451245 171682179 170059368 168532073 167083785 165747479 164575920
$$ packed form
3145B99134076k210290k196967k213061k246112k269208k276629k286435k295464k312362
3163.4B78827548k325267k305299k288222k287626k290100k302975k296924k250701
3179.7B60480434k227515k232671k215833k173572k124682k108395k122179k085447
3196B43190140j994178j935616j913041j901046j876145j823500j765549j734838j745895
3214.3B26500332j727908j668454j671478j736626j770124j765400j743004j724779
3230.7B12692559j753986j854360j959741j950324j915604j983747k074033k109676
3247A97091088k113238k130375k177283k232849k290771k316937k262279k148062k051458
3265.3A77367836j999318j917273j769066j622811j527295j448288j336306j171559
$$ plain form
3281.6 164575920 163562670 162674204 161913410 161258191 160689279 160226956 159858093 159540609 159268722
3300 159268722 159054697 158907220 158804730 158726811 158682987 158670709 158681750 158721626 158810794 158931613 159024134
3322.4 159024134 159075737 159113124 159144536 159201607 159273610 159316480 159375086 159424335 159363240 159250274 159170583
3344.9 159170583 159080967 158981234 158897907 158759952 158546478 158347547 158221662 158142731 158033237 157862440
3365.3 157862440 157680154 157498404 157266870 157035649 156910196 156848893 156758919 156639546 156541854 156487882
3385.7 156487882 156518906 156602472 156593785 156506747 156484202 156605288 156838223 157002166 157003134 157031089 157211795
3408.1 157211795 157472834 157752469 158044651 158344716 158664122 159027874 159469143 160064861 160803422 161586761
3428.5 161586761 162352085 163183153 164119914 164964944 165648550 166394129 167329967 168372929 169445813
$$ packed form
3281.6A64575920j013250q88466p60794o55219n68912m62323l68863l17484k71887
3300A59268722k14025j47477j02490p7919m3824j2278J1041L9876Q9168J20819R2521
3322.4A59024134N1603L7387L1412N7071P2003M2870N8606M9249o1095j12966p9691
3344.9A59170583q9616r9733q3327j37955k13474j98931j25885p8931j09494j70797
3365.3A57862440j82286j81750k31534k31221j25453o1303q9974j19373r7692n3972
3385.7A56487882L1024Q3566q687q7038k2545J21086K32935J63943R68K7955J80706
3408.1A57211795K61039K79635K92182L00065L19406L63752M41269N95718P38561P83339
3428.5A61586761P65324Q31068R36761Q45030O83606P45579R35838J042962J072884
$$ plain form
3446.8 169445813 170523673 171650350 172831342 174082235 175456047 176864460 178173482 179479301
3463.2 179479301 180995733 182688162 184288904 185671046 187050149 188608214 190353990 192188829
3479.5 192188829 193958029 195701674 197564408 199493751 201395288 203326091 205321863 207358554
3495.8 207358554 209384307 211425841 213509336 215524450 217464879 219514281 221729279 224042699
3512.1 224042699 226360574 228594422 230846569 233230904 235768363 238329187 240806893 243314594
3528.4 243314594 245916352 248578101 251339078 254146606 256897062 259744406 262804031 265961647
3544.7 265961647 269020349 271997869 275099993 278379887 281713903 285070240 288536400 292078674
3561.1 292078674 295607001 299284905 303393185 307558477 311425686 315322876 319481105 323799610
$$ packed form
3446.8A69445813J077860J126677J180992J250893J373812J408413J309022J305819
3463.2A79479301J516432J692429J600742J382142J379103J558065J745776J834839
3479.5A92188829J769200J743645J862734J929343J901537J930803J995772K036691
3495.8B07358554K025753K041534K083495K015114J940429K049402K214998K313420
3512.1B24042699K317875K233848K252147K384335K537459K560824K477706K507701
3528.4B43314594K601758K661749K760977K807528K750456K847344L059625L157616
3544.7B65961647L058702K977520L102124L279894L334016L356337L466160L542274
3561.1B92078674L528327L677904M108280M165292L867209L897190M158229M318505
$$ plain form
3577.4 323799610 328226745 332756907 337299854 341950983 346901476 351828992 356412739 361074358
3593.7 361074358 366066247 371150374 376228780 381321043 386286467 391197950 396396607 401706249
3610 401706249 406938851 412203431 417342007 422718495 428511500 433816463 438504428 443321884 449176788
3628.4 449176788 455291480 460295737 465062648 470027715 474949181 479842097 484604925 489170521
3644.7 489170521 494008243 499726027 505316973 509510159 513386905 518022776 522575676 526564479
3661 526564479 530421555 534166455 537779570 541794002 545898557 549278200 552931249 556679785 559529960
3679.4 559529960 562140226 564812422 567532957 570728242 574229956 576982021 579013050 580930591
3695.7 580930591 582851768 584851563 587081552 589152813 590769947 592333496 594223320 596330225
$$ packed form
3577.4C23799610M427135M530162M542947M651129M950493M927516M583747M661619
3593.7C61074358M991889N084127N078406N092263M965424M911483N198657N309642
3610D01706249N232602N264580N138576N376488N793005N304963M687965M817456N854904
3628.4D49176788O114692N004257M766911M965067M921466M892916M762828M565596
3644.7D89170521M837722N717784N590946M193186L876746M635871M552900L988803
3661E26564479L857076L744900L613115M014432M104555L379643L653049L748536K850175
3679.4E59529960K610266K672196K720535L195285L501714K752065K031029J917541
3695.7E80930591J921177J999795K229989K071261J617134J563549J889824K106905
$$ plain form
3712 596330225 597989321 599128842 600328624 601804316 603367269 604807019 606097460 607209206 608288825
3730.3 608288825 609733343 611481965 613036156 613959134 614284515 614881516 616515338 617939472 618734300
3748.7 618734300 620103776 621530175 622269034 622904003 623829186 624749780 625450313 626247704 627162457
3767.1 627162457 628152370 629173398 629885852 630449295 631290376 632360637 633177102 633727431 634390652
3785.4 634390652 635124743 635847211 636557221 637173116 637863040 638515890 639131248 640174866 640990615
3803.8 640990615 641495287 642280161 642766058 642891228 643306434 644262135 645032048 645605147 646463633 646898329
3824.2 646898329 647063255 647404015 647838116 648385108 648953080 649633884 650460780 650965035 651174724 651399195
3844.6 651399195 651532233 651502788 651619732 652725399 654279053 654509246 654144108 654153883 654632151 655188203
$$ packed form
3712E96330225J659096J139521J199782J475692J562953J439750J290441J111746J079619
3730.3F08288825J444518J748622J554191R22978L25381N97001J633822J424134P94828
3748.7F18734300J369476J426399P38859O34969R25183R20594P00533P97391R14753
3767.1F27162457R89913J021028P12454N63443Q41081J070261Q16465N50329O63221
3785.4F34390652P34091P22468P10010O15895O89924O52850O15358J043618Q15749
3803.8F40990615N04672P84874M85897J25170M15206R55701P69913N73099Q58486M34696
3824.2F46898329J64926L40760M34101N46992N67972O80804Q26896N04255K09689K24471
3844.6F51399195J33038k9445J16944J105667J553654K30193l65138R775M78268N56052
$$ plain form
3865 655188203 655398011 655738950 656437755 656835079 656966567 656995237 657239616 657789767 658132911 658516169
3885.4 658516169 658771753 658705652 658988893 659379303 659402370 659466624 659809291 660223424 660618782 660895944
3905.7 660895944 660905838 660828412 660802543 660829484 661081493 661516070 661777139 661801457 661870420 662017465 662054777
3928.2 662054777 662149847 662441313 662652612 662687600 662709773 662836552 663107038 663292527 663330436 663454413
3948.6 663454413 663601518 663686156 663808346 663964093 664116740 664312005 664508641 664578199 664583385 664655745
3969 664655745 664800882 664965928 665100336 665210962 665320992 665409029 665472448 665559232 665676177 665827692
3989.4 665827692 666003466 666145384 666267574 666400671
3997.5 666400671
$$ packed form
3865F55188203K09808L40939O98805L97324J31488K8670K44379N50151L43144L83258
3885.4F58516169K55584o6101K83241L90410K3067O4254L42667M14133L95358K77162
3905.7F60895944R894p7426k5869K6941K52009M34577K61069K4318O8963J47045L7312
3928.2F62054777R5070K91466K11299L4988K2173J26779K70486J85489L7909J23977
3948.6F63454413J47105Q4638J22190J55747J52647J95265J96636O9558N186P2360
3969F64655745J45137J65046J34408J10626J10030Q8037O3419Q6784J16945J51515
3989.4F65827692J75774J41918J22190J33097
3997.5F66400671
##END=$$ End of the data block
