##TITLE=G17-52-CE $$ Begin of the data block
##JCAMP-DX=5.00 $$ ACD/SpecManager v 10.08
##SPECTROMETER/DATA SYSTEM=Alpha
##DATE=21 Oct 2013 11:04:12
##DATA TYPE=INFRARED SPECTRUM
##DATA CLASS=XYDATA
##ORIGIN=
##OWNER=
##NPOINTS=1765
##FIRSTX=399.75695801
##LASTX=3997.56933594
##MAXX=3997.56933594
##MINX=399.75695801
##MAXY=0.75880474
##MINY=0.13847105
##XFACTOR=1.0000000000
##YFACTOR=1.000000000000000e-9
##FIRSTY=0.43528265
##DELTAX=2.03957629
##XUNITS=1/CM
##YUNITS=ARBITRARY UNITS
##XYDATA=(X++(Y..Y))
399.8 435282648 431226462 428074032 426283181 425509244 425032526 424619108 424544364 424785197 424813032 423914135
420.2 423914135 422255516 420464575 418858081 417303979 415337622 413232774 411636502 410611928
436.5 410611928 410179913 410450071 411364526 412681550 413866967 414351255 414059252 413335502 412333220
454.8 412333220 410794646 408542216 405992806 403559446 401336879 399075001 396592826 394108027
471.1 394108027 391877294 389908731 387990206 386219025 384975851 384257853 383572936 382477582 380858243
489.5 380858243 378928393 376984745 374997139 372839481 370395631 367469639 364294529 361201644
505.8 361201644 358086973 355086625 352389604 349794030 347157210 344554156 342106313 340092629
522.1 340092629 338881195 338351399 337996215 337747633 338099450 339408487 341486424 343957186 346316338
540.5 346316338 348019332 348978758 349382639 349242896 348612815 347685426 346562415 345317632 343982458
558.8 343982458 342438847 340485394 338146299 335701406 333375484 331488460 330552727 330753058 331772000
577.2 331772000 333297670 335359722 337945133 340680391 343225092 345251888 346447229 346933961 347144842
595.6 347144842 347347945 347511858 347506404 347403377 347428083 347592860 347757459 347852379 348037809 348511755
616 348511755 349311113 350555480 352349162 354625493 357282788 360182911 362984121 365374237 367417514
634.3 367417514 369405031 371389389 373141140 374530822 375720888 376867533 377855122 378440440 378673941
652.7 378673941 378848255 379072428 379309505 379496962 379679114 380084842 381005347 382284433 383224428 384256870
673.1 384256870 385722727 387459785 389259398 390952885 392374635 393532872 394418597 394919097 394999027
691.4 394999027 394502163 393424004 392226160 391619146 392057210 393439233 395426661 397828132 400573969
709.8 400573969 403640628 407040924 410758585 414828688 419354111 424238861 429253280 434241742
726.1 434241742 438962042 443289846 447116822 450203508 452545285 454307765 455645263 456641704 457318813
744.4 457318813 457653642 457729042 457662106 457450211 456947446 456016272 454756886 453559756 452911407 453058809
764.8 453058809 454178065 456558615 460388839 465396762 470946997 476475447 481739253 486676008
781.2 486676008 491063505 494698644 497609496 500056982 502306223 504391313 506392896 508721888
797.5 508721888 511731803 515431523 519455433 523135304 526106536 528521180 530506074 531870902
813.8 531870902 532548547 532723069 532524347 531838417 530413270 528231680 525616944 523017228 520706296
832.1 520706296 518534422 516126573 513525426 511091948 508979917 507082641 505325496 503909290
848.5 503909290 502985179 502405763 501951993 501535833 501475096 502632916 505728245 510583639 516447961
866.8 516447961 522653461 528608918 533643126 537140548 538746953 538482308 536537826 533136904 528639019
885.2 528639019 523504496 518180549 512923539 507781446 502786338 497887313 492866278 487442970
901.5 487442970 481406212 474710613 467450857 459809393 452014685 444381475 437306881 431150943
917.8 431150943 426194072 422582328 420193017 418582618 417286634 416109741 415068597 414232165 413508028
936.2 413508028 412685037 411657125 410225391 407712400 403203011 396343738 387646317 377923131 367720485
954.5 367720485 357295007 346720636 336000204 325207978 314468801 303852051 293483019
968.8 293483019 283649027 274625599 266568661 259546310 253612459 248830810 245134100 242272124
985.1 242272124 239998877 238125399 236472309 234966993 233669430 232666150 231977522 231558189 231285065
1003.5 231285065 230869532 229998022 228602722 226817504 224824011 222764760 220695466 218635485 216568783
1021.8 216568783 214418963 212159634 209872827 207628325 205436781 203275830 201113835 198947221
1038.1 198947221 196823984 194792584 192883283 191185907 189843357 188960269 188582376 188729689 189339519
1056.5 189339519 190314054 191624552 193250626 195061952 196716815 197650507 197455138 196437806 195521861
1074.8 195521861 195524469 196715266 198989928 202152118 205964804 210147172 214470521 218766570 222838089
1093.2 222838089 226475969 229582965 232121617 234047636 235534266 236971334 238721281 240982726
1109.5 240982726 243732303 246762633 249831498 252778769 255511045 257967740 260171145 262299955
1125.8 262299955 264641881 267403066 270449072 273359865 275722682 277294129 278049529 278128117 277732670
1144.2 277732670 277068198 276353955 275805175 275612980 275933653 276919037 278750896 281538188 285221636
1162.6 285221636 289638817 294635922 300132930 306219161 313033104 320489347 328298986 336200476
1178.9 336200476 344017059 351510227 358391732 364435852 369442284 373258233 375782043 376975417
1195.2 376975417 376993686 376162350 374822348 373228371 371594995 370114952 368922561 367996752 367116392
1213.5 367116392 366055340 364763469 363281250 361596495 359666497 357476175 355114669 352753133
1229.9 352753133 350535363 348552078 346898705 345700175 345108688 345227927 346018195 347376049 349217266
1248.2 349217266 351470619 354000390 356641203 359304100 361973941 364608258 367137998 369558841
1264.5 369558841 371930957 374311090 376603961 378620327 380258292 381560743 382653773 383707702
1280.8 383707702 384851933 386088341 387364864 388593614 389595926 390115082 389985114 389173925 387769848
1299.2 387769848 385923505 383765429 381430775 379093409 376952529 375156373 373825073 373053372
1315.5 373053372 372891873 373252839 373819321 374127656 373800009 372690618 370872408 368595332 366193295
1333.9 366193295 364003956 362211019 360844433 359875888 359177738 358523279 357728243 356658161 355229497
1352.2 355229497 353466541 351448685 349251121 346734703 343478948 339389324 334965110 330702424
1368.5 330702424 327087224 323895335 320420027 316622704 312657624 308461368 304260731 300607741
1384.9 300607741 297881961 296242207 295497835 295144260 294851929 294757307 295043170 295802176 297115505
1403.2 297115505 298963010 301104099 303365380 305746138 308203131 310749799 313580215 316832870
1419.5 316832870 319944143 322747022 325266629 327214003 328417063 328782171 328472465 327526838 326300085
1437.9 326300085 325696379 325800151 326255560 326838821 327447921 328029126 328610629 329627991 331981987
1456.2 331981987 335723609 339387149 342943519 346935272 351310521 356333852 363294721 373117477
1472.6 373117477 383300453 391332716 397326976 401482195 403790414 404124111 402418524 398361355
1488.9 398361355 392285526 385838807 378826559 370205641 361305624 353438079 346304268 337581277
1505.2 337581277 324848861 313002557 303470671 294583559 286982268 281407684 277877420 274964243
1521.5 274964243 271901697 268811673 265519798 262594402 260068268 257557422 255648643 254492402
1537.8 254492402 253416628 252733141 253093421 254346609 256427199 259403467 263157547 267489582 272128075
1556.2 272128075 277755469 283875674 288107783 291716188 295403481 298883557 302032590 304442972
1572.5 304442972 306386948 308017284 308938831 309277862 309202999 308837414 308164060 307092845 305499911
1590.9 305499911 303397924 300760031 297595501 293856800 289411604 284271210 278504044 272019893
1607.2 272019893 264599025 256605744 248595029 239690676 228961214 219076365 209741548 198906913
1623.5 198906913 188167572 178494468 169519261 161850363 154929936 147745445 142455444 139855623
1639.8 139855623 138709977 138471052 139013439 140209615 141575456 143380910 146069840 148772493 151601121
1658.2 151601121 155287102 160120070 165743843 171358168 177771255 185319394 192484736 199993774
1674.5 199993774 208358750 216405064 224318519 233629987 245761752 257424772 268065572 280168951
1690.8 280168951 293316245 309587210 328832835 348410785 369864583 387698829 402471215
1705.1 402471215 417050868 429516673 440035224 449324608 457837164 466075510 472971410 478090614
1721.4 478090614 482476532 486468136 489933521 493128449 496108264 499203742 502240241 505018830
1737.7 505018830 508373141 512569547 517438889 523167849 529973269 538130403 547070503 555482864
1754 555482864 563814998 572331250 580531001 588803351 596396863 603122532 609692216 616074324 622357965
1772.4 622357965 627962530 632500231 636682034 640840948 644776821 648391545 651680589 654698610
1788.7 654698610 657721698 660843849 663551092 665871620 668210506 670686901 673109174 675308049
1805 675308049 677358627 679391086 681487799 683504760 685366154 687123477 688884258 690696180 692535162
1823.4 692535162 694290221 695818961 697305202 698854208 700327456 701659739 702883005 704087019
1839.7 704087019 705389321 706772685 707983792 708920002 709820986 710857809 711953759 712952793 713806927
1858 713806927 714672446 715637982 716631413 717533290 718296051 718997538 719753802 720585525 721366525 722046912
1878.4 722046912 722740769 723583639 724498510 725304246 726005614 726705849 727464318 728229105 728870094 729395568
1898.8 729395568 729960024 730590641 731214523 731755137 732203901 732661486 733183205 733718514 734198391 734604180
1919.2 734604180 734985113 735429466 735868990 736191034 736448288 736771941 737187147 737553477 737812340 738041878
1939.6 738041878 738346517 738704324 738986731 739170909 739357948 739641190 740001082 740335166 740577996 740811408
1960 740811408 741117954 741469264 741769254 741970479 742142141 742396176 742718995 742977202 743141472 743281424
1980.4 743281424 743472099 743690431 743863642 743971407 744078338 744233012 744382918 744474828 744513869 744576812
2000.8 744576812 744673610 744724393 744672775 744565606 744490206 744438946 744307280 744071484 743832409 743626297
2021.2 743626297 743431985 743207753 742931366 742657959 742448509 742249906 742001653 741710186 741426885 741249204
2041.6 741249204 741153836 741030276 740859091 740734518 740715325 740740657 740716636 740659416 740667462 740781963 740925848
2064 740925848 740995526 741018057 741100252 741273642 741410255 741421461 741396189 741467714 741619289 741701543 741695046
2086.5 741695046 741722703 741864681 742059827 742191374 742225766 742288649 742474079 742694914 742833078 742881536
2106.9 742881536 742945433 743102968 743310511 743437409 743447304 743459702 743574858 743739605 743846178 743885398
2127.3 743885398 743952513 744114518 744300723 744419992 744473875 744536996 744658530 744807541 744918644 744985044
2147.7 744985044 745080471 745245636 745432019 745588839 745746613 745965838 746259868 746583223 746897936 747209847
2168 747209847 747559905 748003781 748489618 748892784 749212563 749561608 749993563 750464916 750876367 751192272
2188.4 751192272 751515806 751906037 752317786 752699554 753024220 753322184 753654420 754016936 754343927 754607856
2208.8 754607856 754874349 755205631 755555391 755861819 756111681 756330848 756580353 756859779 757089198 757243812
2229.2 757243812 757376432 757539570 757731199 757891357 757990777 758057296 758145869 758255363 758318961 758330464
2249.6 758330464 758341014 758383393 758460522 758536935 758572519 758601010 758661211 758717299 758730710 758717537 758710861 758738339
2274.1 758738339 758799076 758804739 758681715 758505046 758419752 758411169 758377254 758312881 758228779 758159876 758158684 758154452
2298.6 758154452 758056641 757948399 757922113 757948101 757993698 758047163 758049309 757977843 757948995 758058071 758232415
2321 758232415 758300483 758270204 758328676 758496284 758506656 758196414 757783413 757485151 757269323 756968796 756470740
2343.5 756470740 755615711 754583895 753969669 754090130 754735589 755389154 755729198 755539060 754901409
2361.8 754901409 754165769 753368556 752271414 750969708 749701500 748531878 747458577 746449232 745452404
2380.2 745452404 744482338 743625998 742920160 742356956 741876304 741357207 740760505 740164876 739609420 739028037
2400.6 739028037 738358915 737637281 736947358 736301661 735644162 734922707 734146774 733371317 732617080 731830716
2421 731830716 730962574 730058134 729198575 728393793 727565825 726671994 725742936 724811077 723899901 723011076
2441.3 723011076 722113490 721192300 720285714 719412625 718524158 717579901 716624796 715729058 714881301 714022577
2461.7 714022577 713147283 712264419 711369395 710486293 709616423 708728194 707821846 706930280 706063330 705193818
2482.1 705193818 704309702 703423142 702522039 701627433 700811267 700054109 699256241 698398173 697553635 696754634
2502.5 696754634 695979834 695194006 694374502 693555176 692764461 691982985 691187084 690362930 689518511 688692153
2522.9 688692153 687888622 687070608 686211169 685312927 684405029 683506250 682618380 681755066 680895448 679994464
2543.3 679994464 679090858 678229451 677367270 676482975 675608814 674751639 673887312 673018813 672173738 671357334
2563.7 671357334 670545518 669706881 668847859 667998672 667149782 666311502 665499508 664641440 663721859 662835479
2584.1 662835479 662009239 661161602 660241485 659321606 658462226 657610655 656719029 655787885 654832304 653870285
2604.5 653870285 652876437 651821733 650715411 649561286 648376107 647197664 646000385 644726634
2620.8 644726634 643397272 642063975 640735149 639380872 637977719 636558473 635169446 633781552
2637.1 633781552 632357359 630915582 629466653 628029108 626632035 625263989 623865068 622426450
2653.5 622426450 621028185 619676173 618297040 616877556 615460157 614080250 612735808 611405551
2669.8 611405551 610084057 608753681 607424855 606161594 604952574 603715718 602461636 601250708
2686.1 601250708 600052178 598838866 597597599 596296132 594983101 593720734 592447996 591066599
2702.4 591066599 589598417 588141680 586724222 585282147 583773375 582212150 580648422 579116702
2718.7 579116702 577593029 576061010 574551463 573133349 571819127 570526123 569184065 567812741
2735 567812741 566492736 565248311 564022243 562774360 561509013 560281456 559138775 557994366 556779563
2753.4 556779563 555571556 554404199 553239465 552049041 550789833 549488783 548247814 547055900
2769.7 547055900 545781493 544394732 542994320 541612148 540196240 538699567 537113130 535474598
2786 535474598 533811986 532112956 530365944 528552353 526673257 524785578 522880554 520885825 518794179
2804.4 518794179 516651154 514472425 512218595 509902418 507565200 505159438 502644420 500051379
2820.7 500051379 497390896 494640291 491772443 488733470 485482931 482028693 478358865 474342018
2837 474342018 469774067 464489043 458346069 451298445 443526089 435546190 428205371 422322065 418214649
2855.4 418214649 415564358 413599342 411445677 408517987 404656559 400101185 395380914 391064048
2871.7 391064048 387559116 384988904 383196026 381906480 380843401 379756153 378495574 377016515
2888 377016515 375282258 373275280 371035784 368581504 365874141 362900585 359684169 356197715 352325261
2906.4 352325261 347946286 343019813 337546259 331544161 325211793 318962693 313240647 308442891
2922.7 308442891 304862827 302628875 301737607 302156925 303855002 306713730 310560882 315166205 320130765
2941 320130765 324940234 329162627 332553208 335012436 336576432 337480426 338127285 338997006 340523124
2959.4 340523124 342937738 346296728 350563794 355624259 361336887 367543370 374034137 380582660
2975.7 380582660 387048304 393344849 399306208 404785573 409727991 414078057 417789310 420820862
2992 420820862 423148721 424805075 425807118 426130980 425826013 425059140 423986912 422738701 421455890
3010.4 421455890 420230538 419087708 417954266 416707635 415272295 413544267 411456823 409182400
3026.7 409182400 406957656 404809833 402636915 400390208 398062140 395619601 393088281 390523076
3043 390523076 387913704 385256976 382574081 379868567 377159715 374458432 371769726 369164675 366705686
3061.4 366705686 364388168 362212002 360215902 358390599 356645912 354928255 353267074 351712137
3077.7 351712137 350236714 348773420 347355336 346075833 344933540 343857050 342801929 341720879
3094 341720879 340610057 339512259 338389844 337196261 335942149 334614277 333231091 331840456 330412030
3112.4 330412030 328902394 327339321 325731903 324036181 322240144 320389897 318521053 316614538
3128.7 316614538 314669698 312692404 310657918 308553547 306409001 304270923 302122742 299909443
3145 299909443 297656208 295439124 293236017 290976822 288678735 286391228 284110814 281809390 279489994
3163.4 279489994 277184159 274877280 272552937 270243615 267955303 265668690 263382554 261131674
3179.7 261131674 258899182 256657541 254444808 252269179 250112116 247963727 245853648 243814275
3196 243814275 241801947 239788905 237840712 235983580 234158054 232347324 230588138 228843704 227066278
3214.3 227066278 225312367 223612681 221919253 220199078 218481734 216780841 215054363 213285059
3230.7 213285059 211477190 209616318 207694307 205722094 203718454 201701134 199664548 197610229
3247 197610229 195513055 193318158 191047132 188797370 186611816 184425697 182229400 180067912 177944034
3265.3 177944034 175892338 173952579 172136128 170476019 168950096 167521000 166243792 165131271
3281.6 165131271 164136946 163262486 162492529 161798567 161200777 160713494 160307333 159962937 159694433 159498706
3302 159498706 159343630 159199134 159089625 159069985 159121200 159175903 159206122 159231097 159292430 159369841 159425318
3324.5 159425318 159498751 159584969 159656495 159737751 159813926 159850508 159832031 159753218 159633413 159490302 159377649
3346.9 159377649 159336016 159288734 159152776 158936307 158720046 158581555 158498466 158376962 158209935 158045813
3367.3 158045813 157873467 157662868 157454610 157305315 157185897 157068059 156929731 156790644 156734511 156815618
3387.7 156815618 156948239 156962141 156863570 156806692 156895012 157090440 157220006 157221258 157285959 157501623 157759070
3410.1 157759070 158017516 158300444 158609971 158967465 159368485 159799710 160348117 161058798 161849812 162619010
3430.5 162619010 163450137 164405182 165268525 165964797 166725680 167669550 168710575 169764251 170810476
3448.9 170810476 171933666 173157230 174427971 175734207 177082509 178443700 179857358 181423485
3465.2 181423485 183081403 184645236 186042696 187446281 189008370 190763175 192600891 194352806
3481.5 194352806 196074381 197910085 199832454 201749280 203674987 205658421 207701087 209733903
3497.8 209733903 211813450 213983580 216064915 218031093 220115498 222365737 224675685 226976186
3514.2 226976186 229189053 231388211 233746603 236355662 238981813 241404027 243800536 246342033
3530.5 246342033 249028891 251883328 254781216 257554322 260412633 263519347 266705573 269765198
3546.8 269765198 272754282 275870383 279148310 282452792 285745889 289174259 292798311 296468496
3563.1 296468496 300220221 304346412 308510810 312365890 316265732 320445716 324805111 329282075
3579.4 329282075 333820671 338348031 343025059 348016858 352972656 357595593 362298161 367290705
3595.7 367290705 372368723 377477139 382598162 387600332 392535448 397726804 403063416 408333004
3612.1 408333004 413615823 418785989 424150586 429860651 435138673 439899832 444771320 450588316
3628.4 450588316 456688076 461735636 466545463 471537679 476446182 481313020 486075878 490629435
3644.7 490629435 495414019 501111388 506732881 510949194 514857829 519525051 524092853 528096795
3661 528096795 531969845 535737932 539357781 543338954 547447920 550843179 554447174 558182895 561072707
3679.4 561072707 563732743 566460013 569162965 572231889 575597882 578330576 580408990 582370520
3695.7 582370520 584349811 586392760 588595390 590595424 592163861 593707383 595597446 597741127
3712 597741127 599444151 600591600 601772904 603254080 604842365 606264591 607501030 608593166 609677911
3730.3 609677911 611087918 612831354 614444792 615352571 615615904 616206586 617854714 619311094 620156407
3748.7 620156407 621512473 622912645 623661458 624315798 625273526 626219690 626933217 627743900 628655910
3767.1 628655910 629612744 630595267 631308258 631902635 632733643 633757651 634559572 635107398 635777771
3785.4 635777771 636569738 637359679 638060510 638590157 639212847 639864206 640462101 641472757 642332017
3803.8 642332017 642854452 643602312 644167364 644467056 644957066 645832598 646524847 647073567 647913575 648357093
3824.2 648357093 648553729 648897350 649279714 649784148 650353789 651025236 651836097 652371883 652657688 652955532
3844.6 652955532 653122067 653127730 653252959 654215276 655638933 655927539 655637264 655664384 656135321 656686783
3865 656686783 656878114 657198846 657921314 658358514 658525765 658590376 658792317 659236491 659572721 660047948
3885.4 660047948 660370946 660292983 660527885 660902441 660907090 660909712 661208153 661649168 662121892 662470400
3905.7 662470400 662465215 662339866 662342191 662418127 662662506 663050115 663241029 663215697 663299978 663483262 663551331
3928.2 663551331 663664043 663977265 664256811 664341331 664341033 664382994 664567709 664772272 664924979 665151477
3948.6 665151477 665293992 665276885 665303409 665448427 665659130 665877283 666034222 666081965 666075587 666143298 666305602
3971 666305602 666477323 666636944 666753292 666810334 666922987 667131901 667338133 667466879 667520225 667540908
3991.4 667540908 667597055 667746425 667939484
3997.5 667939484
##END=$$ End of the data block
