##TITLE=G17-52-CE $$ Begin of the data block
##JCAMP-DX=5.00 $$ ACD/SpecManager v 10.08
##SPECTROMETER/DATA SYSTEM=Alpha
##DATE=21 Oct 2013 11:04:12
##DATA TYPE=INFRARED SPECTRUM
##DATA CLASS=XYDATA
##ORIGIN=
##OWNER=
##NPOINTS=1765
##FIRSTX=399.75695801
##LASTX=3997.56933594
##MAXX=3997.56933594
##MINX=399.75695801
##MAXY=0.75998259
##MINY=0.13874264
##XFACTOR=1.0000000000
##YFACTOR=1.000000000000000e-9
##FIRSTY=0.43342999
##DELTAX=2.03957629
##XUNITS=1/CM
##YUNITS=ARBITRARY UNITS
##XYDATA=(X++(Y..Y))
399.8D33429986l372133k675503j866400r13531j37448K64793L93749L64721j66655
$$ 433429986 430057853 427382350 425515950 424602419 424464971 424729764 425123513 425488234 425321579
418.1D25321579j316518j866579j688242j456201j491546j759708j796842j522809
$$ 425321579 424005061 422138482 420450240 418994039 417502493 415742785 413945943 412423134
434.4D12423134j156449o27220J42693R51648J274884R28938K28346k85477m67717
$$ 412423134 411266685 410639465 410782158 411733806 413008690 413937628 414165974 413880497 413412780
452.8D13412780o89388j285314k224744k662867k492964k281040k411872k725929k686084
$$ 413412780 412723392 411438078 409213334 406550467 404057503 401776463 399364591 396638662 393952578
471.1C93952578k297610j921385j732350j580536j265347q75294p58708r67979j305133
$$ 393952578 391654968 389733583 388001233 386420697 385155350 384280056 383521348 382553369 381248236
489.5C81248236j757294k104163k149433k233625k458155k711922k891183k908706
$$ 381248236 379490942 377386779 375237346 373003721 370545566 367833644 364942461 362033755
505.8C62033755l070474l241152l023147k677977k508134k423376k330720j951069
$$ 362033755 358963281 355722129 352698982 350021005 347512871 345089495 342758775 340807706
522.1C40807706j243263o78152l29197J8329M62293J086951J837164K368688K381176
$$ 340807706 339564443 338886291 338557094 338575423 339037716 340124667 341961831 344330519 346711695
540.5C46711695J883805J060307L33667j56522n51105q15361j035184j332879j611054
$$ 346711695 348595500 349655807 349989474 349832952 349281847 348466486 347431302 346098423 344487369
558.8C44487369j766980j915872k149939k365172k324760j842052r27091J24127R69410
$$ 344487369 342720389 340804517 338654578 336289406 333964646 332122594 331195503 331319630 332289040
577.2C32289040J580298K116621K575874K732932K532334J984775J243591N87136K56001
$$ 332289040 333869338 335985959 338561833 341294765 343827099 345811874 347055465 347642601 347898602
595.6C47898602J85103J8626j35183q3715M4972J55836K24769K38836K84046M20809
$$ 347898602 348083705 348102331 347967148 347883433 347928405 348084241 348309010 348547846 348831892 349252701
616C49252701O89447J169979J769305K312034K703488K927035K838135K466231K170831
$$ 349252701 349942148 351112127 352881432 355193466 357896954 360823989 363662124 366128355 368299186
634.3C68299186K087772J928508J580894J293660J238316J232684J040786O55353K75940
$$ 368299186 370386958 372315466 373896360 375190020 376428336 377661020 378701806 379357159 379633099
652.7C79633099J62035J91361J41233R7752J42485M17202J033664J359343R30250J095981
$$ 379633099 379795134 379986495 380127728 380225480 380367965 380785167 381818831 383178174 384108424 385204405
673.1C85204405J541942J759559J801640J670539J410395J142085Q50707M91470P1168
$$ 385204405 386746347 388505906 390307546 391978085 393388480 394530565 395381272 395872742 395943910
691.4C95943910m61519r78112j129180o55532L04043J311600K003610K403528K701193
$$ 395943910 395482391 394504279 393375099 392719567 393023610 394335210 396338820 398742348 401443541
709.8D01443541L008097L422797L836572M122943M496455M919529N062551M996657
$$ 401443541 404451638 407874435 411711007 415833950 420330405 425249934 430312485 435309142
726.1D35309142M741818M296004L744215L046572K347231J835794J442253R86338N55038
$$ 435309142 440050960 444346964 448091179 451137751 453484982 455320776 456763029 457749367 458304405
744.4D58304405K46406J00404N185k34365n91785r71794j220941j111091o36756O0856
$$ 458304405 458550811 458651215 458656400 458422035 457830250 456858456 455637515 454526424 453889668 453950524
764.8D53950524J050055K353967L802538N010664N586565N573064N294412M881024
$$ 453950524 455000579 457354546 461157084 466167748 471754313 477327377 482621789 487502813
781.2D87502813M327149L629386K866685K383858K237559K161026K094805K335846
$$ 487502813 491829962 495459348 498326033 500709891 502947450 505108476 507203281 509539127
797.5E09539127L025294L779173M029035L585577K862811K355635K048135J520455
$$ 509539127 512564421 516343594 520372629 523958206 526821017 529176652 531224787 532745242
813.8E32745242P68066J04010l33727p24435j374244k187908k686381k632022k371431
$$ 532745242 533513308 533617318 533283591 532559156 531184912 528997004 526310623 523678601 521307170
832.1E21307170k318024k497018k592206k426922k144575j952052j776219j382351
$$ 521307170 518989146 516492128 513899922 511473000 509328425 507376373 505600154 504217803
848.5E04217803q73923n05268l92020m05073j04904J065433L052771M883051N865633
$$ 504217803 503343880 502838612 502446592 502041519 501936615 503002048 506054819 510937870 516803503
866.8E16803503O169558N933225N008042L462374J615763k42770j955927l430903m544735
$$ 516803503 522973061 528906286 533914328 537376702 538992465 538749695 536793768 533362865 528818130
885.2E28818130n203425n419612n319000n115807m947960m892170n048842n429536
$$ 528818130 523614705 518195093 512876093 507760286 502812326 497920156 492871314 487441778
901.5D87441778o002277o682455p280410p676571p829994p661134p086844o121188
$$ 487441778 481439501 474757046 467476636 459800065 451970071 444308937 437222093 431100905
917.8D31100905m891962l567070k375275j601934j334399j278311j082659p87914o93231
$$ 431100905 426208943 422641873 420266598 418664664 417330265 416051954 414969295 414181381 413488150
936.2D13488150q22336j005381j425952k558768m543692o837785q663297r699285j0186344
$$ 413488150 412665814 411660433 410234481 407675713 403132021 396294236 387630939 377931654 367745310
954.5C67745310j0445356j0614097j0734052j0785371j0741681j0596365j0337263
$$ 367745310 357299954 346685857 335951805 325166434 314424753 303828388 293491125
968.8B93491125r866565r071231q065760p017732n910695m764259l719061k858356
$$ 293491125 283624560 274553329 266487569 259469837 253559142 248794883 245075822 242217466
985.1B42217466k219140j853153j684025j530469j301676j017228o91413l73170k46138
$$ 242217466 239998326 238145173 236461148 234930679 233629003 232611775 231920362 231547192 231301054
1003.5B31301054m61563r17062j397938j785487k008825k067700k031669k016366k084404
$$ 231301054 230839491 229922429 228524491 226739004 224730179 222662479 220630810 218614444 216530040
1021.8B16530040k176434k247974k288610k262682k170428k132267k187058k207220
$$ 216530040 214353606 212105632 209817022 207554340 205383912 203251645 201064587 198857367
1038.1A98857367k126902k018646j878977j648336j325801r04143m16800J03443O02037
$$ 198857367 196730465 194711819 192832842 191184506 189858705 188954562 188537762 188641205 189243242
1056.5A89243242J027122J372978J654283J805394J611338Q94352j96591j027435r66429
$$ 189243242 190270364 191643342 193297625 195103019 196714357 197608709 197412118 196384683 195418254
1074.8A95418254l9772J212195K342760L205374L801898M159018M335716M338712M087746
$$ 195418254 195378482 196590677 198933437 202138811 205940709 210099727 214435443 218774155 222861901
1093.2B22861901L625944L080383K497807J934082J541704J472145J775548K299383
$$ 222861901 226487845 229568228 232066035 234000117 235541821 237013966 238789514 241088897
1109.5B41088897K754688K985433L046557K974242K747178K442032K186031K106249
$$ 241088897 243843585 246829018 249875575 252849817 255596995 258039027 260225058 262331307
1125.8B62331307K326608K797007L103167K898365K322495J605213P94351L8654m48346
$$ 262331307 264657915 267454922 270558089 273456454 275778949 277384162 278178513 278217167 277768821
1144.2B77768821o53655o72400n43117k17617L07322J000821J854360K793104L686219
$$ 277768821 277115166 276442766 275899649 275682032 275989354 276990175 278844535 281637639 285323858
1162.6B85323858M429311M988283N456447O051928O802321P446766P797062P896691
$$ 285323858 289753169 294741452 300197899 306249827 313052148 320498914 328295976 336192667
1178.9C36192667P805557P496774O919235O077826N013644L780961K463192J134157
$$ 336192667 343998224 351494998 358414233 364492059 369505703 373286664 375749856 376884013
1195.2C76884013l6567q44359j282275j520336j616210j493871j194805r31322q83729
$$ 376884013 376847446 376003087 374720812 373200476 371584266 370090395 368895590 367964268 367080539
1213.5C67080539j053541j313150j522214j664131j862437k162784k383232k384097
$$ 367080539 366026998 364713848 363191634 361527503 359665066 357502282 355119050 352734953
1229.9C52734953k212226j950205j629829j201659n98878J04487P92205J401276J871079
$$ 352734953 350522727 348572522 346942693 345741034 345142156 345246643 346038848 347440124 349311203
1248.2C49311203K233833K507001K659947K687603K649128K607823K533108K436280
$$ 349311203 351545036 354052037 356711984 359399587 362048715 364656538 367189646 369625926
1264.5C69625926K383441K355903K259374K039581J687050J318515J090705J047462
$$ 369625926 372009367 374365270 376624644 378664225 380351275 381669790 382760495 383807957
1280.8C83807957J134962J256973J317083J235098R75788N12302j00553p81239j416444
$$ 383807957 384942919 386199892 387516975 388752073 389727861 390240163 390139610 389358371 387941927
1299.2C87941927j884789k173185k335340k343535k146334j796096j317889p26372
$$ 387941927 386057138 383883953 381548613 379205078 377058744 375262648 373944759 373218387
1315.5C73218387j01119L83198N55069K97814l29912j105964j816272k289772k442897
$$ 373218387 373117268 373500466 374055535 374353349 374023437 372917473 371101201 368811429 366368532
1333.9C66368532k239764j802742j329005r63867p53313o85245p75188j065939j449943
$$ 366368532 364128768 362326026 360997021 360033154 359279841 358594596 357819408 356753469 355303526
1352.2C55303526j760662j982301k164304k528817l306627m118681m426211m274816
$$ 355303526 353542864 351560563 349396259 346867442 343560815 339442134 335015923 330741107
1368.5C30741107l628373l168851l446817l814966l997206m198462m173190l644347
$$ 330741107 327112734 323943883 320497066 316682100 312684894 308486432 304313242 300668895
1384.9C00668895k754628j647443p14898l16829k67595r4771K92093P93784J338333
$$ 300668895 297914267 296266824 295551926 295235097 294967502 294872731 295164824 295958608 297296941
1403.2B97296941J837939K118886K262562K407402K469868K553463K860784L260940
$$ 297296941 299134880 301253766 303516328 305923730 308393598 310947061 313807845 317068785
1419.5C17068785L087670K797872K511948J906008J150995L42101l00884r26912j204550
$$ 317068785 320156455 322954327 325466275 327372283 328523278 328865379 328564495 327637583 326433033
1437.9C26433033n72950J25438M51803N84930O26982N76675N49525R75400K325147
$$ 326433033 325860083 325985521 326437324 327022254 327649236 328225911 328775436 329750836 332075983
1456.2C32075983L765524L698080L545583L947973M349083N011260O929279R794473
$$ 332075983 335841507 339539587 343085170 347033143 351382226 356393486 363322765 373117238
1472.6C73117238J0164559Q010745N994380M146367K271980L00050j741648m084855
$$ 373117238 383281797 391292542 397286922 401433289 403705269 404005319 402263671 398178816
1488.9C98178816o086022o478965p068694q654535q885473p828116p076859q688897
$$ 398178816 392092794 385613829 378545135 369890600 361005127 353177011 346100152 337411255
1505.2C37411255j2765557j1844098r474576q862197p623554n587160l507614k857954
$$ 337411255 324645698 312801600 303327024 294464827 286841273 281254113 277746499 274888545
1521.5B74888545l001541l055274l259271k878637k474576k465963j896322j165569
$$ 274888545 271887004 268831730 265572459 262693822 260219246 257753283 255856961 254691392
1537.8B54691392j038700n98997L97176J236617K063185K996206L791750M364073M640907
$$ 254691392 253652692 253053695 253450871 254687488 256750673 259746879 263538629 267902702 272543609
1556.2B72543609N578548O107062M278809L650009L710419L488779L148735K386540
$$ 272543609 278122157 284229219 288508028 292158037 295868456 299357235 302505970 304892510
1572.5C04892510J895577J590103R17256L67641l0756l51310o97553j105308j631916
$$ 304892510 306788087 308378190 309295446 309663087 309632331 309281021 308583468 307478160 305846244
1590.9C05846244k141654k658427l152847l713161m448354n170823n757570o424248
$$ 305846244 303704590 301046163 297893316 294180155 289731801 284560978 278803408 272379160
1607.2B72379160p383913p992208q011594q916423j0743111r894029r379014j0874003
$$ 272379160 264995247 257003039 248991445 240075022 229331911 219437882 210058868 199184865
1623.5A99184865j0712072r637669q984879p709831o993249p254288n264714k536997
$$ 199184865 188472793 178835124 169850245 162140414 155147165 147892877 142628163 140091166
1639.8A40091166j111612k36913N27247J193971J346662J763180K722025K753899K819598
$$ 140091166 138979554 138742641 139269888 140463859 141810521 143573701 146295726 149049625 151869223
1658.2A51869223L676414M844725N631447N609497O373138P506713P181153P535651
$$ 151869223 155545637 160390362 166021809 171631306 178004444 185511157 192692310 200227961
1674.5B00227961Q392692Q093908P922828R246126J2062296J1656881J0645657J2090296
$$ 200227961 208620653 216714561 224637389 233883515 245945811 257602692 268248349 280338645
1690.8B80338645J3105720J6216278J9212336J9552499K1483421J7930180J4864415
$$ 280338645 293444365 309660643 328872979 348425478 369908899 387839079 402703494
1705.1D02703494J4651298J2504131J0540575R298473Q477480Q221864O973148N198866
$$ 402703494 417354792 429858923 440399498 449697971 458175451 466397315 473370463 478569329
1721.4D78569329M432142M035323L503740L210277K960950L066361L033429K782703
$$ 478569329 483001471 487036794 490540534 493750811 496711761 499778122 502811551 505594254
1737.7E05594254L367483M227698M896939N753398O820202Q150935Q942842Q436978
$$ 505594254 508961737 513189435 518086374 523839772 530659974 538810909 547753751 556190729
1754E56190729Q359373Q528292Q170366Q236110P605255O753385O585002O381571O272078
$$ 556190729 564550102 573078394 581248760 589484870 597090125 603843510 610428512 616810083 623082161
1772.4F23082161N597174M532337M197836M202008L965497L608704L268123L010511
$$ 623082161 628679335 633211672 637409508 641611516 645577013 649185717 652453840 655464351
1788.7F55464351L033340L156543K745211K314389K318919K487599K432645K179444
$$ 655464351 658497691 661654234 664399445 666713834 669032753 671520352 673952997 676132441
1805F76132441K011478K003014K102255K041936J896263J791775J759648J791894J844883
$$ 676132441 678143919 680146933 682249188 684291124 686187387 687979162 689738810 691530704 693375587
1823.4F93375587J762867J514554J502455J593947J477599J292944J175583J170337
$$ 693375587 695138454 696653008 698155463 699749410 701227009 702519953 703695536 704865873
1839.7G04865873J287162J401901J258612R67920R26137J060843J089692R77636Q46684
$$ 704865873 706153035 707554936 708813548 709781468 710707605 711768448 712858140 713835776 714682460
1858G14682460Q70704R71258R90153Q88884P55488P20323P76350Q17955P48217O64949
$$ 714682460 715553164 716524422 717514575 718403459 719158947 719879270 720655620 721473575 722221792 722886741
1878.4G22886741P07150Q59081R10163P82967O80149P26282Q16286P82907O18994M99904
$$ 722886741 723593891 724452972 725363135 726146102 726826251 727552533 728368819 729151726 729770720 730270624
1898.8G30270624N57304O55412O52969N41806M40956M59432N20766N23269M52697L87133
$$ 730270624 730827928 731483340 732136309 732678115 733119071 733578503 734099269 734622538 735075235 735462368
1919.2G35462368L99947M83513M61638L14891K60830L49104M14491L40700K57492K42770
$$ 735462368 735862315 736345828 736807466 737122357 737383187 737732291 738146782 738487482 738744974 738987744
1939.6G38987744K83062L32713K88785J80185J71363K97845M00841L56436K32338K20359
$$ 738987744 739270806 739603519 739892304 740072489 740243852 740541697 740942538 741298974 741531312 741751671
1960G41751671L17633L74317L07739J98245J69218K37822K89440K47538J91570J58667
$$ 741751671 742069304 742443621 742751360 742949605 743118823 743356645 743646085 743893623 744085193 744243860
1980.4G44243860J83761K00093J51277J18434J40310J46508J28627J13785P7009O5863
$$ 744243860 744427621 744627714 744778991 744897425 745037735 745184243 745312870 745426655 745503664 745569527
2000.8G45569527O0141K8014l4928q1479o2228m7266j19448k18809k41816k12848j88648
$$ 745569527 745629668 745657682 745622754 745541275 745479047 745431781 745312333 745093524 744851708 744638860 744450212
2023.2G44450212k28107k88785k69890j87993j89006k67983k98082k43843j35362r6023
$$ 744450212 744222105 743933320 743663430 743475437 743286431 743018448 742720366 742476523 742341161 742245138
2043.6G42245138j46032j84416j36316l8266J9133j3292m5002K0683J15514J39177
$$ 742245138 742099106 741914690 741778374 741740108 741759241 741745949 741700947 741721630 741837144 741976321
2064G41976321P4267L9399J07169J63257J01626K146j4782R0539J64748Q4996L099
$$ 741976321 742050588 742089987 742197156 742360413 742462039 742464185 742449403 742539942 742704690 742789686 742792785
2086.5G42792785M2379J53124J87874J20878N7638Q8990J77860K02954J28448M4823
$$ 742792785 742835164 742988288 743176162 743297040 743354678 743443668 743621528 743824482 743952930 743997753
2106.9G43997753O8247J74701K14219J11938J6749N2750J43885J54496Q9466L3736
$$ 743997753 744066000 744240701 744454920 744566858 744583607 744636357 744780242 744934738 745024204 745057940
2127.3G45057940M3452J39654J96099J41144N9247N1558J26898J62423R1612M0770
$$ 745057940 745101392 745241046 745437145 745578289 745637536 745689094 745815992 745978415 746070027 746110797
2147.7G46110797J00255J76966J92762J71005J74582K39075L14235L36826L21567L02374
$$ 746110797 746211052 746388018 746580780 746751785 746926367 747165442 747479677 747816503 748138070 748440444
2168G48440444L35992M35352M65632L86893L42369L94524M46975M40061L74615K99275
$$ 748440444 748776436 749211788 749677420 750064313 750406682 750801206 751248181 751688242 752062857 752362132
2188.4G52362132L19839M01973M25220L82006L29375L14176L48986L67343L27945K77102
$$ 752362132 752681971 753083944 753509164 753891170 754220545 754534721 754883707 755251050 755578995 755856097
2208.8G55856097K80261L44753L61085K99036K51771K41100K43604K48731K23875J65999
$$ 755856097 756136358 756481111 756842196 757141232 757393003 757634103 757877707 758126438 758350313 758516312
2229.2G58516312J13725J06097J43170J56701J27017R9182J03176J05083N4180R478
$$ 758516312 758630037 758736134 758879304 759036005 759163022 759262204 759365380 759470463 759524643 759534121
2249.6G59534121L6478O5088N3882L6479O139K3305Q2553P7128L4869K4080Q464q881
$$ 759534121 759570599 759635687 759689569 759726048 759732187 759755492 759838045 759915173 759950042 759974122 759982586 759973705
2274.1G59973705m471m5418r9600r7215m6849k5272o3837p8321o9916o4432k0326m708
$$ 759973705 759969234 759923816 759824216 759727001 759680152 759654880 759591043 759512722 759442806 759378374 759358048 759353340
2298.6G59353340r0182j12593r239O5625N6326m351q5592r8229K8134J50144J11401
$$ 759353340 759263158 759150565 759141326 759206951 759263277 759258926 759173334 759075105 759103239 759253383 759364784
2321G59364784j9908n4479K0266O2108o9440k90691l16740k57670k90513l57390m74453
$$ 759364784 759344876 759290397 759310663 759372771 759303331 759012640 758695900 758438230 758147717 757790327 757315874
2343.5G57315874p76410r60112o30855J1146N35488O46114M07100q5294n46336p38442
$$ 757315874 756539464 755579352 754948497 754959643 755495131 756141245 756548345 756463051 755916715 755178273
2363.8G55178273q53002j114130j281143j250803j133680j007796r40382r46522r66430
$$ 755178273 754325271 753211141 751929998 750679195 749545515 748537719 747597337 746650815 745684385
2382.2G45684385q87453p24197n66005m97401n36740n74529n64158n75900o16968o61433
$$ 745684385 744796932 744072735 743506730 743009329 742472589 741898060 741333902 740758002 740141034 739479601
2402.6G39479601o99341o84142o45876o48141p12275p85053p86543p53343p84993q69453
$$ 739479601 738780260 738096118 737450242 736802101 736089826 735304773 734518230 733764887 732979894 732110441
2423G32110441r02593q70467q24928q34823q98242r21785q92640q71181q76784r10223
$$ 732110441 731207848 730337381 729512453 728677630 727779388 726857603 725964963 725093782 724216998 723306775
2443.4G23306775r49323r35674q86738q81970r28283r42290q98718q58427q65459r00865
$$ 723306775 722357452 721421778 720535040 719653070 718724787 717782497 716883779 716025352 715159893 714259028
2463.8G14259028r02772q58783q36849q78215r22144r21905q88586q63433q71062q70407
$$ 714259028 713356256 712497473 711660624 710782409 709860265 708938360 708049774 707186341 706315279 705444872
2484.2G05444872q59201q65459q60930q45670q43227q32498q15273q07821q20220q26061
$$ 705444872 704585671 703720212 702859282 702013612 701170385 700337887 699522614 698714793 697894573 697068512
2504.6F97068512q03589p94471p96318p81119p70926p84338q11219q28326q16166q04782
$$ 697068512 696264923 695470452 694674134 693893015 693122089 692337751 691526532 690698206 689882040 689077258
2525F89077258q36909q92102r24170r03249q71122q74400q84533q93414q93235q68798
$$ 689077258 688240349 687348247 686424077 685520828 684649706 683775306 682890773 681997359 681104124 680235326
2545.4F80235326q73267r10998r02891q44598q17239q57949q93832q70883q20935q01682
$$ 680235326 679362059 678451061 677548170 676703572 675886333 675028384 674134552 673263669 672442734 671641052
2565.8F71641052q19922q37683q55208q59916q49068q44479q51929q81851q96275q63492
$$ 671641052 670821130 669983447 669128239 668268323 667419255 666574776 665722847 664840996 663944721 663081229
2586.2F63081229q52049q89361q81612q26597q47697r32396r81152r86755r59813r71616
$$ 663081229 662229180 661339819 660458207 659631610 658783913 657851517 656870365 655883610 654923797 653952181
2606.6F53952181j059413j119852j126468j141190j165510j197815j266479j336753
$$ 653952181 652892768 651772916 650646448 649505258 648339748 647141933 645875454 644538701
2622.9F44538701j347483j311242j319707j409053j453042j411081j408279j433313
$$ 644538701 643191218 641879976 640560269 639151216 637698174 636287093 634878814 633445501
2639.2F33445501j413881j413048j441836j415789j362980j390397j455963j430333
$$ 633445501 632031620 630618572 629176736 627760947 626397967 625007570 623551607 622121274
2655.5F22121274j347065j348793j412511j416445j366377j332044j321316j301765
$$ 622121274 620774209 619425416 618012905 616596460 615230083 613898039 612576723 611274958
2671.8F11274958j316548j341462j267075j186550j225591j272082j229882j189173
$$ 611274958 609958410 608616948 607349873 606163323 604937732 603665650 602435768 601246595
2688.1F01246595j192212j235187j300990j316607j291752j306057j370907j425743
$$ 601246595 600054383 598819196 597518206 596201599 594909847 593603790 592232883 590807140
2704.5E90807140j450658j469731j486361j521349j563251j523793j470029j524985
$$ 590807140 589356482 587886751 586400390 584879041 583315790 581791997 580321968 578796983
2720.8E78796983j566291j486242j369178j324356j355409j365960j329959j297235
$$ 578796983 577230692 575744450 574375272 573050916 571695507 570329547 568999588 567702353
2737.1E67702353j272261j270890j285375j263499j199305j135290j144468j199067
$$ 567702353 566430092 565159202 563873827 562610328 561411023 560275733 559131265 557932198
2753.4E57932198j218736j199067j168966j174748j223683j259625j233399j210034
$$ 557932198 556713462 555514395 554345429 553170681 551946998 550687373 549453974 548243940
2769.7E48243940j280487j372397j392722j399934j444161j485407j548827j640797
$$ 548243940 546963453 545591056 544198334 542798400 541354239 539868832 538320005 536679208
2786E36679208j686632j704514j749576j826405j884460j885951j899421j981020k079129
$$ 536679208 534992576 533288062 531538486 529712081 527827621 525941670 524042249 522061229 519982100
2804.4E19982100k152026k211988k251923k287746k358555k445043k499997k559185
$$ 519982100 517830074 515618086 513366163 511078417 508719862 506274819 503774822 501215637
2820.7E01215637k668798k774090k878278l040463l250361l468453l711939m066348
$$ 501215637 498546839 495772749 492894471 489854008 486603647 483135194 479423255 475356907
2837D75356907m586667n277693o143809p081002p800191p980168p366777n926847m110068
$$ 475356907 470770240 465492547 459348738 452267736 444467545 436487377 429120600 423193753 419083685
2855.4D19083685k652914k015590k190113k927453l847122m524320m692853m333943
$$ 419083685 416430771 414415181 412225068 409297615 405450493 400926173 396233320 391899377
2871.7C91899377l567397k605439j763224j248718j064211j123994j307130j519829
$$ 391899377 388331980 385726541 383963317 382714599 381650388 380526394 379219264 377699435
2888C77699435j743168j993805k250731k482742k692402k904653l165811l498078l904253
$$ 377699435 375956267 373962462 371711731 369228989 366536587 363631934 360466123 356968045 353063792
2906.4C53063792m382133m927129n528837o045998o283402o188095n741954m870027
$$ 353063792 348681659 343754530 338225693 332179695 325896293 319708198 313966244 309096217
2922.7C09096217l623217k235860q89778M07338J678676K874821L887594M596948M924387
$$ 309096217 305473000 303237140 302347362 302754700 304433376 307308197 311195791 315792739 320717126
2941C20717126M825622M295200L437281K465605J561106Q73953O28620R09388J577348
$$ 320717126 325542748 329837948 333275229 335740834 337301940 338175893 338804513 339713901 341291249
2959.4C41291249K469718L416658M304796N083770N705297O175935O502211O626576
$$ 341291249 343760967 347177625 351482421 356566191 362271488 368447423 374949634 381576210
2975.7C81576210O536573O315530N983978N525410M975856M354715L688455L039241
$$ 381576210 388112783 394428313 400412291 405937701 410913557 415268272 418956727 421995968
2992D21995968K405285J703650R61691L18379k26707p16269j046776j205028j277715
$$ 421995968 424401253 426104903 427066594 427384973 427158266 426441997 425395221 424190193 422912478
3010.4D22912478j238405j115173j084060j242906j492679j747668k018511k221167
$$ 422912478 421674073 420558900 419474840 418231934 416739255 414991587 412973076 410751909
3026.7D10751909k276987k244830k196610k194762k286822k419561k506643k569646
$$ 410751909 408474922 406230092 404033482 401838720 399551898 397132337 394625694 392056048
3043C92056048k630174k670944k705336k718478k716631k701997k657533k597273k500563
$$ 392056048 389425874 386754930 384049594 381331116 378614485 375912488 373254955 370657682 368157119
3061.4C68157119k346427k169013j979857j809091j734525j709103j645983j559317
$$ 368157119 365810692 363641679 361661822 359852731 358118206 356409103 354763120 353203803
3077.7C53203803j496017j482129j432121j273870j138657j114726j109243j091182
$$ 353203803 351707786 350225657 348793536 347519666 346381009 345266283 344157040 343065858
3094C43065858j083940j071543j099080j191348j277953j308799j327812j397461j476795
$$ 343065858 341981918 340910375 339811295 338619947 337341994 336033195 334705383 333307922 331831127
3112.4C31831127j521140j545429j587391j690358j801223j839071j863033j930743
$$ 331831127 330309987 328764558 327177167 325486809 323685586 321846515 319983482 318052739
3128.7C18052739j991600k036720k069951k096265k114564k115339k129823k174527
$$ 318052739 316061139 314024419 311954468 309858203 307743639 305628300 303498477 301323950
3145C01323950k234727k261311k240568k223402k270878k330869k320290k314567k339125
$$ 301323950 299089223 296827912 294587344 292363942 290093064 287762195 285441905 283127338 280788213
3163.4B80788213k313465k292007k328098k332359k304227k306580k301484k247870
$$ 280788213 278474748 276182741 273854643 271522284 269218057 266911477 264609993 262362123
3179.7B62362123k228201k276033k270132k193451k130360k110406k118052k102762
$$ 262362123 260133922 257857889 255587757 253394306 251263946 249153540 247035488 244932726
3196B44932726k038419j952052j891107j887887j902327j861588j783251j772479j803740
$$ 244932726 242894307 240942255 239051148 237163261 235260934 233399346 231616095 229843616 228039876
3214.3B28039876j774550j718208j690000j704380j745150j748085j737922j776606
$$ 228039876 226265326 224547118 222857118 221152738 219407588 217659503 215921581 214144975
3230.7B14144975j806274j849160j935899j975134j986459k029270k073780k093121
$$ 214144975 212338701 210489541 208553642 206578508 204592049 202562779 200488999 198395878
3247A98395878k117917k160698k227292k292349k268583k203554k189666k185076k131686
$$ 198395878 196277961 194117263 191889971 189597622 187329039 185125485 182935819 180750743 178619057
3265.3A78619057k029389j902878j772002j653433j551836j441062j283631j106664
$$ 178619057 176589668 174686790 172914788 171261355 169709519 168268457 166984826 165878162
3281.6A65878162j012624r35733p74994o55443o17936n44265m10825k83971k22981
$$ 165878162 164865538 163929805 163154811 162499368 161881432 161337167 160926342 160642371 160419390
3300A60419390k20314j85028r8794m8519m8905m3497j4364L4272Q0392J02073Q2865
$$ 160419390 160199076 160014048 159915254 159866735 159817830 159774333 159759969 159794241 159874633 159976706 160059571
3322.4A60059571L2619P003K1190O9067J01566Q0973M1291n498p6294j16155p8380
$$ 160059571 160092190 160099193 160120383 160189450 160291016 160371989 160413280 160407782 160331488 160215333 160136953
3344.9A60136953m8950q1644j41799j88560j97172j70335j28209r8765j29894j85430
$$ 160136953 160088003 160006359 159864560 159676000 159478828 159308493 159180284 159081519 158951625 158766195
3365.3A58766195j82062j78948k33531k34574j41114r4861j29223j46106r6515k0206
$$ 158766195 158584133 158405185 158171654 157937080 157795966 157701105 157571882 157425776 157329261 157309055
3385.7A57309055P4521J28835J9417j19105p9602O2823J57535J41561O0812R3952K04712
$$ 157309055 157383576 157512411 157531828 157412723 157333121 157395944 157553479 157695040 157755852 157849804 158054516
3408.1A58054516K51949K82496L35350L27975K95892L64676M59820N43222O89373Q04186
$$ 158054516 158306465 158588961 158924311 159252286 159548178 159912854 160372674 160915896 161605269 162409455
3428.5A62409455P88644Q50483R57758Q37460O73070P46653R41664J054376J088023
$$ 162409455 163198099 164048582 165006340 165843800 166516870 167263523 168205187 169259563 170347586
3446.8A70347586J101628J141206J204580J299143J380786J377657J324236J360700
$$ 170347586 171449214 172590420 173795000 175094143 176474929 177852586 179176822 180537522
3463.2A80537522J549899J704812J597524J347944J346827J577392J791120J842603
$$ 180537522 182087421 183792233 185389757 186737701 188084528 189661920 191453040 193295643
3479.5A93295643J761883J755491J866818J923814J910374J955345K009377K037436
$$ 193295643 195057526 196813017 198679835 200603649 202514023 204469368 206478745 208516181
3495.8B08516181K029001K077639K172262K082586J947776K056181K245694K341286
$$ 208516181 210545182 212622821 214795083 216877669 218825445 220881626 223127320 225468606
3512.1B25468606K352088K281279K297669K460599K602041K532244K405971K485052
$$ 225468606 227820694 230101973 232399642 234860241 237462282 239994526 242400497 244885549
3528.4B44885549K658293K742111K831757K900005K853781K919048L077239L154873
$$ 244885549 247543842 250285953 253117710 256017715 258871496 261790544 264867783 268022656
3544.7B68022656L080726L006190L120035L300041L335565L325463L493309L664791
$$ 268022656 271103382 274109572 277229607 280529648 283865213 287190676 290683985 294348776
3561.1B94348776L623814L703117M153192M263222L950775L944695M215330M366964
$$ 294348776 297972590 301675707 305828899 310092121 314042896 317987591 322202921 326569885
3577.4C26569885M433900M535616M581481M703104N006761N011797M691869M786849
$$ 326569885 331003785 335539401 340120882 344823986 349830747 354842544 359534413 364321262
3593.7C64321262N110323N169451N127549N132735N042255M952192N176157N359918
$$ 364321262 369431585 374601036 379728585 384861320 389903575 394855767 400031924 405391842
3610D05391842N343765N321086N142241N375475N813837N333185M696071M767359N800008
$$ 405391842 410735607 416056693 421198934 426574409 432388246 437721431 442417502 447184861 452984869
3628.4D52984869O195128N099684M792989M991710M927903M867196M758269M547864
$$ 452984869 459179997 464279681 469072670 474064380 478992283 483859479 488617748 493165612
3644.7D93165612M764855N687654N645156M254460L922761M643321M548848L981292
$$ 493165612 497930467 503618121 509263277 513517737 517440498 522083819 526632667 530613959
3661E30613959L798842L676296L575921L989398M115701L402054L655613L786861K879143
$$ 530613959 534412801 538089097 541665018 545654416 549770117 553172171 556827784 560614645 563493788
3679.4E63493788K601803K673506K691686L101349L407419K742171K100826J975298
$$ 563493788 566095591 568769097 571460783 574562132 577969551 580711722 582812548 584787846
3695.7E84787846J915216J961231K207101K077341J637459J599371J910627K076447
$$ 584787846 586703062 588664293 590871394 592948735 594586194 596185565 598096192 600172639
3712F00172639J624346J131177J191139J450002J543999J463473J327157J122355J073361
$$ 600172639 601796985 602928162 604119301 605569303 607113302 608576775 609903932 611026287 612099648
3730.3F12099648J407325J716792J555920Q91924L19898O32644J576304J336813P82550
$$ 612099648 613506973 615223765 616779685 617671609 617991507 618624151 620200455 621537268 622319818
3748.7F22319818J398563J487255P38680N90802R53674R99868P40647Q09610R51946
$$ 622319818 623718381 625205636 625944316 626535118 627488792 628488660 629229307 630038917 630990863
3767.1F30990863J002908R69112O89566O02185Q78275J058578P73013N45502P09057
$$ 630990863 631993771 632962883 633652449 634254634 635132909 636191487 636964500 637510002 638219059
3785.4F38219059P96616P58051O83487N52058O04272N84483O01232J074672Q55386
$$ 638219059 639015675 639773726 640457213 641009271 641613543 642198026 642799258 643873930 644729316
3803.8F44729316M50909P31707N77033K44319M67837R13083O69539N32687Q70705M45366
$$ 644729316 645180225 645911932 646488965 646733284 647201121 648114204 648783743 649316430 650187135 650632501
3824.2F50632501J98841L56197L75986M95315N66542O58989P93338N41329L32534L40343
$$ 650632501 650831342 651187539 651563525 652058840 652625382 653284371 654077709 654619038 654951572 655291915
3844.6F55291915J81436K1637J16348R36032J451492L22699l01539j2279M40478N52357
$$ 655291915 655473351 655494988 655611336 656547368 657998860 658321559 658020020 658007741 658448219 659000576
3865F59000576K22861L08097O10709L76820K32757J21355K25305N07891L71337M40717
$$ 659000576 659223437 659531534 660142243 660519063 660751820 660873175 661098480 661606371 661977708 662418425
3885.4F62418425L02076n7339K77221M05490j371j788L06845M09722M19319L20017
$$ 662418425 662720501 662663162 662940383 663345873 663344502 663342714 663649559 664059281 664478600 664798617
3905.7F64798617j3351j26958R775Q9944K37286L67284J92224L398J10328J74046K6345
$$ 664798617 664785266 664658308 664668083 664758027 664995313 665362597 665554821 665558219 665668547 665842593 665868938
3928.2F65868938Q6367L28601K78413O1691K8193J23143K22385J50501P1049J87993
$$ 665868938 665955305 666283906 666562319 666624010 666652203 666775346 666997731 667148232 667219281 667407274
3948.6F67407274J71900M6670R5428J82449J75834J74999J40190K3842J8955J35839
$$ 667407274 667579174 667625844 667721272 667903721 668079555 668254554 668394744 668418586 668437541 668573380
3969F68573380J84357J70111J59741Q9526L7134J08301J82212J52647O9440P4386J34886
$$ 668573380 668757737 668927848 669087589 669177115 669214249 669322550 669504762 669657409 669726849 669801235 669936121
3991.4F69936121J48952J84893K20537
$$ 669936121 670085073 670269966 670490503
3997.5F70490503
$$ 670490503
##END=$$ End of the data block
