##TITLE=G17-51-SE $$ Begin of the data block
##JCAMP-DX=5.00 $$ ACD/SpecManager v 10.08
##SPECTROMETER/DATA SYSTEM=Alpha
##DATE=23 Oct 2013 10:11:40
##DATA TYPE=INFRARED SPECTRUM
##DATA CLASS=XYDATA
##ORIGIN=
##OWNER=
##NPOINTS=1765
##FIRSTX=399.75695801
##LASTX=3997.56933594
##MAXX=3997.56933594
##MINX=399.75695801
##MAXY=0.75928217
##MINY=0.16035362
##XFACTOR=1.0000000000
##YFACTOR=1.000000000000000e-9
##FIRSTY=0.41066018
##DELTAX=2.03957629
##XUNITS=1/CM
##YUNITS=ARBITRARY UNITS
##XYDATA=(X++(Y..Y))
399.8D10660177l185331j853735j096397q58039l95596M53651P70748J28448n63413
418.1D04060513p77483j234800k176851k347886j502276j136333j632034j757354q22812
436.5C90672684L15010P34508J052171J831353J676023J81615q62270o95199l62217
454.8C94543678j198322k530754k528071k020717k190113k741903k644658j907766
471.1C76781374j884907k399415k151102j147449n93156j019954j311034p76082o33270
489.5C64865005j624972k351224k055168j929671k554506l093093k890051k557248
505.8C45809072k744019l126025l015012k422839k264321k560317k285540j450301
522.1C25940698q08805n03540j41948M45127R85414J361459J874060K675444L094434
$$ plain form
399.8 410660177 407474846 405621111 404524714 403666675 403271079 403724730 404495478 404623926 404060513
418.1 404060513 403283030 402048230 399871379 397523493 396021217 394884884 393252850 391495496 390672684
436.5 390672684 390987694 391722202 392774373 394605726 396281749 396463364 395601094 394905895 394543678
454.8 394543678 393345356 390814602 388286531 386265814 384075701 381333798 378689140 376781374
471.1 376781374 374896467 372497052 370345950 369198501 368605345 367585391 366274357 365498275 364865005
489.5 364865005 363240033 360888809 358833641 356903970 354349464 351256371 348366320 345809072
505.8 345809072 343065053 339939028 336924016 334501177 332236856 329676539 327390999 325940698
522.1 325940698 325131893 324628353 324486405 324931532 325916946 327278405 329152465 331827909 334922343
540.5C34922343K357513J069814M40806K29478m08858j154005j327008j130820j309663
558.8C33689600j894712k259106k277523k389967k571285k135545q75324M27812J220435
577.2C20934385J864076K627343L205776L152817K534718J899987J402915Q29368L10213
595.6C38761598j252o0052P4417J24633P9155J26571K62171K56002K26795M96507J049131
618C41395676J571477J882702K218872K600580K726764K402306J946806J861394J938015
636.3C60544592J680702J257539J111895J186549R80229M66823K09302L17573L66837
654.7C68122041J85818O1750K49028N11498L86774J1295M77761J491934J582206J274943
675.1C74355048J193047J575261J742422J257152P52806P96736Q41856K16901o49095
$$ plain form
540.5 334922343 337279856 338349670 338790476 339019954 338611096 337457091 336130083 334999263 333689600
558.8 333689600 331794888 329535782 327258259 324868292 322297007 320161462 319286138 319713950 320934385
577.2 320934385 322798461 325425804 328631580 331784397 334319115 336219102 337622017 338451385 338761598
595.6 338761598 338760346 338700294 338774711 338899344 338978499 339105070 339367241 339623243 339850038 340346545 341395676
618 341395676 342967153 344849855 347068727 349669307 352396071 354798377 356745183 358606577 360544592
636.3 360544592 362225294 363482833 364594728 365781277 366761506 367228329 367437631 367755204 368122041
654.7 368122041 368307859 368369609 368618637 369130135 369516909 369528204 370005965 371497899 373080105 374355048
675.1 374355048 375548095 377123356 378865778 380122930 380875736 381672472 382514328 382731229 382082134
693.5C82082134r77933q12977n54622j67757O69271J753121K377272K366155K501607
711.8C89236271L243179L875672L886581L994256M781306N408615N084127M272193
728.1D23782200L947347L999442L413767K253681J556665J519441J236290L78162k26468
746.5D41860527r865J92315m18038j254111j392692j004458r18299r77307k04981J461238
766.9D37334329K866357L602684M472852N675673O291390N828529N043090M685044
783.2D75799948M334450L356337K398312K314181K693146K640486K436489K971083
799.5D98944432L944426M174769L467381K957642L039122K695560J502037N58973N21660
817.9E21806002M77671m83393j709462k150356k154649k493560k968311k932787k543092
$$ plain form
693.5 382082134 381104201 380291224 379736602 379568845 380238116 381991237 384368509 386734664 389236271
711.8 389236271 392479450 396355122 400241703 404235959 409017265 414425880 419510007 423782200
728.1 423782200 427729547 431728989 435142756 437396437 438953102 440472543 441708833 442086995 441860527
746.5 441860527 441850662 442042977 441624939 440370828 438978136 437973678 437055379 436078072 435873091 437334329
766.9 437334329 440200686 443803370 448276222 453951895 460243285 466071814 471114904 475799948
783.2 475799948 480134398 483490735 485889047 488203228 490896374 493536860 495973349 498944432
799.5 498944432 502888858 507063627 510531008 513488650 516527772 519223332 520725369 521284342 521806002
817.9 521806002 522283673 521800280 520090818 517940462 515785813 513292253 510323942 507391155 504848063
836.2E04848063k604246l137469l178746k451897j807034j713991j646459j107961
852.5D87200260n36620n72086o22779P66188L502697N746215O666303P116437P501721
870.9E16768336O914854M916728K546012O22809j287758l453553n124092n698800n676091
889.3E10528445n809068n989105n668640n123079n216569n970418o675452p035315
905.6D63040799p382810p950753q327931q043945p271886o366193n150199l501535
921.9D09045547k018600j249582j021385q06242l21955J01417O7383j25378j72168
940.2D03499037n51820k048969m648984p277548r130031j0276109j0918826j1106640
956.6C47540110j0976076j0821849j0832995j0809958j0447621r821743r143800q304834
$$ plain form
836.2 504848063 502243817 499106348 495927602 493475705 491668671 489954680 488308221 487200260
852.5 487200260 486663640 486091554 485468775 486234963 489737660 495483875 502150178 509266615 516768336
870.9 516768336 523683190 528599918 531145930 531768739 530480981 527027428 521903336 516204536 510528445
889.3 510528445 504719377 498730272 493061632 487938553 482721984 476751566 470076114 463040799
905.6 463040799 455657989 447707236 439379305 431335360 424063474 417697281 412547082 409045547
921.9 409045547 407026947 405777365 404755980 403949738 403627783 403729200 403796583 403671205 403499037
940.2 403499037 402947217 400898248 396249264 388971716 379841685 369565576 358646750 347540110
956.6 347540110 336564034 325742185 314909190 304099232 293651611 283829868 274686068 266381234
972.9B66381234p106990n674243m306182l135323k142475j342058q31872o64398o73398
991.2B40504295o15672m19423j68770P6309L50386N53950L81455k21282q69245j228243
1011.6B38343760j355856j461029j531422j489893j447678j550674j751810j824424
1027.9B25930974j721799j652688j742572j881778j927525j906589j914575j854196
1044.3B11329252j579538j206786q69214m59701J33037P65935J213625J503587J873344
1062.6B12703541K311587K320320J368224k40415j385436j319855l54990Q12843J956865
1081B18172684L019825L756598M065156M129931M160762M073918L646999K967954K349466
1099.3B50343293J841128J352399J109600J354129J880139K298146K432078K394557
$$ plain form
972.9 266381234 259274244 253600001 249293819 246158496 244016021 242673963 241842091 241177693 240504295
991.2 240504295 239888623 239469200 239300430 239376739 239727125 240281075 240662530 240441248 239572003 238343760
1011.6 238343760 236987904 235526875 233995453 232505560 231057882 229507208 227755398 225930974
1027.9 225930974 224209175 222556487 220813915 218932137 217004612 215098023 213183448 211329252
1044.3 211329252 209749714 208542928 207673714 207214013 207347050 208112985 209326610 210830197 212703541
1062.6 212703541 215015128 217335448 218703672 218463257 217077821 215757966 215402976 216215819 218172684
1081 218172684 221192509 224949107 229014263 233144194 237304956 241378874 245025873 247993827 250343293
1099.3 250343293 252184421 253536820 254646420 256000549 257880688 260178834 262610912 265005469
1115.6B65005469K340675K166390J725465J297593J334191J821220K368480K664268
1132B80723751K652675K342641J627028N82427l02643o81370p83653q97526r09269
1150.3B84354061n91308l5048N17697J095742J882523K775609L439844L774881M081876
1168.7C01295877M675984N419612N973607O355614O790459P139683P064223O629646
1185C51344705O185054N689502M736722L360301K101630J188576M00603l33607p86722
1203.3C73886764p85887n38916l40789k15888o0320P7993j0938l46571o87987r59128
1223.7C70018333j349866j834184k095729j980663j748174j605511j329243p32839
1240.1C57342124r835N93633J105040J644194K165467K476573K538800K534628K575904
$$ plain form
1115.6 265005469 267346144 269512534 271237999 272535592 273869783 275691003 278059483 280723751
1132 280723751 283376426 285719067 287346095 287928522 287625879 286944509 286160856 285263330 284354061
1150.3 284354061 283762753 283727705 284245402 285341144 287223667 289999276 293439120 297214001 301295877
1168.7 301295877 305971861 311391473 317365080 323720694 330511153 337650836 344715059 351344705
1185 351344705 357529759 363219261 367955983 371316284 373417914 374606490 375007093 374673486 373886764
1203.3 373886764 373100877 372561961 372221172 372005284 371944964 372022957 372012019 371665448 370977461 370018333
1223.7 370018333 368668467 366834283 364738554 362757891 361009717 359404206 358074963 357342124
1240.1 357342124 357332289 357925922 359030962 360675156 362840623 365317196 367855996 370390624 372966528
1258.4C72966528K527475K317965K203673K350122K548903K444536K024710J620054
1274.7C91003966J352460J091748Q98540R48101J165062J263500J057297O95526L42250
1293.1C99818450j40190q59797j542061j904190k009898k115906k251804k127677j678347
1311.4C85188580j163841p20948k18421L21716N71251K52068n23984j373142k034396
1329.8C80298883k500326k713918k469659j919747j460105j138717p98523n40823n68688
1348.1C66188377r54479j432359j703203j843065k013892k371371k995640l577739
1364.5C49296629l820240l795296l320307k877026l076107l508627l859878m148930
1380.8C20890218m108667l497243k517164j424223n35995j60545k17199j99616O7800
$$ plain form
1258.4 372966528 375494003 377811968 380015641 382365763 384914666 387359202 389383912 391003966
1274.7 391003966 392356426 393448174 394346714 395294815 396459877 397723377 398780674 399476200 399818450
1293.1 399818450 399678260 398818463 397276402 395372212 393362314 391246408 388994604 386866927 385188580
1311.4 385188580 384024739 383303791 383085370 383407086 383978337 384230405 383706421 382333279 380298883
1329.8 380298883 377798557 375084639 372614980 370695233 369235128 368096411 367297888 366757065 366188377
1348.1 366188377 365233898 363801539 362098336 360255271 358241379 355870008 352874368 349296629
1364.5 349296629 345476389 341681093 338360786 335483760 332407653 328899026 325039148 320890218
1380.8 320890218 316781551 313284308 310767144 309342921 308806926 308646381 308429182 308229566 308297366
1399.1C08297366M74632R51111J351357J594394J766473J861185J874119K036661K441734
1417.5C22649032K768487K588689K484411K469808K133161J481086O49869N4479m42803
1435.9C36836219p91729m50968P6770L75748M64469L19302J00822R9122N98610J687049
1456.2C39315414K605439K676546K866060L275364L541083M293233O297856Q934707
1472.6C73805702R303897P619113O039292M497081K807945J020789o90490k675742
1488.9D01727587m641563n246579n700767o983668p399380o743998o148099p487029
1505.2C51376504j1118472j0657161q684576q056372o850928n018026l222823k763033
1521.5B95005113l033429l092409l267795k903401k510786k613903k124726j319230
$$ plain form
1399.1 308297366 308771998 309723109 311074466 312668860 314435333 316296518 318170637 320207298 322649032
1417.5 322649032 325417519 328006208 330490619 332960427 335093588 336574674 337224543 337279022 336836219
1435.9 336836219 336044490 335593522 335670292 336046040 336510509 336829811 336930633 337029755 337628365 339315414
1456.2 339315414 341920853 344597399 347463459 350738823 354279906 358573139 364870995 373805702
1472.6 373805702 383109599 390728712 396768004 401265085 404073030 405093819 404403329 401727587
1488.9 401727587 397086024 391839445 386138678 379155010 371755630 365011632 358863533 351376504
1505.2 351376504 340258032 329600871 320916295 312859923 306008995 300990969 297768146 295005113
1521.5 295005113 291971684 288879275 285611480 282708079 280197293 277583390 275458664 274139434
1537.8B74139434j266569j078397j62452P40558J669615K612293L398240M002302M428834
1556.2B88483858N457014N759984M052967L643483L870636L817976L500789K756924
1572.5C21343631K448260K309233J610011J067609P47651M65065J33931l05891r06288
1590.9C28913212j535714k258986l009170l740400m560322n402237o151468o910681
1607.2B95344234p845819q399219q371264r228408j1021644j0082438r314746j0632187
1623.5B20448509j0588437r667099r098440p802084o876886o969884n138755k539441
1639.8A61767483j136691k77176L95805R24438J204327J698076K398476K470196K752378
1658.2A72197312L619731M631847N305156N363911O091237P042721O762594P084623
$$ plain form
1537.8 274139434 272872865 271794468 271632016 272372574 274042189 276654482 280052722 284055024 288483858
1556.2 288483858 293940872 299700856 303753823 307397306 311267942 315085918 318586707 321343631
1572.5 321343631 323791891 326101124 327711135 328778744 329526395 329991460 330125391 329819500 328913212
1590.9 328913212 327377498 325118512 322109342 318368942 313808620 308406383 302254915 295344234
1607.2 295344234 287498415 279099196 270727932 261499524 250477880 240395442 231080696 220448509
1623.5 220448509 209860072 200192973 191094533 183292449 176415563 169445679 164306924 161767483
1639.8 161767483 160630792 160353616 160749421 161673859 162878186 164576262 166974738 169444934 172197312
1658.2 172197312 175817043 180448890 185754046 191117957 197209194 204251915 211014509 218099132
1674.5B18099132P762090P507234P475257Q662194J0903985J0504633R736240J1029154
1690.8B91679919J2032658J4787584J7293453J7553747J9046068J6114146J3694376
1705.1D02201951J3510972J1736184J0221929R271115Q597612Q246869O982326N529255
1721.4D76298213N036980M776180M397303M191219L936768L880262L582597L319264
1737.7E09418786L732979M155397M612148N450547O349981P151723P549524P348478
1754E55769563P491052P510543P063687P058501O685853O132424N895495N644262N493224
1772.4F14744604M871785M036129L822744L899812L709972L272236K962649L023326
1788.7F44343257L170609K933085K413690K367974K590537K505600K133429K006710
$$ plain form
1674.5 218099132 225861222 233368456 240843713 249505907 260409892 270914525 280650765 291679919
1690.8 291679919 303712577 318500161 335793614 353347361 372393429 388507575 402201951
1705.1 402201951 415712923 427449107 437671036 446942151 455539763 463786632 470768958 476298213
1721.4 476298213 481335193 486111373 490508676 494699895 498636663 502516925 506099522 509418786
1737.7 509418786 513151765 517307162 521919310 527369857 533719838 540871561 548421085 555769563
1754 555769563 563260615 570771158 577834845 584893346 591579199 597711623 603607118 609251380 614744604
1772.4 614744604 619616389 623652518 627475262 631375074 635085046 638357282 641319931 644343257
1788.7 644343257 647513866 650446951 652860641 655228615 657819152 660324752 662458181 664464891
1805F64464891K227604K289653J994074J752495J908839K039015J849175J666188J810730
1823.4F82002664J964032J744867J421034J354456J558661J531959J223564J168609
1839.7F93969846J461267J480639J029372Q41678J070439J225114J037121Q36074R49741
1858G03901291J142025J005649P78258Q74639J041949Q54075N48839N91397Q90494
1876.4G11628616J017630P91848O39081Q62300J114368R31204N49614O26386R30130
1894.7G19091177Q54075N27918N03004P65204Q08955N04910L27170N35906P10606N70953
1915.1G25199878L45290M11749O25253N06639K29239L05117N86450N51402K11299J12057
1935.5G29084373M40776O37472L42667L7610K30968N01931L73304J39355K60652N63979
$$ plain form
1805 664464891 666692495 668982148 670976222 672728717 674637556 676676571 678525746 680191934 682002664
1823.4 682002664 683966696 685711563 687132597 688487053 690045714 691577673 692801237 693969846
1839.7 693969846 695431113 696911752 697941124 698782802 699853241 701078355 702115476 702951550 703901291
1858 703901291 705043316 706048965 706827223 707701862 708743811 709597886 710146725 710738122 711628616
1876.4 711628616 712646246 713438094 714077175 714939475 716053843 716985047 717534661 718161047 719091177
1894.7 719091177 719945252 720473170 720976174 721741378 722550333 723055243 723382413 723918319 724628925 725199878
1915.1 725199878 725545168 725956917 726582170 727088809 727318048 727623165 728209615 728761017 728972316 729084373
1935.5 729084373 729525149 730162621 730505288 730542898 730773866 731275797 731649101 731788456 732049108 732613087
1955.9G32613087N00083J84178J92463N07653N37694J98543O6697L24726M98474K91705
1976.3G35915303O0499J74463M13358L16620M1306Q8394L63767L37183K5153m7147
1996.7G37688899K08259L28660N2452j74523k6881J54137N663k41399k24710o9856
2017.1G37700701j32621l79145l94702j55568q5592l16858m46082k66790r5367k10405
2037.5G35217571l84629k98678j08958r8884k38895k11418K0623J11640n3346j41859
2057.9G33813167O1333K47776J24753o4552L3379K31921J74523l3737k9981J58906
2078.3G34717488J99437J9968o6161J14798K56181J43826O0J03414K92778K42889N2809
2100.7G36077487O3539K61664L02375R3460k3008J63079L14116J61767k1755O6697
$$ plain form
1955.9 732613087 733113170 733297348 733489811 733997464 734535158 734733701 734800398 735125124 735623598 735915303
1976.3 735915303 735975802 736150265 736563623 736880243 736921549 737009943 737373710 737710893 737736046 737688899
1996.7 737688899 737897158 738225818 738278270 738103747 738076866 738231003 738236666 737995267 737770557 737700701
2017.1 737700701 737568080 737188935 736794233 736638665 736553073 736236215 735790133 735523343 735427976 735217571
2037.5 735217571 734832942 734534264 734425306 734326422 734087527 733876109 733896732 734008372 733955026 733813167
2057.9 733813167 733874500 734122276 734247029 734182477 734215856 734447777 734622300 734588563 734558582 734717488
2078.3 734717488 734916925 734936893 734870732 734985530 735241711 735385537 735385597 735489011 735781789 736024678 736077487
2100.7 736077487 736141026 736402690 736705065 736798525 736775517 736938596 737252712 737414479 737392724 737459421
2121.1G37459421K33054J59562k7001J7703K40147K61962O6757j549J73330K72632
2141.5G38856018J10328j0789J32501L02732K58804J24037J39535L00347L58940K60829
2161.9G40833282K42711M18365N58614M71056L64363M68493O25431N73933M20869M29272
2182.3G45406389N62310N64933M01557L61860N20467N86272M54306L47495M07756N16772
2202.7G50130117M83096L24606L08156M81368N41627M07577L38733M24564M67538L45469
2223.1G54252851K23160K81811L91900L16203J36912J47521L19898L28183J51039J16348
2243.5G56665826K49088K74896J38343M0650J17362K14576J72258P8737R1553J57476
2263.9G58200765J21534M3332R2864K26200K27809P9214j3113O6936J62959P3672j18792
$$ plain form
2121.1 737459421 737692475 737852037 737825036 737842739 738082886 738344848 738411605 738410056 738583386 738856018
2141.5 738856018 738966346 738955557 739088058 739390790 739649594 739773631 739913166 740213513 740572453 740833282
2161.9 740833282 741075993 741494358 742052972 742524028 742888391 743356884 743982315 744556248 744977117 745406389
2182.3 745406389 745968699 746533632 746935189 747297049 747817516 748403788 748858094 749205589 749613345 750130117
2202.7 750130117 750613213 750937819 751245975 751727343 752268970 752676547 753015280 753439844 753907382 754252851
2223.1 754252851 754476011 754757822 755149722 755465925 755602837 755750358 756070256 756398439 756549478 756665826
2243.5 756665826 756914914 757189810 757328153 757368803 757486165 757700741 757872999 757951736 758043289 758200765
2263.9 758200765 758322299 758365631 758458495 758684695 758912504 758991718 758978605 759045541 759208500 759282172 759163380
2286.3G59163380j56820n6088p2301k13861k61068j51575r7573k07603l50117m04418
2306.7G57191956l78549l57390l84271m11093m36425n63443o93977o57797m86493l79204
2327.1G52443314m65751n56588m63903l46661l76046m24087l53932j95861R4354L15070
2347.5G49669909J967p03215j230240j270711j117707q12649l50476l9160J20461K90334
2367.9G44558513M51386N53906N30779M41194M53174N06640L99828J60932m4525j56819
2388.3G47855008k81573m65333n58436m96686m47809n25058o05404n74052n24581o03199
2408.7G42772877p27772p04408n98431o42836q05259q54671p83682p66456q64029r19163
2429.1G35106170q21531p16924q02756r69886r54211q24630q33810r58502r58085q32617
$$ plain form
2286.3 759163380 759006560 758950472 758878171 758664310 758403242 758251667 758154094 757946491 757596374 757191956
2306.7 757191956 756813407 756456017 756071746 755660653 755224228 754660785 753966808 753309011 752822518 752443314
2327.1 752443314 751977563 751420975 750957072 750610411 750234365 749810278 749456346 749260485 749354839 749669909
2347.5 749669909 749671876 748968661 747738421 746467710 745350003 744537354 744186878 744147718 744268179 744558513
2367.9 744558513 745009899 745563805 746094584 746535778 746988952 747495592 747895420 748056352 748011827 747855008
2388.3 747855008 747573435 747108102 746549666 746052980 745605171 745080113 744474709 743900657 743376076 742772877
2408.7 742772877 742045105 741340697 740742266 740099430 739294171 738439500 737655818 736889362 736025333 735106170
2429.1 735106170 734284639 733567715 732764959 731795073 730840862 730016232 729182422 728223920 727265835 726433218
2449.5G26433218q12114r28521r69946q51572p62820q45611r52423q87155p66218p96855
2469.9G17859983r16838r30608q27312q13663r27687r33408p88510p31409q32260r06586
2490.3G09251702q26240p14838p52330q61824q17835o61552o50942p89643q25941o98388
2510.7G01652169o65128q20577r00746p89165o87659p64608r05335q92401p83145q13604
2531.1F93629801r54091r85086q80420q17538r01222r86874r25183q42214q90672r57549
2551.5F84488952q85248p77304q09789r12785r25422q39174p93099q58188q81314p84338
2571.9F76022291p62403q73864r23216q69155q18908q43763r10223q78870p70808p62879
2592.3F67608202q48473q64744q14199q24750r20415r92834r85801r81629j041830
$$ plain form
2449.5 726433218 725621104 724692583 723722637 722871065 722108245 721262634 720310211 719423056 718656838 717859983
2469.9 717859983 716943145 716012537 715185225 714371562 713443875 712510467 711721957 710990548 710158288 709251702
2490.3 709251702 708425462 707710624 706958294 706096470 705278635 704617083 703966141 703176498 702350557 701652169
2510.7 701652169 700987041 700166464 699265718 698476553 697788894 697024286 696118951 695226550 694443405 693629801
2531.1 693629801 692675710 691690624 690810204 689992666 689091444 688104570 687179387 686337173 685446501 684488952
2551.5 684488952 683603704 682826400 682016611 681103826 680178404 679339230 678546131 677687943 676806629 676022291
2571.9 676022291 675259888 674386024 673462808 672593653 671774745 670930982 670020759 669141889 668371081 667608202
2592.3 667608202 666759729 665894985 665080786 664256036 663335621 662342787 661356986 660375357 659333527
2610.6F59333527j134932j198351j228750j265049j314938j332283j323342j366020
2626.9F49169862j444518j482010j485884j505375j527250j521647j483083j453876
2643.3F37266219j461685j487792j527965j525998j475453j456082j472712j484096
2659.6F25374436j462280j433432j436770j434207j405418j371920j343072j330912
2675.9F14156425j330495j313329j269161j241327j264214j286805j269102j251996
2692.2F03929996j268863j324356j388550j434326j453399j434207j437724j509786
2708.5E92678785j584112j581788j532853j514912j538336j542687j491785j443208
2724.8E80449104j422047j404047j379013j347542j312554j285076j280248j275599
$$ plain form
2610.6 659333527 658198595 657000244 655771494 654506445 653191507 651859224 650535882 649169862
2626.9 649169862 647725344 646243334 644757450 643252075 641724825 640203178 638720095 637266219
2643.3 637266219 635804534 634316742 632788777 631262779 629787326 628331244 626858532 625374436
2659.6 625374436 623912156 622478724 621041954 619607747 618202329 616830409 615487337 614156425
2675.9 614156425 612825930 611512601 610243440 609002113 607737899 606451094 605181992 603929996
2692.2 603929996 602661133 601336777 599948227 598513901 597060502 595626295 594188571 592678785
2708.5 592678785 591094673 589512885 587980032 586465120 584926784 583384097 581892312 580449104
2724.8 580449104 579027057 577623010 576243997 574896455 573583901 572298825 571018577 569742978
2741.2E69742978j267016j262784j239360j210093j221895j259864j250624j190603
2757.5E59840739j154721j163125j189351j206517j199484j216531j290023j364351
2773.8E50056636j374125j377106j455664j544357j577556j611292j684368j758277
2790.1E37673891j784861j786352j841843j934945j998485k020716k045155k126515
2806.4E22135019k204418k230942k283037k365351k427280k481400k536238k601504
2822.7E03004849k715111k861798k969324l070593l264010l518790l797352m198373
2839.1D76609498m836827n651772o462425p064969p149279o477356n146384l605664
2855.4D30214822k459794k041280k284974k981335l809869m418910m582554m225850
$$ plain form
2741.2 569742978 568475962 567213178 565973818 564763725 563541830 562281966 561031342 559840739
2757.5 559840739 558686018 557522893 556333542 555127025 553927541 552711010 551420987 550056636
2773.8 550056636 548682511 547305405 545849741 544305384 542727828 541116536 539432168 537673891
2790.1 537673891 535889030 534102678 532260835 530325890 528327405 526306689 524261534 522135019
2806.4 522135019 519930601 517699659 515416622 513051271 510623991 508142591 505606353 503004849
2822.7 503004849 500289738 497427940 494458616 491388023 488124013 484605223 480807871 476609498
2839.1 476609498 471772671 466120899 459658474 452593505 445444226 438966870 433820486 430214822
2855.4 430214822 427755028 425713748 423428774 420447439 416637570 412218660 407636106 403410256
2871.7D03410256l484517k640427j931756j431227j116365j008213j097262j257837
2888C89442652j415669j629889j898379k142578k352387k553671k797216l147960l570676
2906.4C67934227m015297m489600n038917n607933n880237n675018n137533m332900
2922.7C27756792l251642k046048q68351K77907J404733K478688L464014M218101M557729
2941C37991923M458010L979504L247947K422184J633942J025408P48873R39190J556963
2959.4C58003944K376735L224314M032909M731060N282104N679547N874724N867451
2975.7C95072788N745411N551189N210906M738480M232675L705949L140092K538263
2992D29935753J930178J333266P26491J18286m36813q88318j215458j408755j491935
$$ plain form
2871.7 403410256 399925739 397285312 395353556 393922329 392805964 391797751 390700489 389442652
2888 389442652 388026983 386397094 384498715 382356137 380003750 377450079 374652863 371504903 367934227
2906.4 367934227 363918930 359429330 354390413 348782480 342902243 337227225 332089692 327756792
2922.7 327756792 324505150 322459102 321590751 321868658 323273391 325752079 329216093 333434194 337991923
2941 337991923 342449933 346429437 349677384 352099568 353733510 354758918 355507791 356446981 358003944
2959.4 358003944 360380679 363604993 367637902 372368962 377651066 383330613 389205337 395072788
2975.7 395072788 400818199 406369388 411580294 416318774 420551449 424257398 427397490 429935753
2992 429935753 431865931 433199197 433925688 434043974 433607161 432718843 431503385 430094630 428602695
3010.4D28602695j515507j481176j430273j480192j697063k028108k306938k417713
3026.7D14245725k404124k368510k361297k394289k478451k573520k632737k661407
3043C94371390k662927k693474k748430k744823k747268k782494k761989k658546k500713
3061.4C70070726k343536k225786k086550j911760j808881j767099j695991j596093
3077.7C54635030j543194j544297j489520j353144j236827j155644j084715j083017
3094C44144672j124143j146436j188964j259297j295686j296133j329481j404673j461029
3112.4C32638830j488179j512200j548737j641124j760334j807749j798422j815259
3128.7C19266826j845807j877904j936853j992821k004803k006679k027363k057672
$$ plain form
3010.4 428602695 427087188 425606012 424175739 422695547 420998484 418970376 416663438 414245725
3026.7 414245725 411841601 409473091 407111794 404717505 402239054 399665534 397032797 394371390
3043 394371390 391708463 389014989 386266559 383521736 380774468 377991974 375229985 372571439 370070726
3061.4 370070726 367727190 365501404 363414854 361503094 359694213 357927114 356231123 354635030
3077.7 354635030 353091836 351547539 350058019 348704875 347468048 346312404 345227689 344144672
3094 344144672 343020529 341874093 340685129 339425832 338130146 336834013 335504532 334099859 332638830
3112.4 332638830 331150651 329638451 328089714 326448590 324688256 322880507 321082085 319266826
3128.7 319266826 317421019 315543115 313606262 311613441 309608638 307601959 305574596 303516924
3145C03516924k108246k107739k045244k051979k119840k126395k097130k119035k144038
3163.4B84597278k117277k084314k089262k095968k094418k108067k085030k046377
3179.7B67876565k065897k064377k008408j979053j950324j905262j901686j899481
3196B52102077j850843j791329j747444j712531j665622j619383j587406j580715j604036
3214.3B36942768j596033j551450j523301j525476j546741j554131j539231j560151
3230.7B24546254j608417j647442j699224j752630j785487j810178j839906j865641
3247B10537329j925245k002850k007589j968964j968176k001255k017945j984865j911864
3265.3A92748576j828998j722902j598731j482933j373232j283035j180052j041666
$$ plain form
3145 303516924 301408678 299300939 297255695 295203716 293083876 290957481 288860351 286741316 284597278
3163.4 284597278 282480001 280395687 278306425 276210457 274116039 272007972 269922942 267876565
3179.7 267876565 265810668 263746291 261737883 259758830 257808506 255903244 254001558 252102077
3196 252102077 250251234 248459905 246712461 244999930 243334308 241714925 240127519 238546804 236942768
3214.3 236942768 235346735 233795285 232271984 230746508 229199767 227645636 226106405 224546254
3230.7 224546254 222937837 221290395 219591171 217838541 216053054 214242876 212402970 210537329
3247 210537329 208612084 206609234 204601645 202632681 200664505 198663250 196645305 194660440 192748576
3265.3 192748576 190919578 189196676 187597945 186115012 184741780 183458745 182278693 181237027
3281.6A81237027r23023q23721p24494o05807m77389m13462l53947k32444j52528j44392
3302A76385820j20953o6533k5347j3501M515M6760N6848M7684Q1405Q1867L5166M1485
3326.5A76555216O5208O3032N7816M3228J3486l6523j00046j27256j46210j93328j93685
3348.9A76000938j74850k06486k44409k34648j95295j93983k39745k55167k26856k19926
3369.3A73809573k81051l46273k90021j84760j68502j98603j52558n0634L0726M6998
3389.7A72214895k7641j12862j25229k7761J07825R6634l5003k9132J03027J70320
3410.1A72335073J84521K16842K41742K52559K89679L60042M71830N90682O54474O33344
3430.5A76230788O73145P57203O62103N73978O92695Q30204Q87662Q95291Q77515R45285
$$ plain form
3281.6 181237027 180314004 179490283 178765789 178159982 177682593 177269131 176915184 176682740 176530212 176385820
3302 176385820 176264867 176198334 176172987 176159486 176164001 176210761 176267609 176315293 176396698 176478565 176513731 176555216
3326.5 176555216 176620424 176683456 176741272 176784500 176797986 176761463 176661417 176534161 176387951 176194623 176000938
3348.9 176000938 175826088 175619602 175375193 175140545 174945250 174751267 174511522 174256355 174029499 173809573
3369.3 173809573 173528522 173182249 172892228 172707468 172538966 172340363 172187805 172137171 172167897 172214895
3389.7 172214895 172187254 172074392 171949163 171921402 172029227 172125861 172090858 172061726 172164753 172335073
3410.1 172335073 172519594 172736436 172978178 173230737 173520416 173880458 174352288 174942970 175597444 176230788
3430.5 176230788 176903933 177661136 178323239 178897217 179589912 180420116 181307778 182203069 183080584 184025869
3450.9A84025869J045525J090288J141742J193151J143232J137256J344219J499176
3467.2A93620458J360357J118913J117319J329482J562446J637772J497328J441613
3483.6B04685688J584247J633629J566932J603737J687169J712516J688987J733884
3499.9B17896789J815677J744494J637995J704052J846329J960277J980677J872316
3516.2B32458606J851008J999497K147004K101615K004355K073095K181917K240270
3532.5B49057367K368287K441108K329439K374142K590448K669066K527058K431363
3548.8B68788278K539605K656370K706498K785892K928555L022670L042728L082275
3565.1B91552871L216863L319055L310084L349245L506154L651112L730297L824711
$$ plain form
3450.9 184025869 185071394 186161682 187303424 188496575 189639807 190777063 192121282 193620458
3467.2 193620458 194980815 196099728 197217047 198546529 200108975 201746747 203244075 204685688
3483.6 204685688 206269935 207903564 209470496 211074233 212761402 214473918 216162905 217896789
3499.9 217896789 219712466 221456960 223094955 224799007 226645336 228605613 230586290 232458606
3516.2 232458606 234309614 236309111 238456115 240557730 242562085 244635180 246817097 249057367
3532.5 249057367 251425654 253866762 256196201 258570343 261160791 263829857 266356915 268788278
3548.8 268788278 271327883 273984253 276690751 279476643 282405198 285427868 288470596 291552871
3565.1 291552871 294769734 298088789 301398873 304748118 308254272 311905384 315635681 319460392
3581.5C19460392L971547M073888L989458L934562M042477M182726M301816M420579
3597.8C52377445M456847M406244M423231M474193M551053M651725M747093M804849
3614.1C88892680M803718M857748M906327M747599M707068M892141M991800M876256
3630.4D27675337M785955M908055M947573M822760M766971M844666M935533M961431
3646.7D66648281M888802M626960M402220M358530M408121M410863M292667M154504
3663E02190948M150569M162550L970861L794969L785312L465831L072441L054678L054917
3681.4E34703076L171265L438830L443420K833009K281547K331376K447605K411723
3697.7E57061851K296627K104520K074957K272249K305686J991510J461447J438737
$$ plain form
3581.5 319460392 323431939 327505827 331495285 335429847 339472324 343655050 347956866 352377445
3597.8 352377445 356834292 361240536 365663767 370137960 374689013 379340738 384087831 388892680
3614.1 388892680 393696398 398554146 403460473 408208072 412915140 417807281 422799081 427675337
3630.4 427675337 432461292 437369347 442316920 447139680 451906651 456751317 461686850 466648281
3646.7 466648281 471537083 476164043 480566263 484924793 489332914 493743777 498036444 502190948
3663 502190948 506341517 510504067 514474928 518269897 522055209 525521040 528593481 531648159 534703076
3681.4 534703076 537874341 541313171 544756591 547589600 549871147 552202523 554650128 557061851
3697.7 557061851 559358478 561462998 563537955 565810204 568115890 570107400 571568847 573007584
3714E73007584J756966J828313J729965J559257J322687J109540J371503J852811J931309
3732.4E87469935J533032J013815J033366J575530J597583Q59022J068532J628936
3748.7E97779751R84847N13852J086652J414955J108408Q73864J097619J163542J017452
3767.1F07040942Q88586P65502Q78155J151920J278639R44376O40452P83264P98643
3785.4F15170479P41839Q92997J038432J066446R28224Q99553R14693N10871O04630
3803.8F22768164P98702L96788N75364J129269J135052O89446P46429P24793J44720
3822.1F29108727L82364Q06510Q02994P21872O54697Q68798Q58485K68758J23858M10795
3842.5F35007858N14508P10606J112700J271724K50042q61228R7514R20236Q91327
$$ plain form
3714 573007584 574764550 576592863 578322828 579882085 581204772 582314312 583685815 585538626 587469935
3732.4 587469935 589002967 590016782 591050148 592625678 594223261 595082283 596150815 597779751
3748.7 597779751 598764598 599278450 600365102 601780057 602888465 603762329 604859948 606023490 607040942
3767.1 607040942 607929528 608695030 609573185 610725105 612003744 612948120 613588572 614371836 615170479
3785.4 615170479 615912318 616805315 617843747 618910193 619838417 620737970 621652663 622163534 622768164
3803.8 622768164 623566866 623963654 624539018 625668287 626803339 627492785 628239214 628964007 629108727
3822.1 629108727 629491091 630297601 631100595 631822467 632477164 633345962 634204447 634473205 634597063 635007858
3842.5 635007858 635522366 636232972 637345672 638617396 638867438 638006210 638103724 639023960 639915287
3860.9F39915287O43671M41611N08010L72827J47462L10660L80218N52415O18756M62890
3881.3F44353807N45144K36511O7175M75228L41653J06693M78744P03335M78148K04444
3901.7F47990882k6166r7454J49429L58284L83258M02033L31938J23024Q3745K08616
3922.1F49907589J93655J60158K69652K80857J51038J35660K50220K92897K37465J63258
3942.5F52042449J71899K43008K05100J27137J62303K71440K83420K20001K32875K37644
3962.9F54197276J84357J68919J95444K11716J93774J67191J67251J53780J41680J68085
3983.2F55949473J90497J95741J71066J31249J70946K48611K34425
3997.5F57292008
$$ plain form
3860.9 639915287 640558958 641000569 641508579 641881406 642028868 642339528 642719746 643272161 643890917 644353807
3881.3 644353807 644898951 645135462 645202637 645677865 646019518 646126211 646604955 647308290 647786438 647990882
3901.7 647990882 647964716 647867262 648016691 648374975 648758233 649160266 649492204 649615228 649698973 649907589
3922.1 649907589 650101244 650261402 650531054 650811911 650962949 651098609 651348829 651641726 651879191 652042449
3942.5 652042449 652214348 652457356 652662456 652789593 652951896 653223336 653506756 653726757 653959632 654197276
3962.9 654197276 654381633 654550552 654745996 654957712 655151486 655318677 655485928 655639708 655781388 655949473
3983.2 655949473 656139970 656335711 656506777 656638026 656808972 657057583 657292008
3997.5 657292008
##END=$$ End of the data block
